Pollinator Ontology
type: Ontology
version IRI: EUPH.owl
description: This ontology describes the controlled vocabulary used in the EU Pollinator Hub.
license: https://creativecommons.org/licenses/by/4.0/
contributor: Awad Hassan
contributor: Giles San Martin
contributor: Gregor Sušanj
contributor: Jordan Benrezkallah
contributor: Michael Rubinigg
contributor: Noa Simon Delso
comment: The most recent (but unreleased) version of this ontology can be found official website at https://app.pollinatorhub.eu/ontology
comment: The most recent released version of this ontology can be found on GitLab at https://gitlab.com/bee-life/controlled-vocabulary.
version info: 1.0

occurs in
type: ObjectProperty
IAO_0000118: occurs in

has input
type: ObjectProperty
IAO_0000118: has input

has output
type: ObjectProperty
IAO_0000118: has output

has quality
type: ObjectProperty
has related synonym: has quality

deletion date
type: ObjectProperty
has related synonym: deletion date

partner in
type: ObjectProperty
has related synonym: partner in

subject participant in
type: ObjectProperty
has related synonym: subject participant in

target participant in
type: ObjectProperty
has related synonym: target participant in

realised in
type: ObjectProperty
has related synonym: realised in

towards
type: ObjectProperty
has related synonym: towards

concretises
type: ObjectProperty
has related synonym: concretises
has related synonym: konkretisiert

preceded by
type: ObjectProperty
has related synonym: preceded by

role of
type: ObjectProperty
has related synonym: role of

function of
type: ObjectProperty
has related synonym: function of

has function
type: ObjectProperty
has related synonym: has function

involved in or involved in regulation of
type: ObjectProperty
has related synonym: involved in or involved in regulation of

involved in
type: ObjectProperty
has related synonym: involved in

involved in regulation of
type: ObjectProperty
has related synonym: involved in regulation of

involved in negative regulation of
type: ObjectProperty
has related synonym: involved in negative regulation of

involved in positive regulation of
type: ObjectProperty
has related synonym: involved in positive regulation of

related via localization to
type: ObjectProperty
has related synonym: related via localization to

transports or maintains localization of
type: ObjectProperty
has related synonym: transports or maintains localization of

transports
type: ObjectProperty
has related synonym: transportiert
has related synonym: transports

exports
type: ObjectProperty
has related synonym: exportiert
has related synonym: exports

results in transport to from or in
type: ObjectProperty
has related synonym: results in transport to from or in

has target end location
type: ObjectProperty
has related synonym: has target end location

database cross reference
type: ObjectProperty
has related synonym: Datenbank-Querverweis
has related synonym: database cross reference
has related synonym: database kruisverwijzing
has related synonym: riferimento incrociato del database
has related synonym: référence croisée de base de données

logical macro assertion on a class
type: ObjectProperty
has related synonym: logical macro assertion on a class

taxonomic class assertion
type: ObjectProperty
has related synonym: taxonomic class assertion

present in taxon
type: ObjectProperty
has related synonym: present in taxon

has input
type: ObjectProperty
has related synonym: has input

input of
type: ObjectProperty
has related synonym: input of

causally related to
type: ObjectProperty
has related synonym: causally related to

participates in
type: ObjectProperty
has related synonym: participates in

causal relation between material entity and a process
type: ObjectProperty
has related synonym: causal relation between material entity and a process

output of
type: ObjectProperty
has related synonym: output of

causal agent in process
type: ObjectProperty
has related synonym: causal agent in process

has disposition
type: ObjectProperty
has related synonym: has disposition

composed primarily of
type: ObjectProperty
has related synonym: composed primarily of

relation between physical entity and a process or stage
type: ObjectProperty
has related synonym: relation between physical entity and a process or stage

existence ends during
type: ObjectProperty
has related synonym: existence ends during

existence starts during
type: ObjectProperty
has related synonym: existence starts during

existence starts and ends during
type: ObjectProperty
has related synonym: existence starts and ends during

realises
type: ObjectProperty
has related synonym: realises

ends with
type: ObjectProperty
has related synonym: ends with

disposition of
type: ObjectProperty
has related synonym: disposition of

ends after
type: ObjectProperty
has related synonym: ends after

generically depends on
type: ObjectProperty
has related synonym: generically depends on

existence overlaps
type: ObjectProperty
has related synonym: existence overlaps

has material basis
type: ObjectProperty
has related synonym: has material basis

is substance that treats
type: ObjectProperty
has related synonym: is substance that treats

capable of inhibiting or preventing pathological process
type: ObjectProperty
has related synonym: capable of inhibiting or preventing pathological process

capable of negatively regulating
type: ObjectProperty
has related synonym: capable of negatively regulating

capable of regulating
type: ObjectProperty
has related synonym: capable of regulating

developmentally related to
type: ObjectProperty
has related synonym: developmentally related to

derives from part of
type: ObjectProperty
has related synonym: derives from part of

has role
type: ObjectProperty
has related synonym: has role

denoted by
type: ObjectProperty
has related synonym: denoted by

molecularly interacts with
type: ObjectProperty
has related synonym: molecularly interacts with

results in developmental progression of
type: ObjectProperty
has related synonym: results in developmental progression of

directly regulates activity of
type: ObjectProperty
has related synonym: directly regulates activity of

results in ending of
type: ObjectProperty
has related synonym: results in ending of

see also
type: ObjectProperty
has related synonym: see also
has related synonym: siehe auch
has related synonym: vedi anche
has related synonym: voir aussi
has related synonym: zie ook

denotes
type: ObjectProperty
has related synonym: denotes

in taxon
type: ObjectProperty
has related synonym: in taxon

object property
type: ObjectProperty
type: Class
subclass of: code set
IAO_0000115: An object property collection is a collection of object properties that connect pairs of classes.
has related synonym: object property
IAO_0000118: object property
id: EUPH:6353
IAO_0000117: Michael Rubinigg

is agonist of
type: ObjectProperty
has related synonym: is agonist of

evolutionarily related to
type: ObjectProperty
has related synonym: evolutionarily related to

directly positively regulates activity of
type: ObjectProperty
has related synonym: directly positively regulates activity of
has related synonym: reguliert direkt positiv die Aktivität von

surrounds
type: ObjectProperty
has related synonym: surrounds

has unit
type: ObjectProperty
has related synonym: has unit

surrounded by
type: ObjectProperty
has related synonym: surrounded by

location of
type: ObjectProperty
has related synonym: Standort von
has related synonym: location of

is approximately equivalent to
type: ObjectProperty
has related synonym: is approximately equivalent to

is antagonist of
type: ObjectProperty
has related synonym: is antagonist of

precedes
type: ObjectProperty
has related synonym: precedes

directly negatively regulates activity of
type: ObjectProperty
has related synonym: directly negatively regulates activity of
has related synonym: reguliert die Aktivität von direkt negativ

in described place
type: ObjectProperty
has related synonym: in described place

to taxon
type: ObjectProperty
has related synonym: to taxon

in dataset
type: ObjectProperty
has related synonym: in dataset

name published in ID
type: ObjectProperty
has related synonym: name published in ID
has related synonym: name published in identifier

occurrent part of
type: ObjectProperty
has related synonym: ein, im Laufe der Ziet sich ereignender, sich entfaltender oder entwickelnder Teil von
has related synonym: occurrent part of

interacts with
type: ObjectProperty
has related synonym: interacts with

biotically interacts with
type: ObjectProperty
has related synonym: biotically interacts with

participates in a biotic-biotic interaction with
type: ObjectProperty
has related synonym: participates in a biotic-biotic interaction with

symbiotically interacts with
type: ObjectProperty
has related synonym: symbiotically interacts with

mutualistically interacts with
type: ObjectProperty
has related synonym: mutualistically interacts with

pollinated by
type: ObjectProperty
has related synonym: pollinated by

acquires nutrients from
type: ObjectProperty
has related synonym: acquires nutrients from

eats
type: ObjectProperty
has related synonym: eats

is eaten by
type: ObjectProperty
has related synonym: is eaten by

provides nutrients for
type: ObjectProperty
has related synonym: provides nutrients for

participates in a abiotic-biotic interaction with
type: ObjectProperty
has related synonym: participates in a abiotic-biotic interaction with

visits
type: ObjectProperty
has related synonym: visits

visited by
type: ObjectProperty
has related synonym: visited by

trophically interacts with
type: ObjectProperty
has related synonym: trophically interacts with

kills
type: ObjectProperty
has related synonym: kills

is vector for
type: ObjectProperty
has related synonym: is vector for

is killed by
type: ObjectProperty
has related synonym: is killed by

has vector
type: ObjectProperty
has related synonym: has vector

allelopath of
type: ObjectProperty
has related synonym: allelopath of

interacts with via parasite-host interaction
type: ObjectProperty
has related synonym: interacts with via parasite-host interaction

host of
type: ObjectProperty
has related synonym: host of

has host
type: ObjectProperty
has related synonym: has host

has epiphyte
type: ObjectProperty
has related synonym: has epiphyte

epiphyte of
type: ObjectProperty
has related synonym: epiphyte of

commensually interacts with
type: ObjectProperty
has related synonym: commensually interacts with

pollinates
type: ObjectProperty
has related synonym: pollinates

parasitized by
type: ObjectProperty
has related synonym: parasitized by

parasite of
type: ObjectProperty
has related synonym: parasite of

stem parasite of
type: ObjectProperty
has related synonym: stem parasite of

root parasite of
type: ObjectProperty
has related synonym: root parasite of

parasitoid of
type: ObjectProperty
has related synonym: parasitoid of

obligate parasite of
type: ObjectProperty
has related synonym: obligate parasite of

mesoparasite of
type: ObjectProperty
has related synonym: mesoparasite of

lays eggs in
type: ObjectProperty
has related synonym: lays eggs in

kleptoparasite of
type: ObjectProperty
has related synonym: kleptoparasite of

hemiparasite of
type: ObjectProperty
has related synonym: hemiparasite of

facultative parasite of
type: ObjectProperty
has related synonym: facultative parasite of

endoparasite of
type: ObjectProperty
has related synonym: Endoparasit von
has related synonym: endoparasite of

ectoparasite of
type: ObjectProperty
has related synonym: Ektoparasit von
has related synonym: ectoparasite of

intercellular endoparasite of
type: ObjectProperty
has related synonym: intercellular endoparasite of

intracellular endoparasite of
type: ObjectProperty
has related synonym: intracellular endoparasite of

kleptoparasitized by
type: ObjectProperty
has related synonym: kleptoparasitized by

has parasitoid
type: ObjectProperty
has related synonym: has parasitoid

has mesoparasite
type: ObjectProperty
has related synonym: has mesoparasite

has endoparasite
type: ObjectProperty
has related synonym: has endoparasite

has eggs laid in by
type: ObjectProperty
has related synonym: has eggs laid in by

has ectoparasite
type: ObjectProperty
has related synonym: has ectoparasite

lays eggs on
type: ObjectProperty
has related synonym: lays eggs on

visits flowers of
type: ObjectProperty
has related synonym: visits flowers of

has eggs laid on by
type: ObjectProperty
has related synonym: has eggs laid on by

has flowers visited by
type: ObjectProperty
has related synonym: has flowers visited by

preyed upon by
type: ObjectProperty
has related synonym: preyed upon by

preys on
type: ObjectProperty
has related synonym: preys on

has intracellular endoparasite
type: ObjectProperty
has related synonym: has intracellular endoparasite

has intercellular endoparasite
type: ObjectProperty
has related synonym: has intercellular endoparasite

reservoir host of
type: ObjectProperty
has related synonym: reservoir host of

hyperparasitized by
type: ObjectProperty
has related synonym: hyperparasitized by

has pathogen
type: ObjectProperty
has related synonym: has pathogen

pathogen of
type: ObjectProperty
has related synonym: pathogen of

hyperparasite of
type: ObjectProperty
has related synonym: hyperparasite of

has reservoir host
type: ObjectProperty
has related synonym: has reservoir host

mereotopologically related to
type: ObjectProperty
has related synonym: mereotopologically related to

definition
type: ObjectProperty
has related synonym: Definition
has related synonym: definition

editor note
type: ObjectProperty
has related synonym: editor note
has related synonym: redaktionelle Anmerkung

is indistinguishable from
type: ObjectProperty
has related synonym: is indistinguishable from

functionally related to
type: ObjectProperty
has related synonym: functionally related to

part of
type: ObjectProperty
has related synonym: Bestandteil von
has related synonym: part of

overlaps
type: ObjectProperty
has related synonym: overlaps

in similarity relationship with
type: ObjectProperty
has related synonym: in similarity relationship with

produced by
type: ObjectProperty
has related synonym: produced by

occurs in
type: ObjectProperty
has related synonym: occurs in

has participant
type: ObjectProperty
has related synonym: has participant

has output
type: ObjectProperty
has related synonym: has output

spatially disjoint from
type: ObjectProperty
has related synonym: spatially disjoint from

branching part of
type: ObjectProperty
has related synonym: branching part of

disease relationship
type: ObjectProperty
has related synonym: disease relationship

causal relationship with disease as subject
type: ObjectProperty
has related synonym: causal relationship with disease as subject

disease has basis in
type: ObjectProperty
has related synonym: disease has basis in

disease has basis in dysfunction of
type: ObjectProperty
has related synonym: disease has basis in dysfunction of

produces
type: ObjectProperty
has related synonym: produces
has related synonym: produziert

located in
type: ObjectProperty
has related synonym: gelegen in
has related synonym: located in

subclass of
type: ObjectProperty
has related synonym: Unterklasse von
has related synonym: subclass of

equivalent class
type: ObjectProperty
has related synonym: equivalent class

temporally related to
type: ObjectProperty
has related synonym: temporally related to

member of
type: ObjectProperty
has related synonym: Teil von
has related synonym: member of

has part
type: ObjectProperty
has related synonym: has part

has member
type: ObjectProperty
has related synonym: has member

is unit of
type: ObjectProperty
has related synonym: is unit of

derives from
type: ObjectProperty
has related synonym: derives from

has characteristic
type: ObjectProperty
has related synonym: has characteristic

depends on
type: ObjectProperty
has related synonym: depends on

characteristic of part of
type: ObjectProperty
has related synonym: characteristic of part of

characteristic of
type: ObjectProperty
has related synonym: Eigenschaft von
has related synonym: characteristic of

disease has infectious agent
type: ObjectProperty
has related synonym: Krankheit hat Erreger
has related synonym: disease has infectious agent

disease has feature
type: ObjectProperty
has related synonym: Krankheit hat Merkmal
has related synonym: disease has feature

disease causes dysfunction of
type: ObjectProperty
has related synonym: Krankheit verursacht eine Funktionsstörung der
has related synonym: disease causes dysfunction of

connected to
type: ObjectProperty
has related synonym: connected to
has related synonym: verbunden mit

has subclass
type: ObjectProperty
has related synonym: has subclass

artificially selected from
type: ObjectProperty
has related synonym: artificially selected from

logical macro assertion involving identity
type: ObjectProperty
has related synonym: logical macro assertion involving identity

in approximate one to one relationship with
type: ObjectProperty
has related synonym: in approximate one to one relationship with

logical macro assertion
type: ObjectProperty
has related synonym: logical macro assertion

imports
type: ObjectProperty
has related synonym: importiert
has related synonym: imports

is opposite of
type: ObjectProperty
has related synonym: is opposite of

adjacent to
type: ObjectProperty
has related synonym: adjacent to

quality of
type: ObjectProperty
has related synonym: quality of

update date
type: ObjectProperty
has related synonym: update date

creation date
type: ObjectProperty
has related synonym: creation date

EU regulation 852-2004
type: Class
subclass of: EU regulation
IAO_0000117: Michael Rubinigg
IAO_0000118: Regulation (EC) No 852/2004
id: EUPH:969

enzyme commission number
type: Class
subclass of: chemical identifier
IAO_0000117: Michael Rubinigg
IAO_0000118: EC number
IAO_0000118: Enzyme Commission number
id: EUPH:6213

topic
type: Class
subclass of: https://w3id.org/euph/872
IAO_0000117: Michael Rubinigg
IAO_0000118: topic
id: EUPH:1293

EU regulation
type: Class
subclass of: EU law
IAO_0000117: Michael Rubinigg
IAO_0000118: EU regulation
IAO_0000118: EU-forordning @da
IAO_0000118: EU-förordning @sv
IAO_0000118: Verordnung (EU) @de
IAO_0000118: asetus (EU) @fi
IAO_0000118: määrus (EL) @et
IAO_0000118: nariadenie (EÚ) @sk
IAO_0000118: nařízení (EU) @cs
IAO_0000118: reglamentas (ES) @lt
IAO_0000118: reglamento (UE) @es
IAO_0000118: regolament (UE) @mt
IAO_0000118: regolamento (UE) @it
IAO_0000118: regula (ES) @lv
IAO_0000118: regulament (UE) @ro
IAO_0000118: regulamento (UE) @pt
IAO_0000118: rendelet (EU) @hu
IAO_0000118: rialachán (AE) @ga
IAO_0000118: rozporządzenie (UE) @pl
IAO_0000118: règlement (UE) @fr
IAO_0000118: uredba (EU) @sl
IAO_0000118: uredba EU-a @hr
IAO_0000118: verordening (EU) @nl
IAO_0000118: κανονισμός (ΕE) @el
IAO_0000118: регламент (ЕС) @bg
id: EUPH:398

EU directive
type: Class
subclass of: EU law
IAO_0000117: Michael Rubinigg
IAO_0000118: EU-direktiv @sv
IAO_0000118: Richtlinie (EU) @de
IAO_0000118: directiva (UE) @es
IAO_0000118: directive (EU)
IAO_0000118: directive (UE) @fr
IAO_0000118: directivă (UE) @ro
IAO_0000118: direktiiv (EL) @et
IAO_0000118: direktiivi (EU) @fi
IAO_0000118: direktiv (EU) @da
IAO_0000118: direktiva (EU) @sl
IAO_0000118: direktiva EU-a @hr
IAO_0000118: direktyva (ES) @lt
IAO_0000118: direktīva (ES) @lv
IAO_0000118: diretiva (UE) @pt
IAO_0000118: direttiva (UE) @it
IAO_0000118: dyrektywa (UE) @pl
IAO_0000118: irányelv (EU) @hu
IAO_0000118: richtlijn (EU) @nl
IAO_0000118: smernica (EÚ) @sk
IAO_0000118: směrnice (EU) @cs
IAO_0000118: treoir (AE) @ga
IAO_0000118: οδηγία (EE) @el
IAO_0000118: директива (EC) @bg
id: EUPH:6444

EU law
type: Class
subclass of: https://w3id.org/euph/8186
IAO_0000117: Michael Rubinigg
IAO_0000118: EU law
IAO_0000118: EU-Recht @de
id: EUPH:6787

symptom
type: Class
subclass of: quality in veterinary medicine
IAO_0000117: Michael Rubinigg
IAO_0000118: Symptom @de
IAO_0000118: symptom
id: EUPH:1089

disease
type: Class
subclass of: disposition in veterinary medicine
subclass of: Restriction
  on property: disposition of
  some values from: organism
subclass of: Restriction
  on property: disease has infectious agent
  some values from: https://w3id.org/euph/97
IAO_0000117: Michael Rubinigg
IAO_0000118: Krankheit @de
IAO_0000118: boală @ro
IAO_0000118: disease
IAO_0000118: doença @pt
IAO_0000118: enfermedad @es
IAO_0000118: enfermidade @pt
IAO_0000118: maladie @fr
IAO_0000118: malattia @it
IAO_0000118: sjukdom @no
IAO_0000118: sygdom @da
IAO_0000118: sykdom @no
IAO_0000118: ziekte @nl
id: EUPH:106

bacterial disease
type: Class
subclass of: disease
subclass of: Restriction
  on property: disease has infectious agent
  some values from: https://w3id.org/euph/84
IAO_0000117: Michael Rubinigg
IAO_0000118: bacterial disease
IAO_0000118: bakterielle Krankheit @de
id: EUPH:108

fungal disease
type: Class
subclass of: disease
subclass of: Restriction
  on property: disease has infectious agent
  some values from: fungal parasite
IAO_0000117: Michael Rubinigg
IAO_0000118: Mykose @de
IAO_0000118: Pilzkrankheit @de
IAO_0000118: boală micotică @ro
IAO_0000118: fungal disease
IAO_0000118: micose @pt
IAO_0000118: micosi @it
IAO_0000118: micosis @es
IAO_0000118: micoză @ro
IAO_0000118: mycose @fr
IAO_0000118: mycosis
IAO_0000118: mykos @sv
IAO_0000118: mykose @no
IAO_0000118: schimmelziekte @nl
IAO_0000118: soppsjukdom @no
IAO_0000118: svampesygdom @da
IAO_0000118: svampsjukdom @sv
id: EUPH:70

viral disease
type: Class
subclass of: disease
subclass of: Restriction
  on property: disease has infectious agent
  some values from: virus
IAO_0000117: Michael Rubinigg
IAO_0000118: Virenerkrankung @de
IAO_0000118: viral disease
id: EUPH:109

behavioral trait of honey bees
type: Class
subclass of: trait of honey bees
subclass of: Restriction
  on property: realised in
  some values from: https://w3id.org/euph/760
IAO_0000117: Michael Rubinigg
IAO_0000118: Verhaltensmerkmal @de
IAO_0000118: behavioural trait
IAO_0000118: trait comportemental @fr
id: EUPH:7435

reproductive trait of honey bees
type: Class
subclass of: fitness trait of honey bees
subclass of: Restriction
  on property: realised in
  some values from: https://w3id.org/euph/852
IAO_0000117: Michael Rubinigg
IAO_0000118: reproductive trait of honey bees
id: EUPH:1533

defensive behaviour trait of honey bees
type: Class
subclass of: behavioral trait of honey bees
subclass of: Restriction
  on property: realised in
  some values from: defensive behavior of honey bees
IAO_0000117: Michael Rubinigg
IAO_0000118: Friedfertigkeit @de
IAO_0000118: Sanftmut @de
IAO_0000118: aggressivitet @no
IAO_0000118: aggressività @it
IAO_0000118: agressivité @fr
IAO_0000118: bičių piktumas @lt
IAO_0000118: blandetea @ro
IAO_0000118: bodavosť @sk
IAO_0000118: comportamento defensivo @pt
IAO_0000118: comportamiento defensivo @es
IAO_0000118: defensief gedrag @nl
IAO_0000118: defensive behaviour
IAO_0000118: gentleness
IAO_0000118: obrambeno ponašanje @hr
IAO_0000118: obrambno vedenje @sl
IAO_0000118: savunma davranışı @tr
IAO_0000118: zachowanie obronne @pl
IAO_0000118: αμυντική συμπεριφορά @el
IAO_0000118: одбрамбено понашање @sr
IAO_0000118: одбранбено однесување @mk
IAO_0000118: התנהגות הגנתית @he
IAO_0000118: 防御行为 @zh
id: EUPH:904

fitness trait of honey bees
type: Class
subclass of: trait of honey bees
IAO_0000117: Michael Rubinigg
IAO_0000118: Fitnessmerkmal @de
IAO_0000118: fitness trait
IAO_0000118: funktionales Merkmal @de
id: EUPH:7431

type trait of honey bees
type: Class
subclass of: trait of honey bees
IAO_0000117: Michael Rubinigg
IAO_0000118: Typmerkmal @de
IAO_0000118: type trait
id: EUPH:7434

production trait of honey bees
type: Class
subclass of: trait of honey bees
subclass of: Restriction
  on property: realised in
  some values from: apicultural production process
IAO_0000117: Michael Rubinigg
IAO_0000118: Produktionsmerkmal @de
IAO_0000118: production trait
id: EUPH:7432

bee bread
type: Class
subclass of: primary hive product
subclass of: Restriction
  on property: derives from
  some values from: pollen pellet
IAO_0000117: Michael Rubinigg
IAO_0000118: Bienenbrot @de
IAO_0000118: Perga @de
IAO_0000118: bee bread
IAO_0000118: bibrød @da
IAO_0000118: bijenbrood @nl
IAO_0000118: bobröd @sv
IAO_0000118: pain d'abeilles @fr
IAO_0000118: pan de las abejas @es
IAO_0000118: pane delle api @it
IAO_0000118: pão das abelhas @pt
IAO_0000118: păstură @ro
id: EUPH:1164

royal jelly
type: Class
subclass of: primary hive product
subclass of: Restriction
  on property: produced by
  some values from: mandibular gland
subclass of: Restriction
  on property: produced by
  some values from: hypopharyngeal gland
IAO_0000117: Michael Rubinigg
IAO_0000118: Gelée royale @de
IAO_0000118: Königinnenfuttersaft @de
IAO_0000118: bouillie royale @fr
IAO_0000118: dronninggelé @no
IAO_0000118: dronningsfodersaft @da
IAO_0000118: drottningfodersaft @sv
IAO_0000118: drottninggelé @sv
IAO_0000118: gelatina reale @it
IAO_0000118: geleia real @pt
IAO_0000118: gelée royale @fr
IAO_0000118: jale areal @es
IAO_0000118: koninginnemelk @nl
IAO_0000118: koninginnepap @nl
IAO_0000118: koninginnevoedsel @nl
IAO_0000118: lăptișor de matcă @ro
IAO_0000118: papilla real @es
IAO_0000118: pappa reale @it
IAO_0000118: royal jelly
id: EUPH:1161

hive product
type: Class
subclass of: object in beekeeping
IAO_0000117: Michael Rubinigg
IAO_0000118: Bienenprodukt @de
IAO_0000118: hive product
IAO_0000118: prodotto dell'alveare @it
id: EUPH:1129

crop
type: Class
subclass of: role in plant production
subclass of: Restriction
  on property: role of
  some values from: https://www.gbif.org/species/6
IAO_0000117: Michael Rubinigg
IAO_0000118: crop
id: EUPH:2379

ecological space
type: Class
subclass of: immaterial ecological entity
IAO_0000117: Michael Rubinigg
IAO_0000118: site in ecology
id: EUPH:1872

immaterial ecological entity
type: Class
subclass of: https://w3id.org/euph/7723
IAO_0000117: Michael Rubinigg
IAO_0000118: immaterial ecological entity
id: EUPH:1871

relational quality in beekeeping
type: Class
subclass of: https://w3id.org/euph/976
IAO_0000117: Michael Rubinigg
IAO_0000118: relational quality in beekeeping
id: EUPH:1881

dysentery
type: Class
subclass of: symptom on colonies
IAO_0000117: Michael Rubinigg
IAO_0000118: Ruhr @de
IAO_0000118: bugløb @da
IAO_0000118: bukløp @no
IAO_0000118: diarrea @es
IAO_0000118: diarree @ro
IAO_0000118: diarreia @pt
IAO_0000118: disenteria @it
IAO_0000118: disentería @es
IAO_0000118: dizenterie @ro
IAO_0000118: dysenteri @sv
IAO_0000118: dysenterie @fr
IAO_0000118: dysentery
IAO_0000118: roer @nl
IAO_0000118: utsot @sv
id: EUPH:7921

cyantraniliprole
type: Class
subclass of: pyrazole
subclass of: Restriction
  on property: is agonist of
  some values from: insect ryanodine receptor
subclass of: Restriction
  on property: member of
  some values from: anthranilic diamide insecticides [I02_01]
IAO_0000117: Michael Rubinigg
IAO_0000118: CIANTRANILIPROL @es
IAO_0000118: CIANTRANILIPROLAS @lt
IAO_0000118: CIJANTRANILIPROL @hr
IAO_0000118: CIÁNTRANILIPROL @hu
IAO_0000118: CIĀNTRANILIPROLS @lv
IAO_0000118: CYANTRANILIPROL @cs
IAO_0000118: CYANTRANILIPROLE @el
IAO_0000118: CYJANOTRANILIPROL @pl
IAO_0000118: KYANTRANILIPROL @sk
IAO_0000118: SYANTRANIILIPROLI @fi
IAO_0000118: TSÜANTRANILIPROOL @et
IAO_0000118: ĊJANTRANILIPROL @mt
IAO_0000118: ЦИАНТРАНИЛИПРОЛ @bg
id: EUPH:3710
denoted by: 3-bromo-1-(3-chloro-2-pyridinyl)-N-[4-cyano-2-methyl-6-(methylcarbamoyl)phenyl]pyrazole-5-carboxamide
denoted by: 680-242-7
denoted by: 736994-63-1
denoted by: C19H14BrClN6O2
denoted by: I02_01_01
denoted by: RF-00003336-PAR

Axiom
annotated source: cyantraniliprole
annotated property: denoted by
annotated target: 3-bromo-1-(3-chloro-2-pyridinyl)-N-[4-cyano-2-methyl-6-(methylcarbamoyl)phenyl]pyrazole-5-carboxamide
has db xref: preferred IUPAC name (PIN)

Axiom
annotated source: cyantraniliprole
annotated property: denoted by
annotated target: 680-242-7
has db xref: https://w3id.org/euph/8101

Axiom
annotated source: cyantraniliprole
annotated property: denoted by
annotated target: 736994-63-1
has db xref: CAS registry number

Axiom
annotated source: cyantraniliprole
annotated property: denoted by
annotated target: C19H14BrClN6O2
has db xref: molecular formula

Axiom
annotated source: cyantraniliprole
annotated property: denoted by
annotated target: I02_01_01
has db xref: harmonised classification of substances code

Axiom
annotated source: cyantraniliprole
annotated property: denoted by
annotated target: RF-00003336-PAR
has db xref: EFSA DCF term code

sulfoxaflor
type: Class
subclass of: diastereoisomeric mixture
subclass of: Restriction
  on property: member of
  some values from: pyridine insecticides [I99_13]
IAO_0000117: Michael Rubinigg
IAO_0000118: SULFOKSAFLOOR @et
IAO_0000118: SULFOKSAFLOR @hr
IAO_0000118: SULFOKSAFLORAS @lt
IAO_0000118: SULFOKSAFLORI @fi
IAO_0000118: SULFOKSAFLORS @lv
IAO_0000118: SULFOXAFLOR @cs
IAO_0000118: SZULFOXAFLÓR @hu
IAO_0000118: СУЛФОКСАФЛОР @bg
id: EUPH:3778
denoted by: 807-366-8
denoted by: 946578-00-3
denoted by: C10H10F3N3OS
denoted by: CC(C1=CN=C(C=C1)C(F)(F)F)S(=NC#N)(=O)C
denoted by: I99_13_03
denoted by: InChI=1S/C10H10F3N3OS/c1-7(18(2,17)16-6-14)8-3-4-9(15-5-8)10(11,12)13/h3-5,7H,1-2H3
denoted by: RF-00012335-PAR
denoted by: [methyl-oxo-[1-[6-(trifluoromethyl)-3-pyridinyl]ethyl]-λ6-sulfanylidene]cyanamide

Axiom
annotated source: sulfoxaflor
annotated property: denoted by
annotated target: 807-366-8
has db xref: https://w3id.org/euph/8101

Axiom
annotated source: sulfoxaflor
annotated property: denoted by
annotated target: 946578-00-3
has db xref: CAS registry number

Axiom
annotated source: sulfoxaflor
annotated property: denoted by
annotated target: C10H10F3N3OS
has db xref: molecular formula

Axiom
annotated source: sulfoxaflor
annotated property: denoted by
annotated target: CC(C1=CN=C(C=C1)C(F)(F)F)S(=NC#N)(=O)C
has db xref: simplified molecular input line entry system (SMILES)

Axiom
annotated source: sulfoxaflor
annotated property: denoted by
annotated target: I99_13_03
has db xref: harmonised classification of substances code

Axiom
annotated source: sulfoxaflor
annotated property: denoted by
annotated target: InChI=1S/C10H10F3N3OS/c1-7(18(2,17)16-6-14)8-3-4-9(15-5-8)10(11,12)13/h3-5,7H,1-2H3
has db xref: International Chemical Identifier (InChI)

Axiom
annotated source: sulfoxaflor
annotated property: denoted by
annotated target: RF-00012335-PAR
has db xref: EFSA DCF term code

Axiom
annotated source: sulfoxaflor
annotated property: denoted by
annotated target: [methyl-oxo-[1-[6-(trifluoromethyl)-3-pyridinyl]ethyl]-λ6-sulfanylidene]cyanamide
has db xref: preferred IUPAC name (PIN)

flupyradifurone
type: Class
subclass of: chloropyridine
subclass of: Restriction
  on property: member of
  some values from: pyridymethylamine insecticides [I99_14]
IAO_0000117: Michael Rubinigg
IAO_0000118: FLUPIRADIFURON @hr
IAO_0000118: FLUPIRADIFURONA @es
IAO_0000118: FLUPIRADIFURONAS @lt
IAO_0000118: FLUPIRADIFURONS @lv
IAO_0000118: FLUPYRADIFURON @cs
IAO_0000118: FLUPYRADIFURONE @el
IAO_0000118: FLUPYRADIFURONI @fi
IAO_0000118: FLUPYRADIFURÓN @sk
IAO_0000118: FLUPÜRADIFUROON @et
IAO_0000118: ФЛУПИРАДИФУРОН @bg
id: EUPH:3782
denoted by: 3-[(6-chloro-3-pyridinyl)methyl-(2,2-difluoroethyl)amino]-2H-furan-5-one
denoted by: 804-373-8
denoted by: 951659-40-8
denoted by: C12H11ClF2N2O2
denoted by: C1C(=CC(=O)O1)N(CC2=CN=C(C=C2)Cl)CC(F)F
denoted by: I99_14_04
denoted by: RF-00004662-PAR

Axiom
annotated source: flupyradifurone
annotated property: denoted by
annotated target: 3-[(6-chloro-3-pyridinyl)methyl-(2,2-difluoroethyl)amino]-2H-furan-5-one
has db xref: preferred IUPAC name (PIN)

Axiom
annotated source: flupyradifurone
annotated property: denoted by
annotated target: 804-373-8
has db xref: https://w3id.org/euph/8101

Axiom
annotated source: flupyradifurone
annotated property: denoted by
annotated target: 951659-40-8
has db xref: CAS registry number

Axiom
annotated source: flupyradifurone
annotated property: denoted by
annotated target: C12H11ClF2N2O2
has db xref: molecular formula

Axiom
annotated source: flupyradifurone
annotated property: denoted by
annotated target: C1C(=CC(=O)O1)N(CC2=CN=C(C=C2)Cl)CC(F)F
has db xref: simplified molecular input line entry system (SMILES)

Axiom
annotated source: flupyradifurone
annotated property: denoted by
annotated target: I99_14_04
has db xref: harmonised classification of substances code

Axiom
annotated source: flupyradifurone
annotated property: denoted by
annotated target: RF-00004662-PAR
has db xref: EFSA DCF term code

polynucleotide
type: Class
subclass of: information biomacromolecule
IAO_0000117: Michael Rubinigg
IAO_0000118: polynucleotide
id: EUPH:2579

carbohydrate
type: Class
subclass of: organochalcogen compound
IAO_0000117: Michael Rubinigg
IAO_0000118: Kohlehydrat @de
IAO_0000118: carbohidrato @pt
IAO_0000118: carbohydrate
IAO_0000118: carboidrato @it
IAO_0000118: hidrat de carbon @ro
IAO_0000118: hidrato de carbono @es
IAO_0000118: hydrate de carbone @fr
IAO_0000118: idrato di carbonio @it
IAO_0000118: karbohydrat @no
IAO_0000118: kolhydrat @sv
IAO_0000118: koolhydraat @nl
IAO_0000118: kulhydrat @da
id: EUPH:8117

deoxyribonucleic acid (DNA)
type: Class
subclass of: polynucleotide
IAO_0000117: Michael Rubinigg
IAO_0000118: ADN @fr
IAO_0000118: DNA @de
IAO_0000118: DNS @de
IAO_0000118: Desoxyribonukleinsäure @de
IAO_0000118: acide désoxyribonucléique @fr
IAO_0000118: acido desossiribonucleico @it
IAO_0000118: deoxyribonucleic acid
IAO_0000118: desoxyribonucleïnezuur @nl
id: EUPH:2580

oxalic acid
type: Class
subclass of: dicarboxylic acid
subclass of: Restriction
  on property: is substance that treats
  some values from: varroosis of honey bees
IAO_0000117: Michael Rubinigg
IAO_0000118: Oxalsäure @de
IAO_0000118: acide oxalique @fr
IAO_0000118: acido ossalico @it
IAO_0000118: oxaalzuur @nl
IAO_0000118: oxalic acid
id: EUPH:2835
denoted by: 144-62-7
denoted by: 205-634-3
denoted by: C(=O)(C(=O)O)O
denoted by: C2H2O4
denoted by: InChI=1S/C2H2O4/c3-1(4)2(5)6/h(H,3,4)(H,5,6)
denoted by: oxalic acid

Axiom
annotated source: oxalic acid
annotated property: denoted by
annotated target: 144-62-7
has db xref: CAS registry number

Axiom
annotated source: oxalic acid
annotated property: denoted by
annotated target: 205-634-3
has db xref: https://w3id.org/euph/8101

Axiom
annotated source: oxalic acid
annotated property: denoted by
annotated target: C(=O)(C(=O)O)O
has db xref: simplified molecular input line entry system (SMILES)

Axiom
annotated source: oxalic acid
annotated property: denoted by
annotated target: C2H2O4
has db xref: molecular formula

Axiom
annotated source: oxalic acid
annotated property: denoted by
annotated target: InChI=1S/C2H2O4/c3-1(4)2(5)6/h(H,3,4)(H,5,6)
has db xref: International Chemical Identifier (InChI)

Axiom
annotated source: oxalic acid
annotated property: denoted by
annotated target: oxalic acid
has db xref: preferred IUPAC name (PIN)

chitin
type: Class
subclass of: polysaccharide derivative
IAO_0000117: Michael Rubinigg
IAO_0000118: Chitin @de
IAO_0000118: chitin
IAO_0000118: chitina @it
IAO_0000118: chitine @fr
IAO_0000118: chitină @ro
IAO_0000118: kitin @da
IAO_0000118: quitina @es
id: EUPH:925
denoted by: 1398-61-4
denoted by: 215-744-3

Axiom
annotated source: chitin
annotated property: denoted by
annotated target: 1398-61-4
has db xref: CAS registry number

Axiom
annotated source: chitin
annotated property: denoted by
annotated target: 215-744-3
has db xref: https://w3id.org/euph/8101

glucose
type: Class
subclass of: aldohexose
subclass of: Restriction
  on property: has role
  some values from: macronutrient
IAO_0000117: Michael Rubinigg
IAO_0000118: Glukose @de
IAO_0000118: Traubenzucker @de
IAO_0000118: azúcar de uva @es
IAO_0000118: açúcar de uva @pt
IAO_0000118: destrosio @it
IAO_0000118: dextrosa @es
IAO_0000118: dextrose
IAO_0000118: dextroză @ro
IAO_0000118: druesukker @da
IAO_0000118: druivensuiker @nl
IAO_0000118: druvsocker @sv
IAO_0000118: glicose @pt
IAO_0000118: glucosa @es
IAO_0000118: glucose
IAO_0000118: glucosio @it
IAO_0000118: glucoză @ro
IAO_0000118: glukos @sv
IAO_0000118: glukose @da
IAO_0000118: grape sugar
IAO_0000118: sucre de raisin @fr
IAO_0000118: zahăr de struguri @ro
IAO_0000118: zucchero d'uva @it
id: EUPH:8218
denoted by: (3R,4S,5S,6R)-6-(hydroxymethyl)oxane-2,3,4,5-tetrol
denoted by: 1S/C6H12O6/c7-1-3(9)5(11)6(12)4(10)2-8/h1,3-6,8-12H,2H2/t3-,4+,5+,6+/m0/s1
denoted by: 200-075-1
denoted by: 50-99-7
denoted by: C6H12O6
denoted by: C@H(C@ @ho

Axiom
annotated source: glucose
annotated property: denoted by
annotated target: (3R,4S,5S,6R)-6-(hydroxymethyl)oxane-2,3,4,5-tetrol
has db xref: preferred IUPAC name (PIN)

Axiom
annotated source: glucose
annotated property: denoted by
annotated target: 1S/C6H12O6/c7-1-3(9)5(11)6(12)4(10)2-8/h1,3-6,8-12H,2H2/t3-,4+,5+,6+/m0/s1
has db xref: International Chemical Identifier (InChI)

Axiom
annotated source: glucose
annotated property: denoted by
annotated target: 200-075-1
has db xref: https://w3id.org/euph/8101

Axiom
annotated source: glucose
annotated property: denoted by
annotated target: 50-99-7
has db xref: CAS registry number

Axiom
annotated source: glucose
annotated property: denoted by
annotated target: C6H12O6
has db xref: molecular formula

Axiom
annotated source: glucose
annotated property: denoted by
annotated target: C@H(C@ @ho
has db xref: simplified molecular input line entry system (SMILES)

organohalogen compound
type: Class
subclass of: heteroorganic entity
IAO_0000117: Michael Rubinigg
IAO_0000118: organohalogen compound
id: EUPH:4099

sucrose
type: Class
subclass of: disaccharide
subclass of: Restriction
  on property: has role
  some values from: macronutrient
subclass of: Restriction
  on property: derives from
  some values from: https://www.gbif.org/species/8971274
IAO_0000117: Michael Rubinigg
IAO_0000118: Rübenzucker @de
IAO_0000118: Saccharose @de
IAO_0000118: azúcar de remolacha @es
IAO_0000118: açúcar de beterabba @pt
IAO_0000118: beet sugar
IAO_0000118: beetwortelsuiker @nl
IAO_0000118: betsocker @sv
IAO_0000118: bietsuiker @nl
IAO_0000118: roeksukker @da
IAO_0000118: roesukker @no
IAO_0000118: sacarosa @es
IAO_0000118: sacarose @pt
IAO_0000118: saccarosio @it
IAO_0000118: saccharose @da
IAO_0000118: sacharose @nl
IAO_0000118: sacharoza @pl
IAO_0000118: sacharozė @lt
IAO_0000118: sacharóza @cs
IAO_0000118: sackaros @sv
IAO_0000118: saharoza @hr
IAO_0000118: saharoze @lv
IAO_0000118: sahharoos @et
IAO_0000118: sakkaroosi @fi
IAO_0000118: sucre de betterave @fr
IAO_0000118: sucrose
IAO_0000118: sukrożju @mt
IAO_0000118: szacharóz @hu
IAO_0000118: zaharoză @ro
IAO_0000118: zahăr de sfeclă @ro
IAO_0000118: zucchero di barbabietola @it
IAO_0000118: σακχαρόζη @el
IAO_0000118: захароза @bg
id: EUPH:3711
denoted by: (2R,3R,4S,5S,6R)-2-[(2S,3S,4S,5R)-3,4-dihydroxy-2,5-bis(hydroxymethyl)oxolan-2-yl]oxy-6-(hydroxymethyl)oxane-3,4,5-triol
denoted by: 200-334-9
denoted by: 57-50-1
denoted by: C([C@@H]1C @ho
denoted by: C12H22O11
denoted by: InChI=1S/C12H22O11/c13-1-4-6(16)8(18)9(19)11(21-4)23-12(3-15)10(20)7(17)5(2-14)22-12/h4-11,13-20H,1-3H2/t4-,5-,6-,7-,8+,9-,10+,11-,12+/m1/s1

Axiom
annotated source: sucrose
annotated property: denoted by
annotated target: (2R,3R,4S,5S,6R)-2-[(2S,3S,4S,5R)-3,4-dihydroxy-2,5-bis(hydroxymethyl)oxolan-2-yl]oxy-6-(hydroxymethyl)oxane-3,4,5-triol
has db xref: preferred IUPAC name (PIN)

Axiom
annotated source: sucrose
annotated property: denoted by
annotated target: 200-334-9
has db xref: https://w3id.org/euph/8101

Axiom
annotated source: sucrose
annotated property: denoted by
annotated target: 57-50-1
has db xref: CAS registry number

Axiom
annotated source: sucrose
annotated property: denoted by
annotated target: C([C@@H]1C @ho
has db xref: simplified molecular input line entry system (SMILES)

Axiom
annotated source: sucrose
annotated property: denoted by
annotated target: C12H22O11
has db xref: molecular formula

Axiom
annotated source: sucrose
annotated property: denoted by
annotated target: InChI=1S/C12H22O11/c13-1-4-6(16)8(18)9(19)11(21-4)23-12(3-15)10(20)7(17)5(2-14)22-12/h4-11,13-20H,1-3H2/t4-,5-,6-,7-,8+,9-,10+,11-,12+/m1/s1
has db xref: International Chemical Identifier (InChI)

lipid
type: Class
subclass of: organic molecular entity
IAO_0000117: Michael Rubinigg
IAO_0000118: Lipid @de
IAO_0000118: lipid
id: EUPH:6261

hexose
type: Class
subclass of: monosaccharide
IAO_0000117: Michael Rubinigg
IAO_0000118: Hexose @de
IAO_0000118: hexose
id: EUPH:8214

polysaccharide
type: Class
subclass of: carbohydrate
IAO_0000117: Michael Rubinigg
IAO_0000118: polysaccharide
id: EUPH:1283

acaricide
type: Class
subclass of: pesticide
subclass of: Restriction
  on property: results in ending of
  some values from: https://w3id.org/euph/81
IAO_0000117: Michael Rubinigg
IAO_0000118: Akarizid @de
IAO_0000118: acaricide
id: EUPH:680

carbamate ester
type: Class
subclass of: carboxylic ester
IAO_0000117: Michael Rubinigg
IAO_0000118: carbamate ester
id: EUPH:6541

carbon oxide
type: Class
subclass of: organooxygen compound
IAO_0000117: Michael Rubinigg
IAO_0000118: carbon oxide
id: EUPH:8120

chlorobenzene
type: Class
subclass of: organochlorine compound
IAO_0000117: Michael Rubinigg
IAO_0000118: chlorobenzene
id: EUPH:7262

molecular entity
type: Class
subclass of: chemical entity
IAO_0000117: Michael Rubinigg
IAO_0000118: molecular entity
id: EUPH:8119

diazole
type: Class
subclass of: azole
IAO_0000117: Michael Rubinigg
IAO_0000118: diazole
id: EUPH:4027

dichlorobenzene
type: Class
subclass of: chlorobenzene
IAO_0000117: Michael Rubinigg
IAO_0000118: dichlorobenzene
id: EUPH:6617

fatty alcohol
type: Class
subclass of: fatty acid derivative
IAO_0000117: Michael Rubinigg
IAO_0000118: Fettalkohol @de
IAO_0000118: fatty alcohol
id: EUPH:6895

furan
type: Class
subclass of: organic heteromonocyclic compound
IAO_0000117: Michael Rubinigg
IAO_0000118: furan
id: EUPH:6351

chemical entity
type: Class
subclass of: object in chemistry
IAO_0000117: Michael Rubinigg
IAO_0000118: chemical entity
id: EUPH:2290

guanidine
type: Class
subclass of: organonitrogen compound
IAO_0000117: Michael Rubinigg
IAO_0000118: guanidine
id: EUPH:4158

herbicide
type: Class
subclass of: pesticide
IAO_0000117: Michael Rubinigg
IAO_0000118: Herbizid @de
IAO_0000118: Unkrautvertilgungsmittel @de
IAO_0000118: erbicida @it
IAO_0000118: herbicid @da
IAO_0000118: herbicida @es
IAO_0000118: herbicide
IAO_0000118: ierbicid @ro
IAO_0000118: ogräsbekämpningsmedel @sv
IAO_0000118: onkruidbestrijdingsmiddel @nl
IAO_0000118: ugressdreper @no
IAO_0000118: ukrudtsmiddel @da
IAO_0000118: weed-killer
id: EUPH:672

organic heterocyclic compound
type: Class
subclass of: heteroorganic entity
IAO_0000117: Michael Rubinigg
IAO_0000118: organic heterocyclic compound
id: EUPH:6373

insecticide
type: Class
subclass of: pesticide
subclass of: Restriction
  on property: results in ending of
  some values from: insect parasite
IAO_0000117: Michael Rubinigg
IAO_0000118: Insektizid @de
IAO_0000118: insectendodend middel @nl
IAO_0000118: insecticid @ro
IAO_0000118: insecticida @es
IAO_0000118: insecticide
IAO_0000118: insekt-drepende middel @no
IAO_0000118: insektbekæmpelsesmiddel @da
IAO_0000118: insektdödande medel @sv
IAO_0000118: insekticid @da
IAO_0000118: insektmiddel @no
IAO_0000118: insetticida @it
id: EUPH:662

isoprenoid
type: Class
subclass of: organic molecular entity
IAO_0000117: Michael Rubinigg
IAO_0000118: Isoprenoid @de
IAO_0000118: isoprenoid
id: EUPH:8191

ketohexose
type: Class
subclass of: hexose
IAO_0000117: Michael Rubinigg
IAO_0000118: Ketohexose @de
IAO_0000118: ketohexose
id: EUPH:8216

lactone
type: Class
subclass of: carboxylic ester
IAO_0000117: Michael Rubinigg
IAO_0000118: lactone
id: EUPH:6605

methyl ester
type: Class
subclass of: carboxylic ester
IAO_0000117: Michael Rubinigg
IAO_0000118: methyl ester
id: EUPH:6483

monocarboxylic acid
type: Class
subclass of: carboxylic acid
IAO_0000117: Michael Rubinigg
IAO_0000118: Monocarbonsäure @de
IAO_0000118: monocarboxylic acid
id: EUPH:8200

monoterpenoid
type: Class
subclass of: terpenoid
IAO_0000117: Michael Rubinigg
IAO_0000118: Monoterpenoid @de
IAO_0000118: monoterpenoid
id: EUPH:8193

pyridinecarboxamide
type: Class
subclass of: pyridine
IAO_0000117: Michael Rubinigg
IAO_0000118: pyridinecarboxamide
id: EUPH:7179

organic heteromonocyclic compound
type: Class
subclass of: organic heterocyclic compound
IAO_0000117: Michael Rubinigg
IAO_0000118: organic heteromonocyclic compound
IAO_0000118: organische heteromonocyclische Verbindung @de
id: EUPH:8213

ether
type: Class
subclass of: organooxygen compound
IAO_0000117: Michael Rubinigg
IAO_0000118: ether
id: EUPH:6898

organic phosphate
type: Class
subclass of: organophosphorus compound
IAO_0000117: Michael Rubinigg
IAO_0000118: organic phosphate
id: EUPH:6423

organophosphorus compound
type: Class
subclass of: heteroorganic entity
IAO_0000117: Michael Rubinigg
IAO_0000118: organophosphorus compound
id: EUPH:7238

pesticide
type: Class
subclass of: role in pharmacology
subclass of: Restriction
  on property: role of
  some values from: chemical entity
IAO_0000117: Michael Rubinigg
IAO_0000118: Pestizid @de
IAO_0000118: pestcide
id: EUPH:8103

pyrazole
type: Class
subclass of: diazole
IAO_0000117: Michael Rubinigg
IAO_0000118: pyrazole
id: EUPH:4001

pyridine
type: Class
subclass of: organonitrogen heterocyclic compound
IAO_0000117: Michael Rubinigg
IAO_0000118: Pyridin @de
IAO_0000118: piridina @it
IAO_0000118: pyridine
id: EUPH:6598

terpenoid
type: Class
subclass of: isoprenoid
IAO_0000117: Michael Rubinigg
IAO_0000118: Terpenoid @de
IAO_0000118: terpenoid
IAO_0000118: terpénoïde @fr
id: EUPH:8192

micronutrient
type: Class
subclass of: nutrient
IAO_0000117: Michael Rubinigg
IAO_0000118: Mikronährstoff @de
IAO_0000118: micronutrient
id: EUPH:1241

trisaccharide
type: Class
subclass of: oligosaccharide
IAO_0000117: Michael Rubinigg
IAO_0000118: trisaccharide
id: EUPH:6355

thymol
type: Class
subclass of: monoterpenoid
subclass of: Restriction
  on property: is substance that treats
  some values from: varroosis of honey bees
IAO_0000117: Michael Rubinigg
IAO_0000118: Thymol @de
IAO_0000118: thymol
IAO_0000118: timol @es
IAO_0000118: timolo @it
IAO_0000118: tymol @da
id: EUPH:8188
denoted by: 1S/C10H14O/c1-7(2)9-5-4-8(3)6-10(9)11/h4-7,11H,1-3H3
denoted by: 201-944-8
denoted by: 89-83-8
denoted by: C10H14O
denoted by: CC1=CC(=C(C=C1)C(C)C)O

Axiom
annotated source: thymol
annotated property: denoted by
annotated target: 1S/C10H14O/c1-7(2)9-5-4-8(3)6-10(9)11/h4-7,11H,1-3H3
has db xref: International Chemical Identifier (InChI)

Axiom
annotated source: thymol
annotated property: denoted by
annotated target: 201-944-8
has db xref: https://w3id.org/euph/8101

Axiom
annotated source: thymol
annotated property: denoted by
annotated target: 89-83-8
has db xref: CAS registry number

Axiom
annotated source: thymol
annotated property: denoted by
annotated target: C10H14O
has db xref: molecular formula

Axiom
annotated source: thymol
annotated property: denoted by
annotated target: CC1=CC(=C(C=C1)C(C)C)O
has db xref: simplified molecular input line entry system (SMILES)

starch
type: Class
subclass of: glucan
subclass of: Restriction
  on property: has role
  some values from: macronutrient
IAO_0000117: Michael Rubinigg
IAO_0000118: Stärke @de
IAO_0000118: almidón @es
IAO_0000118: amido @it
IAO_0000118: amidon @fr
IAO_0000118: starch
IAO_0000118: stivelse @da
IAO_0000118: stärkelse @sv
IAO_0000118: zetmeel @nl
id: EUPH:1286
denoted by: 232-679-6
denoted by: 9005-25-8

Axiom
annotated source: starch
annotated property: denoted by
annotated target: 232-679-6
has db xref: https://w3id.org/euph/8101

Axiom
annotated source: starch
annotated property: denoted by
annotated target: 9005-25-8
has db xref: CAS registry number

fructose
type: Class
subclass of: ketohexose
subclass of: Restriction
  on property: has role
  some values from: macronutrient
IAO_0000117: Michael Rubinigg
IAO_0000118: Fruchtzucker @de
IAO_0000118: Fruktose @de
IAO_0000118: Lävulose @de
IAO_0000118: azúcar de frutas @es
IAO_0000118: açúcar de frutas @pt
IAO_0000118: fructosa @es
IAO_0000118: fructose
IAO_0000118: fructoză @ro
IAO_0000118: frugtsukker @da
IAO_0000118: fruit sugar
IAO_0000118: fruktos @sv
IAO_0000118: fruktose @da
IAO_0000118: fruktsocker @sv
IAO_0000118: fruktsukker @no
IAO_0000118: frutose @pt
IAO_0000118: fruttosio @it
IAO_0000118: laevulose
IAO_0000118: levulosa @es
IAO_0000118: levulose @pt
IAO_0000118: levulosio @it
IAO_0000118: levuloză @ro
IAO_0000118: lævulose @da
IAO_0000118: lévulose @fr
IAO_0000118: sucre de fruit @fr
IAO_0000118: vruchtensuiker @nl
IAO_0000118: zucchero di frutta @it
id: EUPH:8217
denoted by: (3S,4R,5R)-2-(hydroxymethyl)oxane-2,3,4,5-tetrol
denoted by: 1S/C6H12O6/c7-1-3(9)5(11)6(12)4(10)2-8/h3,5-9,11-12H,1-2H2/t3-,5-,6-/m1/s1
denoted by: 200-333-3
denoted by: 57-48-7
denoted by: C6H12O6
denoted by: C@H(C@ @ho

Axiom
annotated source: fructose
annotated property: denoted by
annotated target: (3S,4R,5R)-2-(hydroxymethyl)oxane-2,3,4,5-tetrol
has db xref: preferred IUPAC name (PIN)

Axiom
annotated source: fructose
annotated property: denoted by
annotated target: 1S/C6H12O6/c7-1-3(9)5(11)6(12)4(10)2-8/h3,5-9,11-12H,1-2H2/t3-,5-,6-/m1/s1
has db xref: International Chemical Identifier (InChI)

Axiom
annotated source: fructose
annotated property: denoted by
annotated target: 200-333-3
has db xref: https://w3id.org/euph/8101

Axiom
annotated source: fructose
annotated property: denoted by
annotated target: 57-48-7
has db xref: CAS registry number

Axiom
annotated source: fructose
annotated property: denoted by
annotated target: C6H12O6
has db xref: molecular formula

Axiom
annotated source: fructose
annotated property: denoted by
annotated target: C@H(C@ @ho
has db xref: simplified molecular input line entry system (SMILES)

azadirachtin A
type: Class
subclass of: azadirachtin
subclass of: Restriction
  on property: member of
  some values from: botanical insecticides [I05_02]
IAO_0000117: Michael Rubinigg
IAO_0000118: ASADIRAKTIIN @et
IAO_0000118: ATSADIRAKTIINI @fi
IAO_0000118: AZADIRACHTIN @cs
IAO_0000118: AZADIRACHTINAS @lt
IAO_0000118: AZADIRACHTINE @fr
IAO_0000118: AZADIRACHTYNA @pl
IAO_0000118: AZADIRACHTÍN @sk
IAO_0000118: AZADIRACTINA @it
IAO_0000118: AZADIRACTINĂ @ro
IAO_0000118: AZADIRACTÍN @es
IAO_0000118: AZADIRAHTIN @hr
IAO_0000118: AZADIRAKTIN @sv
IAO_0000118: AZADIRAKTĪNS @lv
IAO_0000118: AŻADIRAKTIN @mt
IAO_0000118: АЗАДИРАХТИН @bg
id: EUPH:3745
denoted by: 11141-17-6
denoted by: 601-089-4
denoted by: C/C=C(\C)/C(=O)O[C@H]1CC @hoc
denoted by: C35H44O16
denoted by: I05_02_03
denoted by: InChI=1S/C35H44O16/c1-8-15(2)24(38)49-18-12-19(48-16(3)36)32(26(39)43-6)13-46-21-22(32)31(18)14-47-34(42,27(40)44-7)25(31)29(4,23(21)37)35-20-11-17(30(35,5)51-35)33(41)9-10-45-28(33)50-20/h8-10,17-23,25,28,37,41-42H,11-14H2,1-7H3/b15-8+/t17-,18+,19-,20+,21-,22-,23-,25+,28+,29-,30+,31+,32+,33+,34+,35+/m1/s1
denoted by: RF-0030-001-PPP
denoted by: dimethyl (1S,4S,5R,6S,7S,8R,11S,12R,14S,15R)-12-acetyloxy-4,7-dihydroxy-6-[(1S,2S,6S,8S,9R,11S)-2-hydroxy-11-methyl-5,7,10-trioxatetracyclo[6.3.1.02,6.09,11]dodec-3-en-9-yl]-6-methyl-14-[(E)-2-methylbut-2-enoyl]oxy-3,9-dioxatetracyclo[6.6.1.01,5.011,15]pentadecane-4,11-dicarboxylate

Axiom
annotated source: azadirachtin A
annotated property: denoted by
annotated target: 11141-17-6
has db xref: CAS registry number

Axiom
annotated source: azadirachtin A
annotated property: denoted by
annotated target: 601-089-4
has db xref: https://w3id.org/euph/8101

Axiom
annotated source: azadirachtin A
annotated property: denoted by
annotated target: C/C=C(\C)/C(=O)O[C@H]1CC @hoc
has db xref: simplified molecular input line entry system (SMILES)

Axiom
annotated source: azadirachtin A
annotated property: denoted by
annotated target: C35H44O16
has db xref: molecular formula

Axiom
annotated source: azadirachtin A
annotated property: denoted by
annotated target: I05_02_03
has db xref: harmonised classification of substances code

Axiom
annotated source: azadirachtin A
annotated property: denoted by
annotated target: InChI=1S/C35H44O16/c1-8-15(2)24(38)49-18-12-19(48-16(3)36)32(26(39)43-6)13-46-21-22(32)31(18)14-47-34(42,27(40)44-7)25(31)29(4,23(21)37)35-20-11-17(30(35,5)51-35)33(41)9-10-45-28(33)50-20/h8-10,17-23,25,28,37,41-42H,11-14H2,1-7H3/b15-8+/t17-,18+,19-,20+,21-,22-,23-,25+,28+,29-,30+,31+,32+,33+,34+,35+/m1/s1
has db xref: International Chemical Identifier (InChI)

Axiom
annotated source: azadirachtin A
annotated property: denoted by
annotated target: RF-0030-001-PPP
has db xref: EFSA DCF term code

Axiom
annotated source: azadirachtin A
annotated property: denoted by
annotated target: dimethyl (1S,4S,5R,6S,7S,8R,11S,12R,14S,15R)-12-acetyloxy-4,7-dihydroxy-6-[(1S,2S,6S,8S,9R,11S)-2-hydroxy-11-methyl-5,7,10-trioxatetracyclo[6.3.1.02,6.09,11]dodec-3-en-9-yl]-6-methyl-14-[(E)-2-methylbut-2-enoyl]oxy-3,9-dioxatetracyclo[6.6.1.01,5.011,15]pentadecane-4,11-dicarboxylate
has db xref: preferred IUPAC name (PIN)

cyromazine
type: Class
subclass of: triazine
subclass of: Restriction
  on property: member of
  some values from: insect growth regulators [I99_06]
IAO_0000117: Michael Rubinigg
IAO_0000118: CIROMAZIN @hr
IAO_0000118: CIROMAZINA @es
IAO_0000118: CIROMAZINAS @lt
IAO_0000118: CIROMAZĪNS @lv
IAO_0000118: CYROMAZIN @cs
IAO_0000118: CYROMAZINE @el
IAO_0000118: CYROMAZYNA @pl
IAO_0000118: CYROMAZÍN @sk
IAO_0000118: SYROMATSIINI @fi
IAO_0000118: TSÜROMASIIN @et
IAO_0000118: ĊIROMAŻINA @mt
IAO_0000118: ЦИРОМАЗИН @bg
id: EUPH:3766
denoted by: 2-N-cyclopropyl-1,3,5-triazine-2,4,6-triamine
denoted by: 266-257-8
denoted by: 66215-27-8
denoted by: C1CC1NC2=NC(=NC(=N2)N)N
denoted by: C6H10N6
denoted by: I99_06_01
denoted by: InChI=1S/C6H10N6/c7-4-10-5(8)12-6(11-4)9-3-1-2-3/h3H,1-2H2,(H5,7,8,9,10,11,12)
denoted by: RF-0115-001-PPP

Axiom
annotated source: cyromazine
annotated property: denoted by
annotated target: I99_06_01
has db xref: harmonised classification of substances code

Axiom
annotated source: cyromazine
annotated property: denoted by
annotated target: InChI=1S/C6H10N6/c7-4-10-5(8)12-6(11-4)9-3-1-2-3/h3H,1-2H2,(H5,7,8,9,10,11,12)
has db xref: International Chemical Identifier (InChI)

Axiom
annotated source: cyromazine
annotated property: denoted by
annotated target: RF-0115-001-PPP
has db xref: EFSA DCF term code

Axiom
annotated source: cyromazine
annotated property: denoted by
annotated target: 2-N-cyclopropyl-1,3,5-triazine-2,4,6-triamine
has db xref: preferred IUPAC name (PIN)

Axiom
annotated source: cyromazine
annotated property: denoted by
annotated target: 266-257-8
has db xref: https://w3id.org/euph/8101

Axiom
annotated source: cyromazine
annotated property: denoted by
annotated target: 66215-27-8
has db xref: CAS registry number

Axiom
annotated source: cyromazine
annotated property: denoted by
annotated target: C1CC1NC2=NC(=NC(=N2)N)N
has db xref: simplified molecular input line entry system (SMILES)

Axiom
annotated source: cyromazine
annotated property: denoted by
annotated target: C6H10N6
has db xref: molecular formula

formic acid
type: Class
subclass of: monocarboxylic acid
subclass of: Restriction
  on property: is substance that treats
  some values from: varroosis of honey bees
IAO_0000117: Michael Rubinigg
IAO_0000118: Ameisensäure @de
IAO_0000118: Methansäure @de
IAO_0000118: acid formic @ro
IAO_0000118: acide formique @fr
IAO_0000118: acido formico @it
IAO_0000118: formic acid
IAO_0000118: maursyre @no
IAO_0000118: mierenzuur @nl
IAO_0000118: myresyre @da
IAO_0000118: myrsyra @sv
IAO_0000118: ácido fórmico @es
id: EUPH:8201
denoted by: 1S/CH2O2/c2-1-3/h1H,(H,2,3)
denoted by: 200-579-1
denoted by: 64-18-6
denoted by: C(=O)O
denoted by: CH2O2
denoted by: formic acid

Axiom
annotated source: formic acid
annotated property: denoted by
annotated target: 1S/CH2O2/c2-1-3/h1H,(H,2,3)
has db xref: International Chemical Identifier (InChI)

Axiom
annotated source: formic acid
annotated property: denoted by
annotated target: 200-579-1
has db xref: https://w3id.org/euph/8101

Axiom
annotated source: formic acid
annotated property: denoted by
annotated target: 64-18-6
has db xref: CAS registry number

Axiom
annotated source: formic acid
annotated property: denoted by
annotated target: C(=O)O
has db xref: simplified molecular input line entry system (SMILES)

Axiom
annotated source: formic acid
annotated property: denoted by
annotated target: CH2O2
has db xref: molecular formula

Axiom
annotated source: formic acid
annotated property: denoted by
annotated target: formic acid
has db xref: preferred IUPAC name (PIN)

bifenthrin
type: Class
subclass of: cyclopropanecarboxylate ester
subclass of: Restriction
  on property: member of
  some values from: pyrethroid insecticides [I01_01]
IAO_0000117: Michael Rubinigg
IAO_0000118: BIFENTHRIN @cs
IAO_0000118: BIFENTHRINE @fr
IAO_0000118: BIFENTRIIN @et
IAO_0000118: BIFENTRIINI @fi
IAO_0000118: BIFENTRIN @hr
IAO_0000118: BIFENTRINA @it
IAO_0000118: BIFENTRINAS @lt
IAO_0000118: BIFENTRYNA @pl
IAO_0000118: BIFENTRÍN @es
IAO_0000118: BIFENTRĪNS @lv
IAO_0000118: БИФЕНТРИН @bg
id: EUPH:3698
denoted by: 617-373-6
denoted by: 82657-04-3
denoted by: C23H22ClF3O2
denoted by: I01_01_04
denoted by: InChI=1S/C23H22ClF3O2/c1-14-16(10-7-11-17(14)15-8-5-4-6-9-15)13-29-21(28)20-18(22(20,2)3)12-19(24)23(25,26)27/h4-12,18,20H,13H2,1-3H3/b19-12-/t18-,20-/m0/s1
denoted by: RF-0046-001-PPP
denoted by: trans-(2-methyl-3-phenylphenyl)methyl (1R,3R)-3-[(Z)-2-chloro-3,3,3-trifluoroprop-1-enyl]-2,2-dimethylcyclopropane-1-carboxylate

Axiom
annotated source: bifenthrin
annotated property: denoted by
annotated target: 617-373-6
has db xref: https://w3id.org/euph/8101

Axiom
annotated source: bifenthrin
annotated property: denoted by
annotated target: 82657-04-3
has db xref: CAS registry number

Axiom
annotated source: bifenthrin
annotated property: denoted by
annotated target: C23H22ClF3O2
has db xref: molecular formula

Axiom
annotated source: bifenthrin
annotated property: denoted by
annotated target: I01_01_04
has db xref: harmonised classification of substances code

Axiom
annotated source: bifenthrin
annotated property: denoted by
annotated target: InChI=1S/C23H22ClF3O2/c1-14-16(10-7-11-17(14)15-8-5-4-6-9-15)13-29-21(28)20-18(22(20,2)3)12-19(24)23(25,26)27/h4-12,18,20H,13H2,1-3H3/b19-12-/t18-,20-/m0/s1
has db xref: International Chemical Identifier (InChI)

Axiom
annotated source: bifenthrin
annotated property: denoted by
annotated target: RF-0046-001-PPP
has db xref: EFSA DCF term code

Axiom
annotated source: bifenthrin
annotated property: denoted by
annotated target: trans-(2-methyl-3-phenylphenyl)methyl (1R,3R)-3-[(Z)-2-chloro-3,3,3-trifluoroprop-1-enyl]-2,2-dimethylcyclopropane-1-carboxylate
has db xref: preferred IUPAC name (PIN)

nutrient
type: Class
subclass of: role in biology
IAO_0000117: Michael Rubinigg
IAO_0000118: Nährstoff @de
IAO_0000118: nutrient
IAO_0000118: nutriente @it
IAO_0000118: nutriment @fr
IAO_0000118: nutriënt @nl
IAO_0000118: sostanza nutritiva @it
IAO_0000118: voedingsstof @nl
id: EUPH:7750

heteroorganic entity
type: Class
subclass of: organic molecular entity
IAO_0000117: Michael Rubinigg
IAO_0000118: heteroorganic entity
id: EUPH:8211

carboxylic ester
type: Class
subclass of: carbonyl compound
IAO_0000117: Michael Rubinigg
IAO_0000118: carboxylic ester
id: EUPH:6579

carboxylic acid
type: Class
subclass of: organic acid
IAO_0000117: Michael Rubinigg
IAO_0000118: Carbonsäure @de
IAO_0000118: carboxylic acid
id: EUPH:8199

biomacromolecule
type: Class
subclass of: organic molecular entity
IAO_0000117: Michael Rubinigg
IAO_0000118: Biomakromolekül @de
IAO_0000118: biomacromolecule
id: EUPH:8235

information biomacromolecule
type: Class
subclass of: biomacromolecule
IAO_0000117: Michael Rubinigg
IAO_0000118: Informationskodierendes Biomakromolekül @de
IAO_0000118: information biomacromolecule
id: EUPH:8234

aldohexose
type: Class
subclass of: hexose
IAO_0000117: Michael Rubinigg
IAO_0000118: Aldohexose @de
IAO_0000118: aldohexose
id: EUPH:8215

macronutrient
type: Class
subclass of: nutrient
IAO_0000117: Michael Rubinigg
IAO_0000118: Makronährstoff @de
IAO_0000118: macronutrient
id: EUPH:1240

chlorpyrifos
type: Class
subclass of: organic thiophosphate
subclass of: Restriction
  on property: member of
  some values from: organophosphorus insecticides [I04_01]
IAO_0000117: Michael Rubinigg
IAO_0000118: CHLOORPYRIFOS @nl
IAO_0000118: CHLOROPIRYFOS @pl
IAO_0000118: CHLORPIRIFOSAS @lt
IAO_0000118: CHLORPYRIFOS @cs
IAO_0000118: CHLÓRPYRIFOS @sk
IAO_0000118: CLORPIRIFOS @es
IAO_0000118: HLORPIRIFOSS @lv
IAO_0000118: KLOROPÜRIFOSS @et
IAO_0000118: KLORPIRIFOS @hr
IAO_0000118: KLORPYRIFOS @sv
IAO_0000118: KLORPYRIFOSSI @fi
IAO_0000118: KLÓRPIRIFOSZ @hu
IAO_0000118: ХЛОРПИРИФОС @bg
id: EUPH:3719
denoted by: 220-864-4
denoted by: 2921-88-2
denoted by: C9H11Cl3NO3PS
denoted by: CCOP(=S)(OCC)OC1=NC(=C(C=C1Cl)Cl)Cl
denoted by: I04_01_01
denoted by: RF-0087-001-PPP
denoted by: diethoxy-sulfanylidene-[(3,5,6-trichloro-2-pyridinyl)oxy]-λ5-phosphane

Axiom
annotated source: chlorpyrifos
annotated property: denoted by
annotated target: 220-864-4
has db xref: https://w3id.org/euph/8101

Axiom
annotated source: chlorpyrifos
annotated property: denoted by
annotated target: 2921-88-2
has db xref: CAS registry number

Axiom
annotated source: chlorpyrifos
annotated property: denoted by
annotated target: C9H11Cl3NO3PS
has db xref: molecular formula

Axiom
annotated source: chlorpyrifos
annotated property: denoted by
annotated target: CCOP(=S)(OCC)OC1=NC(=C(C=C1Cl)Cl)Cl
has db xref: simplified molecular input line entry system (SMILES)

Axiom
annotated source: chlorpyrifos
annotated property: denoted by
annotated target: I04_01_01
has db xref: harmonised classification of substances code

Axiom
annotated source: chlorpyrifos
annotated property: denoted by
annotated target: RF-0087-001-PPP
has db xref: EFSA DCF term code

Axiom
annotated source: chlorpyrifos
annotated property: denoted by
annotated target: diethoxy-sulfanylidene-[(3,5,6-trichloro-2-pyridinyl)oxy]-λ5-phosphane
has db xref: preferred IUPAC name (PIN)

chlorpyrifos-methyl
type: Class
subclass of: organic thiophosphate
subclass of: Restriction
  on property: member of
  some values from: organophosphorus insecticides [I04_01]
IAO_0000117: Michael Rubinigg
IAO_0000118: CHLOORPYRIFOS-METHYL @nl
IAO_0000118: CHLOROPIRYFOS METYLU @pl
IAO_0000118: CHLORPYRIFOS-METHYL @cs
IAO_0000118: CHLORPYRIFOS-MÉTHYLE @fr
IAO_0000118: CHLÓRPYRIFOS-METYL @sk
IAO_0000118: CLORPIRIFOS-METIL @ro
IAO_0000118: CLORPIRIFOS-METILE @it
IAO_0000118: CLORPIRIFOS-METILO @es
IAO_0000118: KLORPIRIFOS-METIL @hr
IAO_0000118: KLORPYRIFOSMETYL @sv
IAO_0000118: KLORPYRIFOSSI-METYYLI @fi
IAO_0000118: KLÓRPIRIFOSZ-METIL @hu
IAO_0000118: METILCHLORPIRIFOSAS @lt
IAO_0000118: METILHLORPIRIFOSS @lv
IAO_0000118: METÜÜLKLOROPÜRIFOSS @et
IAO_0000118: ХЛОРПИРИФОС-МЕТИЛ @bg
id: EUPH:3720
denoted by: 227-011-5
denoted by: 5598-13-0
denoted by: C7H7Cl3NO3PS
denoted by: COP(=S)(OC)OC1=NC(=C(C=C1Cl)Cl)Cl
denoted by: I04_01_02
denoted by: InChI=1S/C7H7Cl3NO3PS/c1-12-15(16,13-2)14-7-5(9)3-4(8)6(10)11-7/h3H,1-2H3
denoted by: RF-0088-001-PPP
denoted by: dimethoxy-sulfanylidene-[(3,5,6-trichloro-2-pyridinyl)oxy]-λ5-phosphane

Axiom
annotated source: chlorpyrifos-methyl
annotated property: denoted by
annotated target: 227-011-5
has db xref: https://w3id.org/euph/8101

Axiom
annotated source: chlorpyrifos-methyl
annotated property: denoted by
annotated target: 5598-13-0
has db xref: CAS registry number

Axiom
annotated source: chlorpyrifos-methyl
annotated property: denoted by
annotated target: C7H7Cl3NO3PS
has db xref: molecular formula

Axiom
annotated source: chlorpyrifos-methyl
annotated property: denoted by
annotated target: COP(=S)(OC)OC1=NC(=C(C=C1Cl)Cl)Cl
has db xref: simplified molecular input line entry system (SMILES)

Axiom
annotated source: chlorpyrifos-methyl
annotated property: denoted by
annotated target: I04_01_02
has db xref: harmonised classification of substances code

Axiom
annotated source: chlorpyrifos-methyl
annotated property: denoted by
annotated target: InChI=1S/C7H7Cl3NO3PS/c1-12-15(16,13-2)14-7-5(9)3-4(8)6(10)11-7/h3H,1-2H3
has db xref: International Chemical Identifier (InChI)

Axiom
annotated source: chlorpyrifos-methyl
annotated property: denoted by
annotated target: RF-0088-001-PPP
has db xref: EFSA DCF term code

Axiom
annotated source: chlorpyrifos-methyl
annotated property: denoted by
annotated target: dimethoxy-sulfanylidene-[(3,5,6-trichloro-2-pyridinyl)oxy]-λ5-phosphane
has db xref: preferred IUPAC name (PIN)

diflubenzuron
type: Class
subclass of: monochlorobenzene
subclass of: Restriction
  on property: member of
  some values from: benzoylurea insecticides [I99_03]
IAO_0000117: Michael Rubinigg
IAO_0000118: DIFLUBENSUROON @et
IAO_0000118: DIFLUBENTSURONI @fi
IAO_0000118: DIFLUBENZURON @cs
IAO_0000118: DIFLUBENZURONAS @lt
IAO_0000118: DIFLUBENZURONS @lv
IAO_0000118: DIFLUBENZURÃO @pt
IAO_0000118: DIFLUBENZURÓN @es
IAO_0000118: DIFLUBENŻURON @mt
IAO_0000118: ДИФЛУБЕНЗУРОН @bg
id: EUPH:3758
denoted by: 252-529-3
denoted by: 35367-38-5
denoted by: C14H9ClF2N2O2
denoted by: I99_03_01
denoted by: N-[(4-chlorophenyl)carbamoyl]-2,6-difluorobenzamide
denoted by: RF-0134-001-PPP

Axiom
annotated source: diflubenzuron
annotated property: denoted by
annotated target: 252-529-3
has db xref: https://w3id.org/euph/8101

Axiom
annotated source: diflubenzuron
annotated property: denoted by
annotated target: 35367-38-5
has db xref: CAS registry number

Axiom
annotated source: diflubenzuron
annotated property: denoted by
annotated target: C14H9ClF2N2O2
has db xref: molecular formula

Axiom
annotated source: diflubenzuron
annotated property: denoted by
annotated target: I99_03_01
has db xref: harmonised classification of substances code

Axiom
annotated source: diflubenzuron
annotated property: denoted by
annotated target: N-[(4-chlorophenyl)carbamoyl]-2,6-difluorobenzamide
has db xref: preferred IUPAC name (PIN)

Axiom
annotated source: diflubenzuron
annotated property: denoted by
annotated target: RF-0134-001-PPP
has db xref: EFSA DCF term code

dimethoate
type: Class
subclass of: organic thiophosphate
subclass of: Restriction
  on property: member of
  some values from: organophosphorus insecticides [I04_01]
IAO_0000117: Michael Rubinigg
IAO_0000118: DIMETHOAAT @nl
IAO_0000118: DIMETHOAT @da
IAO_0000118: DIMETHOATE @el
IAO_0000118: DIMETHOÁT @cs
IAO_0000118: DIMETOAAT @et
IAO_0000118: DIMETOAATTI @fi
IAO_0000118: DIMETOAT @hr
IAO_0000118: DIMETOATAS @lt
IAO_0000118: DIMETOATO @es
IAO_0000118: DIMETOÁT @hu
IAO_0000118: DIMETOĀTS @lv
IAO_0000118: DIMÉTHOATE @fr
IAO_0000118: ДИМЕТОАТ @bg
id: EUPH:3721
denoted by: 2-dimethoxyphosphinothioylsulfanyl-N-methylacetamide
denoted by: 200-480-3
denoted by: 60-51-5
denoted by: C5H12NO3PS2
denoted by: CNC(=O)CSP(=S)(OC)OC
denoted by: I04_01_03
denoted by: InChI=1S/C5H12NO3PS2/c1-6-5(7)4-12-10(11,8-2)9-3/h4H2,1-3H3,(H,6,7)
denoted by: RF-0139-003-PPP

Axiom
annotated source: dimethoate
annotated property: denoted by
annotated target: 2-dimethoxyphosphinothioylsulfanyl-N-methylacetamide
has db xref: preferred IUPAC name (PIN)

Axiom
annotated source: dimethoate
annotated property: denoted by
annotated target: 200-480-3
has db xref: https://w3id.org/euph/8101

Axiom
annotated source: dimethoate
annotated property: denoted by
annotated target: 60-51-5
has db xref: CAS registry number

Axiom
annotated source: dimethoate
annotated property: denoted by
annotated target: C5H12NO3PS2
has db xref: molecular formula

Axiom
annotated source: dimethoate
annotated property: denoted by
annotated target: CNC(=O)CSP(=S)(OC)OC
has db xref: simplified molecular input line entry system (SMILES)

Axiom
annotated source: dimethoate
annotated property: denoted by
annotated target: I04_01_03
has db xref: harmonised classification of substances code

Axiom
annotated source: dimethoate
annotated property: denoted by
annotated target: InChI=1S/C5H12NO3PS2/c1-6-5(7)4-12-10(11,8-2)9-3/h4H2,1-3H3,(H,6,7)
has db xref: International Chemical Identifier (InChI)

Axiom
annotated source: dimethoate
annotated property: denoted by
annotated target: RF-0139-003-PPP
has db xref: EFSA DCF term code

organonitrogen compound
type: Class
subclass of: heteroorganic entity
IAO_0000117: Michael Rubinigg
IAO_0000118: organonitrogen compound
id: EUPH:8254

carbohydrazide
type: Class
subclass of: organonitrogen compound
IAO_0000117: Michael Rubinigg
IAO_0000118: carbohydrazide
id: EUPH:6485

monosaccharide
type: Class
subclass of: carbohydrate
IAO_0000117: Michael Rubinigg
IAO_0000118: Einfachzucker @de
IAO_0000118: Monosaccharid @de
IAO_0000118: monosaccharide
id: EUPH:910

aromatic ether
type: Class
subclass of: ether
IAO_0000117: Michael Rubinigg
IAO_0000118: aromatic ether
id: EUPH:4007

thiazolidine
type: Class
subclass of: organic heteromonocyclic compound
IAO_0000117: Michael Rubinigg
IAO_0000118: thiazolidine
id: EUPH:6668

dicarboxylic acid
type: Class
subclass of: carboxylic acid
IAO_0000117: Michael Rubinigg
IAO_0000118: dicarboxylic acid
id: EUPH:2836

hydroxy monocarboxylic acid
type: Class
subclass of: monocarboxylic acid
IAO_0000117: Michael Rubinigg
IAO_0000118: hydroxy monocarboxylic acid
id: EUPH:8221

protein
type: Class
subclass of: information biomacromolecule
subclass of: Restriction
  on property: has role
  some values from: macronutrient
IAO_0000117: Michael Rubinigg
IAO_0000118: Eiweiß @de
IAO_0000118: Protein @de
IAO_0000118: eiwit @nl
IAO_0000118: protein @da
IAO_0000118: proteina @it
IAO_0000118: proteină @ro
IAO_0000118: proteína @es
IAO_0000118: proteïn @nl
IAO_0000118: protéine @fr
IAO_0000118: äggviteämne @sv
IAO_0000118: æggehvidestof @da
id: EUPH:6391

disaccharide
type: Class
subclass of: oligosaccharide
IAO_0000117: Michael Rubinigg
IAO_0000118: disaccharide
id: EUPH:6900

carbonyl compound
type: Class
subclass of: organooxygen compound
IAO_0000117: Michael Rubinigg
IAO_0000118: carbonyl compound
id: EUPH:6576

triterpenoid
type: Class
subclass of: terpenoid
IAO_0000117: Michael Rubinigg
IAO_0000118: triterpenoid
id: EUPH:4324

organochlorine compound
type: Class
subclass of: organohalogen compound
IAO_0000117: Michael Rubinigg
IAO_0000118: organochlorine compound
id: EUPH:6277

organochalcogen compound
type: Class
subclass of: heteroorganic entity
IAO_0000117: Michael Rubinigg
IAO_0000118: Organochalkogen-Verbindung @de
IAO_0000118: organochalcogen compound
id: EUPH:8212

organooxygen compound
type: Class
subclass of: organochalcogen compound
IAO_0000117: Michael Rubinigg
IAO_0000118: organooxygen compound
id: EUPH:6577

glucan
type: Class
subclass of: polysaccharide
IAO_0000117: Michael Rubinigg
IAO_0000118: glucan
id: EUPH:1028

organic thiophosphate
type: Class
subclass of: organic phosphate
IAO_0000117: Michael Rubinigg
IAO_0000118: organic thiophosphate
id: EUPH:4048

triazine
type: Class
subclass of: organonitrogen heterocyclic compound
IAO_0000117: Michael Rubinigg
IAO_0000118: triazine
id: EUPH:6546

methoxyfenozide
type: Class
subclass of: carbohydrazide
subclass of: Restriction
  on property: member of
  some values from: diazylhydrazine insecticides [I99_05]
IAO_0000117: Michael Rubinigg
IAO_0000118: METHOXYFENOZID @cs
IAO_0000118: METHOXYFENOZIDE @el
IAO_0000118: METOKSIFENOTSIDI @fi
IAO_0000118: METOKSIFENOZID @hr
IAO_0000118: METOKSIFENOZIDAS @lt
IAO_0000118: METOKSIFENOZĪDS @lv
IAO_0000118: METOKSYFENOZYD @pl
IAO_0000118: METOKSÜFENOSIID @et
IAO_0000118: METOSSIFENOZIDE @it
IAO_0000118: METOSSIFENOŻID @mt
IAO_0000118: METOXIFENOZID @hu
IAO_0000118: METOXIFENOZIDA @es
IAO_0000118: METOXYFENOZID @sk
IAO_0000118: MÉTHOXYFÉNOZIDE @fr
IAO_0000118: МЕТОКСИФЕНОЗИД @bg
id: EUPH:3763
denoted by: 161050-58-4
denoted by: 605-245-2
denoted by: C22H28N2O3
denoted by: I99_05_01
denoted by: InChI=1S/C22H28N2O3/c1-14-11-15(2)13-17(12-14)21(26)24(22(4,5)6)23-20(25)18-9-8-10-19(27-7)16(18)3/h8-13H,1-7H3,(H,23,25)
denoted by: N'-tert-butyl-N'-(3,5-dimethylbenzoyl)-3-methoxy-2-methylbenzohydrazide
denoted by: RF-0296-001-PPP

Axiom
annotated source: methoxyfenozide
annotated property: denoted by
annotated target: 161050-58-4
has db xref: CAS registry number

Axiom
annotated source: methoxyfenozide
annotated property: denoted by
annotated target: 605-245-2
has db xref: https://w3id.org/euph/8101

Axiom
annotated source: methoxyfenozide
annotated property: denoted by
annotated target: C22H28N2O3
has db xref: molecular formula

Axiom
annotated source: methoxyfenozide
annotated property: denoted by
annotated target: I99_05_01
has db xref: harmonised classification of substances code

Axiom
annotated source: methoxyfenozide
annotated property: denoted by
annotated target: InChI=1S/C22H28N2O3/c1-14-11-15(2)13-17(12-14)21(26)24(22(4,5)6)23-20(25)18-9-8-10-19(27-7)16(18)3/h8-13H,1-7H3,(H,23,25)
has db xref: International Chemical Identifier (InChI)

Axiom
annotated source: methoxyfenozide
annotated property: denoted by
annotated target: N'-tert-butyl-N'-(3,5-dimethylbenzoyl)-3-methoxy-2-methylbenzohydrazide
has db xref: preferred IUPAC name (PIN)

Axiom
annotated source: methoxyfenozide
annotated property: denoted by
annotated target: RF-0296-001-PPP
has db xref: EFSA DCF term code

chromafenozide
type: Class
subclass of: bisacylhydrazine
subclass of: Restriction
  on property: member of
  some values from: diazylhydrazine insecticides [I99_05]
IAO_0000117: Michael Rubinigg
IAO_0000118: CHROMAFENOZID @cs
IAO_0000118: CHROMAFENOZIDAS @lt
IAO_0000118: CHROMAFENOZIDE @el
IAO_0000118: CHROMAFENOZYD @pl
IAO_0000118: CHROMAFÉNOZIDE @fr
IAO_0000118: CROMAFENOZID @ro
IAO_0000118: CROMAFENOZIDA @es
IAO_0000118: CROMAFENOZIDE @it
IAO_0000118: HROMAFENOZĪDS @lv
IAO_0000118: KROMAFENOSIID @et
IAO_0000118: KROMAFENOTSIDI @fi
IAO_0000118: KROMAFENOZID @hr
IAO_0000118: KROMAFENOŻID @mt
IAO_0000118: ХРОМАФЕНОЗИД @bg
id: EUPH:3765
denoted by: 143807-66-3
denoted by: 604-382-5
denoted by: C24H30N2O3
denoted by: I99_05_03
denoted by: InChI=1S/C24H30N2O3/c1-15-12-16(2)14-18(13-15)23(28)26(24(4,5)6)25-22(27)20-9-10-21-19(17(20)3)8-7-11-29-21/h9-10,12-14H,7-8,11H2,1-6H3,(H,25,27)
denoted by: N'-tert-butyl-N'-(3,5-dimethylbenzoyl)-5-methyl-3,4-dihydro-2H-chromene-6-carbohydrazide
denoted by: RF-0094-001-PPP

Axiom
annotated source: chromafenozide
annotated property: denoted by
annotated target: 143807-66-3
has db xref: CAS registry number

Axiom
annotated source: chromafenozide
annotated property: denoted by
annotated target: 604-382-5
has db xref: https://w3id.org/euph/8101

Axiom
annotated source: chromafenozide
annotated property: denoted by
annotated target: C24H30N2O3
has db xref: molecular formula

Axiom
annotated source: chromafenozide
annotated property: denoted by
annotated target: I99_05_03
has db xref: harmonised classification of substances code

Axiom
annotated source: chromafenozide
annotated property: denoted by
annotated target: InChI=1S/C24H30N2O3/c1-15-12-16(2)14-18(13-15)23(28)26(24(4,5)6)25-22(27)20-9-10-21-19(17(20)3)8-7-11-29-21/h9-10,12-14H,7-8,11H2,1-6H3,(H,25,27)
has db xref: International Chemical Identifier (InChI)

Axiom
annotated source: chromafenozide
annotated property: denoted by
annotated target: N'-tert-butyl-N'-(3,5-dimethylbenzoyl)-5-methyl-3,4-dihydro-2H-chromene-6-carbohydrazide
has db xref: preferred IUPAC name (PIN)

Axiom
annotated source: chromafenozide
annotated property: denoted by
annotated target: RF-0094-001-PPP
has db xref: EFSA DCF term code

tebufenozide
type: Class
subclass of: carbohydrazide
subclass of: Restriction
  on property: member of
  some values from: diazylhydrazine insecticides [I99_05]
IAO_0000117: Michael Rubinigg
IAO_0000118: TEBUFENOSIID @et
IAO_0000118: TEBUFENOTSIDI @fi
IAO_0000118: TEBUFENOZID @cs
IAO_0000118: TEBUFENOZIDA @es
IAO_0000118: TEBUFENOZIDAS @lt
IAO_0000118: TEBUFENOZIDE @el
IAO_0000118: TEBUFENOZYD @pl
IAO_0000118: TEBUFENOZĪDS @lv
IAO_0000118: TEBUFENOŻID @mt
IAO_0000118: TÉBUFÉNOZIDE @fr
IAO_0000118: ТЕБУФЕНОЗИД @bg
id: EUPH:3764
denoted by: 112410-23-8
denoted by: 412-850-3
denoted by: C22H28N2O2
denoted by: I99_05_02
denoted by: InChI=1S/C22H28N2O2/c1-7-17-8-10-18(11-9-17)20(25)23-24(22(4,5)6)21(26)19-13-15(2)12-16(3)14-19/h8-14H,7H2,1-6H3,(H,23,25)
denoted by: N-tert-butyl-N'-(4-ethylbenzoyl)-3,5-dimethylbenzohydrazide
denoted by: RF-0404-001-PPP

Axiom
annotated source: tebufenozide
annotated property: denoted by
annotated target: 112410-23-8
has db xref: CAS registry number

Axiom
annotated source: tebufenozide
annotated property: denoted by
annotated target: 412-850-3
has db xref: https://w3id.org/euph/8101

Axiom
annotated source: tebufenozide
annotated property: denoted by
annotated target: C22H28N2O2
has db xref: molecular formula

Axiom
annotated source: tebufenozide
annotated property: denoted by
annotated target: I99_05_02
has db xref: harmonised classification of substances code

Axiom
annotated source: tebufenozide
annotated property: denoted by
annotated target: InChI=1S/C22H28N2O2/c1-7-17-8-10-18(11-9-17)20(25)23-24(22(4,5)6)21(26)19-13-15(2)12-16(3)14-19/h8-14H,7H2,1-6H3,(H,23,25)
has db xref: International Chemical Identifier (InChI)

Axiom
annotated source: tebufenozide
annotated property: denoted by
annotated target: N-tert-butyl-N'-(4-ethylbenzoyl)-3,5-dimethylbenzohydrazide
has db xref: preferred IUPAC name (PIN)

Axiom
annotated source: tebufenozide
annotated property: denoted by
annotated target: RF-0404-001-PPP
has db xref: EFSA DCF term code

bisacylhydrazine
type: Class
subclass of: carbohydrazide
IAO_0000117: Michael Rubinigg
IAO_0000118: bisacylhydrazine
id: EUPH:6614

azadirachtin
type: Class
subclass of: limonoid
subclass of: herbal extract
subclass of: Restriction
  on property: member of
  some values from: botanical insecticides [I05_02]
IAO_0000117: Michael Rubinigg
IAO_0000118: azadirachtin
id: EUPH:4322

formetanate
type: Class
subclass of: carbamate ester
subclass of: Restriction
  on property: directly negatively regulates activity of
  some values from: acetylcholinesterase
subclass of: Restriction
  on property: member of
  some values from: carbamate insecticides [I03_02]
IAO_0000117: Michael Rubinigg
IAO_0000118: CHLORHYDRATE DE FORMÉTANATE @fr
IAO_0000118: CHLOROWODOREK FORMETANATU @pl
IAO_0000118: CLORHIDRATO DE FORMETANATO @es
IAO_0000118: CLORIDRATO DE FORMETANATO @pt
IAO_0000118: CLORIDRATO DI FORMETANATO @it
IAO_0000118: FORMETANAATHYDROCHLORIDE @nl
IAO_0000118: FORMETANAATHÜDROKLORIID @et
IAO_0000118: FORMETANAATTIHYDROKLORIDI @fi
IAO_0000118: FORMETANAT-CLORHIDRAT @ro
IAO_0000118: FORMETANAT-HIDROKLORID @hr
IAO_0000118: FORMETANAT-HYDROCHLORID @da
IAO_0000118: FORMETANATAS-HIDROCHLORIDAS @lt
IAO_0000118: FORMETANATE-HYDROCHLORIDE @el
IAO_0000118: FORMETANATHYDROKLORID @sv
IAO_0000118: FORMETANÁT-HIDROKLORID @hu
IAO_0000118: FORMETANÁT-HYDROCHLORID @cs
IAO_0000118: FORMETANĀTHIDROHLORĪDS @lv
IAO_0000118: IDROKLORIDRAT TAL-FORMETANAT @mt
IAO_0000118: ФОРМЕТАНАТ ХИДРОХЛОРИД @bg
id: EUPH:3715
denoted by: 22259-30-9
denoted by: 244-879-0
denoted by: C11H15N3O2
denoted by: CNC(=O)OC1=CC=CC(=C1)N=CN(C)C
denoted by: I03_02_02
denoted by: InChI=1S/C11H15N3O2/c1-12-11(15)16-10-6-4-5-9(7-10)13-8-14(2)3/h4-8H,1-3H3,(H,12,15)
denoted by: RF-0223-002-PPP
denoted by: [3-(dimethylaminomethylideneamino)phenyl] N-methylcarbamate

Axiom
annotated source: formetanate
annotated property: denoted by
annotated target: 22259-30-9
has db xref: CAS registry number

Axiom
annotated source: formetanate
annotated property: denoted by
annotated target: 244-879-0
has db xref: https://w3id.org/euph/8101

Axiom
annotated source: formetanate
annotated property: denoted by
annotated target: C11H15N3O2
has db xref: molecular formula

Axiom
annotated source: formetanate
annotated property: denoted by
annotated target: CNC(=O)OC1=CC=CC(=C1)N=CN(C)C
has db xref: simplified molecular input line entry system (SMILES)

Axiom
annotated source: formetanate
annotated property: denoted by
annotated target: I03_02_02
has db xref: harmonised classification of substances code

Axiom
annotated source: formetanate
annotated property: denoted by
annotated target: InChI=1S/C11H15N3O2/c1-12-11(15)16-10-6-4-5-9(7-10)13-8-14(2)3/h4-8H,1-3H3,(H,12,15)
has db xref: International Chemical Identifier (InChI)

Axiom
annotated source: formetanate
annotated property: denoted by
annotated target: RF-0223-002-PPP
has db xref: EFSA DCF term code

Axiom
annotated source: formetanate
annotated property: denoted by
annotated target: [3-(dimethylaminomethylideneamino)phenyl] N-methylcarbamate
has db xref: preferred IUPAC name (PIN)

oxamyl
type: Class
subclass of: carbamate ester
subclass of: Restriction
  on property: directly negatively regulates activity of
  some values from: acetylcholinesterase
subclass of: Restriction
  on property: member of
  some values from: oxime-carbamate insecticides [I03_01]
IAO_0000117: Michael Rubinigg
IAO_0000118: OKSAMIL @hr
IAO_0000118: OKSAMILAS @lt
IAO_0000118: OKSAMILS @lv
IAO_0000118: OKSAMYL @pl
IAO_0000118: OKSAMYYLI @fi
IAO_0000118: OKSAMÜÜL @et
IAO_0000118: OXAMIL @hu
IAO_0000118: OXAMILO @es
IAO_0000118: OXAMYL @cs
IAO_0000118: ОКСАМИЛ @bg
id: EUPH:3713
denoted by: 23135-22-0
denoted by: 245-445-3
denoted by: C7H13N3O3S
denoted by: CNC(=O)ON=C(C(=O)N(C)C)SC
denoted by: I03_01_02
denoted by: InChI=1S/C7H13N3O3S/c1-8-7(12)13-9-5(14-4)6(11)10(2)3/h1-4H3,(H,8,12)
denoted by: RF-0320-001-PPP
denoted by: methyl 2-(dimethylamino)-N-(methylcarbamoyloxy)-2-oxoethanimidothioate

Axiom
annotated source: oxamyl
annotated property: denoted by
annotated target: 23135-22-0
has db xref: CAS registry number

Axiom
annotated source: oxamyl
annotated property: denoted by
annotated target: 245-445-3
has db xref: https://w3id.org/euph/8101

Axiom
annotated source: oxamyl
annotated property: denoted by
annotated target: C7H13N3O3S
has db xref: molecular formula

Axiom
annotated source: oxamyl
annotated property: denoted by
annotated target: CNC(=O)ON=C(C(=O)N(C)C)SC
has db xref: simplified molecular input line entry system (SMILES)

Axiom
annotated source: oxamyl
annotated property: denoted by
annotated target: I03_01_02
has db xref: harmonised classification of substances code

Axiom
annotated source: oxamyl
annotated property: denoted by
annotated target: InChI=1S/C7H13N3O3S/c1-8-7(12)13-9-5(14-4)6(11)10(2)3/h1-4H3,(H,8,12)
has db xref: International Chemical Identifier (InChI)

Axiom
annotated source: oxamyl
annotated property: denoted by
annotated target: RF-0320-001-PPP
has db xref: EFSA DCF term code

Axiom
annotated source: oxamyl
annotated property: denoted by
annotated target: methyl 2-(dimethylamino)-N-(methylcarbamoyloxy)-2-oxoethanimidothioate
has db xref: preferred IUPAC name (PIN)

indoxacarb
type: Class
subclass of: methyl ester
subclass of: Restriction
  on property: member of
  some values from: oxadiazine insecticides [I99_10]
IAO_0000117: Michael Rubinigg
IAO_0000118: INDOKSAKARB @et
IAO_0000118: INDOKSAKARBAS @lt
IAO_0000118: INDOKSAKARBI @fi
IAO_0000118: INDOKSAKARBS @lv
IAO_0000118: INDOXACARB @da
IAO_0000118: INDOXACARBE @fr
IAO_0000118: INDOXAKARB @cs
IAO_0000118: ИНДОКСАКАРБ @bg
id: EUPH:3771
denoted by: 173584-44-6
denoted by: 605-683-4
denoted by: C22H17ClF3N3O7
denoted by: COC(=O)[C
denoted by: 12
denoted by: I99_10_01
denoted by: RF-00004822-PAR
denoted by: methyl (4aS)-7-chloro-2-[methoxycarbonyl-[4-(trifluoromethoxy)phenyl]carbamoyl]-3,5-dihydroindeno[1,2-e][1,3,4]oxadiazine-4a-carboxylate

Axiom
annotated source: indoxacarb
annotated property: denoted by
annotated target: 173584-44-6
has db xref: CAS registry number

Axiom
annotated source: indoxacarb
annotated property: denoted by
annotated target: 605-683-4
has db xref: https://w3id.org/euph/8101

Axiom
annotated source: indoxacarb
annotated property: denoted by
annotated target: C22H17ClF3N3O7
has db xref: molecular formula

Axiom
annotated source: indoxacarb
annotated property: denoted by
annotated target: COC(=O)[C
has db xref: simplified molecular input line entry system (SMILES)

Axiom
annotated source: indoxacarb
annotated property: denoted by
annotated target: I99_10_01
has db xref: harmonised classification of substances code

Axiom
annotated source: indoxacarb
annotated property: denoted by
annotated target: RF-00004822-PAR
has db xref: EFSA DCF term code

Axiom
annotated source: indoxacarb
annotated property: denoted by
annotated target: methyl (4aS)-7-chloro-2-[methoxycarbonyl-[4-(trifluoromethoxy)phenyl]carbamoyl]-3,5-dihydroindeno[1,2-e][1,3,4]oxadiazine-4a-carboxylate
has db xref: preferred IUPAC name (PIN)

spirodiclofen
type: Class
subclass of: lactone
subclass of: Restriction
  on property: member of
  some values from: tetronic acid insecticides [I99_17]
IAO_0000117: Michael Rubinigg
IAO_0000118: ESPIRODICLOFENA @pt
IAO_0000118: ESPIRODICLOFENO @es
IAO_0000118: SPIRODICLOFEN @da
IAO_0000118: SPIRODICLOFÈNE @fr
IAO_0000118: SPIRODIKLOFEEN @et
IAO_0000118: SPIRODIKLOFEENI @fi
IAO_0000118: SPIRODIKLOFEN @cs
IAO_0000118: SPIRODIKLOFENAS @lt
IAO_0000118: SPIRODIKLOFÉN @sk
IAO_0000118: SPIRODIKLOFĒNS @lv
IAO_0000118: СПИРОДИКЛОФЕН @bg
id: EUPH:3783
denoted by: 148477-71-8
denoted by: 604-636-5
denoted by: C21H24Cl2O4
denoted by: I99_17_01
denoted by: InChI=1S/C21H24Cl2O4/c1-4-20(2,3)19(25)26-17-16(14-9-8-13(22)12-15(14)23)18(24)27-21(17)10-6-5-7-11-21/h8-9,12H,4-7,10-11H2,1-3H3
denoted by: RF-0394-001-PPP
denoted by: [3-(2,4-dichlorophenyl)-2-oxo-1-oxaspiro[4.5]dec-3-en-4-yl] 2,2-dimethylbutanoate

Axiom
annotated source: spirodiclofen
annotated property: denoted by
annotated target: 148477-71-8
has db xref: CAS registry number

Axiom
annotated source: spirodiclofen
annotated property: denoted by
annotated target: 604-636-5
has db xref: https://w3id.org/euph/8101

Axiom
annotated source: spirodiclofen
annotated property: denoted by
annotated target: C21H24Cl2O4
has db xref: molecular formula

Axiom
annotated source: spirodiclofen
annotated property: denoted by
annotated target: I99_17_01
has db xref: harmonised classification of substances code

Axiom
annotated source: spirodiclofen
annotated property: denoted by
annotated target: InChI=1S/C21H24Cl2O4/c1-4-20(2,3)19(25)26-17-16(14-9-8-13(22)12-15(14)23)18(24)27-21(17)10-6-5-7-11-21/h8-9,12H,4-7,10-11H2,1-3H3
has db xref: International Chemical Identifier (InChI)

Axiom
annotated source: spirodiclofen
annotated property: denoted by
annotated target: RF-0394-001-PPP
has db xref: EFSA DCF term code

Axiom
annotated source: spirodiclofen
annotated property: denoted by
annotated target: [3-(2,4-dichlorophenyl)-2-oxo-1-oxaspiro[4.5]dec-3-en-4-yl] 2,2-dimethylbutanoate
has db xref: preferred IUPAC name (PIN)

spiromesifen
type: Class
subclass of: butenolide
subclass of: Restriction
  on property: member of
  some values from: tetronic acid insecticides [I99_17]
IAO_0000117: Michael Rubinigg
IAO_0000118: ESPIROMESIFENA @pt
IAO_0000118: ESPIROMESIFENO @es
IAO_0000118: SPIROMESIFEEN @et
IAO_0000118: SPIROMESIFEENI @fi
IAO_0000118: SPIROMESIFEN @cs
IAO_0000118: SPIROMEZIFEN @hu
IAO_0000118: SPIROMEZIFENAS @lt
IAO_0000118: SPIROMEZIFÉN @sk
IAO_0000118: SPIROMEZIFĒNS @lv
IAO_0000118: SPIROMÉSIFÈNE @fr
IAO_0000118: СПИРОМЕЗИФЕН @bg
id: EUPH:3784
denoted by: 283594-90-1
denoted by: 608-196-5
denoted by: C23H30O4
denoted by: I99_17_02
denoted by: InChI=1S/C23H30O4/c1-14-11-15(2)18(16(3)12-14)19-20(26-17(24)13-22(4,5)6)23(27-21(19)25)9-7-8-10-23/h11-12H,7-10,13H2,1-6H3
denoted by: RF-0395-001-PPP
denoted by: [2-oxo-3-(2,4,6-trimethylphenyl)-1-oxaspiro[4.4]non-3-en-4-yl] 3,3-dimethylbutanoate

Axiom
annotated source: spiromesifen
annotated property: denoted by
annotated target: 283594-90-1
has db xref: CAS registry number

Axiom
annotated source: spiromesifen
annotated property: denoted by
annotated target: 608-196-5
has db xref: https://w3id.org/euph/8101

Axiom
annotated source: spiromesifen
annotated property: denoted by
annotated target: C23H30O4
has db xref: molecular formula

Axiom
annotated source: spiromesifen
annotated property: denoted by
annotated target: I99_17_02
has db xref: harmonised classification of substances code

Axiom
annotated source: spiromesifen
annotated property: denoted by
annotated target: InChI=1S/C23H30O4/c1-14-11-15(2)18(16(3)12-14)19-20(26-17(24)13-22(4,5)6)23(27-21(19)25)9-7-8-10-23/h11-12H,7-10,13H2,1-6H3
has db xref: International Chemical Identifier (InChI)

Axiom
annotated source: spiromesifen
annotated property: denoted by
annotated target: RF-0395-001-PPP
has db xref: EFSA DCF term code

Axiom
annotated source: spiromesifen
annotated property: denoted by
annotated target: [2-oxo-3-(2,4,6-trimethylphenyl)-1-oxaspiro[4.4]non-3-en-4-yl] 3,3-dimethylbutanoate
has db xref: preferred IUPAC name (PIN)

bifenazate
type: Class
subclass of: carboxylic ester
subclass of: Restriction
  on property: member of
  some values from: carbazate insecticides [I99_04]
IAO_0000117: Michael Rubinigg
IAO_0000118: BIFENASAAT @et
IAO_0000118: BIFENATSAATTI @fi
IAO_0000118: BIFENAZAAT @nl
IAO_0000118: BIFENAZAN @pl
IAO_0000118: BIFENAZAT @da
IAO_0000118: BIFENAZATAS @lt
IAO_0000118: BIFENAZATE @el
IAO_0000118: BIFENAZATO @es
IAO_0000118: BIFENAZÁT @cs
IAO_0000118: BIFENAZĀTS @lv
IAO_0000118: BIFENAŻAT @mt
IAO_0000118: BIFÉNAZATE @fr
IAO_0000118: БИФЕНАЗАТ @bg
id: EUPH:3762
denoted by: 149877-41-8
denoted by: 604-709-1
denoted by: C17H20N2O3
denoted by: I99_04_01
denoted by: InChI=1S/C17H20N2O3/c1-12(2)22-17(20)19-18-15-11-14(9-10-16(15)21-3)13-7-5-4-6-8-13/h4-12,18H,1-3H3,(H,19,20)
denoted by: RF-0044-001-PPP
denoted by: propan-2-yl N-(2-methoxy-5-phenylanilino)carbamate

Axiom
annotated source: bifenazate
annotated property: denoted by
annotated target: 149877-41-8
has db xref: CAS registry number

Axiom
annotated source: bifenazate
annotated property: denoted by
annotated target: 604-709-1
has db xref: https://w3id.org/euph/8101

Axiom
annotated source: bifenazate
annotated property: denoted by
annotated target: C17H20N2O3
has db xref: molecular formula

Axiom
annotated source: bifenazate
annotated property: denoted by
annotated target: I99_04_01
has db xref: harmonised classification of substances code

Axiom
annotated source: bifenazate
annotated property: denoted by
annotated target: InChI=1S/C17H20N2O3/c1-12(2)22-17(20)19-18-15-11-14(9-10-16(15)21-3)13-7-5-4-6-8-13/h4-12,18H,1-3H3,(H,19,20)
has db xref: International Chemical Identifier (InChI)

Axiom
annotated source: bifenazate
annotated property: denoted by
annotated target: RF-0044-001-PPP
has db xref: EFSA DCF term code

Axiom
annotated source: bifenazate
annotated property: denoted by
annotated target: propan-2-yl N-(2-methoxy-5-phenylanilino)carbamate
has db xref: preferred IUPAC name (PIN)

ethoprophos
type: Class
subclass of: organic thiophosphate
subclass of: Restriction
  on property: member of
  some values from: organophosphorus insecticides [I04_01]
IAO_0000117: Michael Rubinigg
IAO_0000118: ETHOPROFOS @cs
IAO_0000118: ETHOPROPHOS @da
IAO_0000118: ETOPROFOS @es
IAO_0000118: ETOPROFOSAS @lt
IAO_0000118: ETOPROFOSS @et
IAO_0000118: ETOPROFOSSI @fi
IAO_0000118: ETOPROFOSZ @hu
IAO_0000118: ÉTHOPROPHOS @fr
IAO_0000118: ЕТОПРОФОС @bg
id: EUPH:3722
denoted by: 13194-48-4
denoted by: 236-152-1
denoted by: C8H19O2PS2
denoted by: CCCSP(=O)(OCC)SCCC
denoted by: I04_01_04
denoted by: InChI=1S/C8H19O2PS2/c1-4-7-12-11(9,10-6-3)13-8-5-2/h4-8H2,1-3H3
denoted by: RF-0164-001-PPP

Axiom
annotated source: ethoprophos
annotated property: denoted by
annotated target: 13194-48-4
has db xref: CAS registry number

Axiom
annotated source: ethoprophos
annotated property: denoted by
annotated target: 236-152-1
has db xref: https://w3id.org/euph/8101

Axiom
annotated source: ethoprophos
annotated property: denoted by
annotated target: C8H19O2PS2
has db xref: molecular formula

Axiom
annotated source: ethoprophos
annotated property: denoted by
annotated target: CCCSP(=O)(OCC)SCCC
has db xref: simplified molecular input line entry system (SMILES)

Axiom
annotated source: ethoprophos
annotated property: denoted by
annotated target: I04_01_04
has db xref: harmonised classification of substances code

Axiom
annotated source: ethoprophos
annotated property: denoted by
annotated target: InChI=1S/C8H19O2PS2/c1-4-7-12-11(9,10-6-3)13-8-5-2/h4-8H2,1-3H3
has db xref: International Chemical Identifier (InChI)

Axiom
annotated source: ethoprophos
annotated property: denoted by
annotated target: RF-0164-001-PPP
has db xref: EFSA DCF term code

thiadiazinane
type: Class
subclass of: organic heteromonocyclic compound
IAO_0000117: Michael Rubinigg
IAO_0000118: thiadiazinane
id: EUPH:6071

phosmet
type: Class
subclass of: organic thiophosphate
subclass of: Restriction
  on property: member of
  some values from: organophosphorus insecticides [I04_01]
IAO_0000117: Michael Rubinigg
IAO_0000118: FOSMEET @et
IAO_0000118: FOSMET @cs
IAO_0000118: FOSMETAS @lt
IAO_0000118: FOSMETE @pt
IAO_0000118: FOSMETS @lv
IAO_0000118: FOSMETTI @fi
IAO_0000118: FOSZMET @hu
IAO_0000118: PHOSMET @da
IAO_0000118: ФОСМЕТ @bg
id: EUPH:3724
denoted by: 211-987-4
denoted by: 732-11-6
denoted by: C11H12NO4PS2
denoted by: COP(=S)(OC)SCN1C(=O)C2=CC=CC=C2C1=O
denoted by: I04_01_08
denoted by: InChI=1S/C11H12NO4PS2/c1-15-17(18,16-2)19-7-12-10(13)8-5-3-4-6-9(8)11(12)14/h3-6H,7H2,1-2H3
denoted by: RF-0338-002-PPP

Axiom
annotated source: phosmet
annotated property: denoted by
annotated target: 211-987-4
has db xref: https://w3id.org/euph/8101

Axiom
annotated source: phosmet
annotated property: denoted by
annotated target: 732-11-6
has db xref: CAS registry number

Axiom
annotated source: phosmet
annotated property: denoted by
annotated target: C11H12NO4PS2
has db xref: molecular formula

Axiom
annotated source: phosmet
annotated property: denoted by
annotated target: COP(=S)(OC)SCN1C(=O)C2=CC=CC=C2C1=O
has db xref: simplified molecular input line entry system (SMILES)

Axiom
annotated source: phosmet
annotated property: denoted by
annotated target: I04_01_08
has db xref: harmonised classification of substances code

Axiom
annotated source: phosmet
annotated property: denoted by
annotated target: InChI=1S/C11H12NO4PS2/c1-15-17(18,16-2)19-7-12-10(13)8-5-3-4-6-9(8)11(12)14/h3-6H,7H2,1-2H3
has db xref: International Chemical Identifier (InChI)

Axiom
annotated source: phosmet
annotated property: denoted by
annotated target: RF-0338-002-PPP
has db xref: EFSA DCF term code

pirimiphos-methyl
type: Class
subclass of: organic thiophosphate
subclass of: Restriction
  on property: member of
  some values from: organophosphorus insecticides [I04_01]
IAO_0000117: Michael Rubinigg
IAO_0000118: METILPIRIMIFOSAS @lt
IAO_0000118: METÜÜLPIRIMIFOSS @et
IAO_0000118: PIRIMIFOS-METHYL @cs
IAO_0000118: PIRIMIFOS-METIL @hr
IAO_0000118: PIRIMIFOS-METILE @it
IAO_0000118: PIRIMIFOS-METILO @es
IAO_0000118: PIRIMIFOS-METYL @sk
IAO_0000118: PIRIMIFOSMETILS @lv
IAO_0000118: PIRIMIFOSMETYL @sv
IAO_0000118: PIRIMIFOSSIMETYYLI @fi
IAO_0000118: PIRIMIFOSZ-METIL @hu
IAO_0000118: PIRIMIPHOS-METHYL @da
IAO_0000118: PIRIMIPHOS-MÉTHYLE @fr
IAO_0000118: PIRYMIFOS METYLU @pl
IAO_0000118: ПИРИМИФОС-МЕТИЛ @bg
id: EUPH:3725
denoted by: 249-528-5
denoted by: 29232-93-7
denoted by: 4-dimethoxyphosphinothioyloxy-N,N-diethyl-6-methylpyrimidin-2-amine
denoted by: C11H20N3O3PS
denoted by: CCN(CC)C1=NC(=CC(=N1)OP(=S)(OC)OC)C
denoted by: I04_01_09
denoted by: InChI=1S/C11H20N3O3PS/c1-6-14(7-2)11-12-9(3)8-10(13-11)17-18(19,15-4)16-5/h8H,6-7H2,1-5H3
denoted by: RF-0348-001-PPP

Axiom
annotated source: pirimiphos-methyl
annotated property: denoted by
annotated target: 249-528-5
has db xref: https://w3id.org/euph/8101

Axiom
annotated source: pirimiphos-methyl
annotated property: denoted by
annotated target: 29232-93-7
has db xref: CAS registry number

Axiom
annotated source: pirimiphos-methyl
annotated property: denoted by
annotated target: 4-dimethoxyphosphinothioyloxy-N,N-diethyl-6-methylpyrimidin-2-amine
has db xref: preferred IUPAC name (PIN)

Axiom
annotated source: pirimiphos-methyl
annotated property: denoted by
annotated target: C11H20N3O3PS
has db xref: molecular formula

Axiom
annotated source: pirimiphos-methyl
annotated property: denoted by
annotated target: CCN(CC)C1=NC(=CC(=N1)OP(=S)(OC)OC)C
has db xref: simplified molecular input line entry system (SMILES)

Axiom
annotated source: pirimiphos-methyl
annotated property: denoted by
annotated target: I04_01_09
has db xref: harmonised classification of substances code

Axiom
annotated source: pirimiphos-methyl
annotated property: denoted by
annotated target: InChI=1S/C11H20N3O3PS/c1-6-14(7-2)11-12-9(3)8-10(13-11)17-18(19,15-4)16-5/h8H,6-7H2,1-5H3
has db xref: International Chemical Identifier (InChI)

Axiom
annotated source: pirimiphos-methyl
annotated property: denoted by
annotated target: RF-0348-001-PPP
has db xref: EFSA DCF term code

acrinathrin
type: Class
subclass of: cyclopropanecarboxylate ester
subclass of: Restriction
  on property: member of
  some values from: pyrethroid insecticides [I01_01]
IAO_0000117: Michael Rubinigg
IAO_0000118: ACRINATHRIN @da
IAO_0000118: ACRINATHRINE @fr
IAO_0000118: ACRINATRIN @ro
IAO_0000118: ACRINATRINA @it
IAO_0000118: ACRINATRÍN @es
IAO_0000118: AKRINATHRIN @cs
IAO_0000118: AKRINATRIIN @et
IAO_0000118: AKRINATRIINI @fi
IAO_0000118: AKRINATRIN @hr
IAO_0000118: AKRINATRINA @mt
IAO_0000118: AKRINATRINAS @lt
IAO_0000118: AKRINATRÍN @sk
IAO_0000118: AKRINATRĪNS @lv
IAO_0000118: AKRYNATRYNA @pl
IAO_0000118: АКРИНАТРИН @bg
id: EUPH:3695
denoted by: 101007-06-1
denoted by: 600-147-6
denoted by: C26H21F6NO5
denoted by: CC1(C
denoted by: I01_01_01
denoted by: InChI=1S/C26H21F6NO5/c1-24(2)18(11-12-20(34)38-23(25(27,28)29)26(30,31)32)21(24)22(35)37-19(14-33)15-7-6-10-17(13-15)36-16-8-4-3-5-9-16/h3-13,18-19,21,23H,1-2H3/b12-11-/t18-,19+,21-/m0/s1
denoted by: RF-0018-001-PPP
denoted by: trans-[(S)-cyano-(3-phenoxyphenyl)methyl] (1R,3S)-3-[(Z)-3-(1,1,1,3,3,3-hexafluoropropan-2-yloxy)-3-oxoprop-1-enyl]-2,2-dimethylcyclopropane-1-carboxylate

Axiom
annotated source: acrinathrin
annotated property: denoted by
annotated target: 101007-06-1
has db xref: CAS registry number

Axiom
annotated source: acrinathrin
annotated property: denoted by
annotated target: 600-147-6
has db xref: https://w3id.org/euph/8101

Axiom
annotated source: acrinathrin
annotated property: denoted by
annotated target: C26H21F6NO5
has db xref: molecular formula

Axiom
annotated source: acrinathrin
annotated property: denoted by
annotated target: CC1(C
has db xref: simplified molecular input line entry system (SMILES)

Axiom
annotated source: acrinathrin
annotated property: denoted by
annotated target: I01_01_01
has db xref: harmonised classification of substances code

Axiom
annotated source: acrinathrin
annotated property: denoted by
annotated target: InChI=1S/C26H21F6NO5/c1-24(2)18(11-12-20(34)38-23(25(27,28)29)26(30,31)32)21(24)22(35)37-19(14-33)15-7-6-10-17(13-15)36-16-8-4-3-5-9-16/h3-13,18-19,21,23H,1-2H3/b12-11-/t18-,19+,21-/m0/s1
has db xref: International Chemical Identifier (InChI)

Axiom
annotated source: acrinathrin
annotated property: denoted by
annotated target: RF-0018-001-PPP
has db xref: EFSA DCF term code

Axiom
annotated source: acrinathrin
annotated property: denoted by
annotated target: trans-[(S)-cyano-(3-phenoxyphenyl)methyl] (1R,3S)-3-[(Z)-3-(1,1,1,3,3,3-hexafluoropropan-2-yloxy)-3-oxoprop-1-enyl]-2,2-dimethylcyclopropane-1-carboxylate
has db xref: preferred IUPAC name (PIN)

pyrethrins
type: Class
subclass of: cyclopropanecarboxylate ester
subclass of: herbal extract
subclass of: Restriction
  on property: member of
  some values from: botanical insecticides [I05_02]
IAO_0000117: Michael Rubinigg
IAO_0000118: PIRETRINAI @lt
IAO_0000118: PIRETRINAS @es
IAO_0000118: PIRETRINE @it
IAO_0000118: PIRETRINEK @hu
IAO_0000118: PIRETRINI @hr
IAO_0000118: PIRETRĪNI @lv
IAO_0000118: PYRETHRINE @de
IAO_0000118: PYRETHRINEN @nl
IAO_0000118: PYRETHRINER @da
IAO_0000118: PYRETHRINS @el
IAO_0000118: PYRETHRINY @cs
IAO_0000118: PYRETRIINIT @fi
IAO_0000118: PYRETRINER @sv
IAO_0000118: PYRETRYNY @pl
IAO_0000118: PYRETRÍNY @sk
IAO_0000118: PYRÉTHRINES @fr
IAO_0000118: PÜRETRIINID @et
IAO_0000118: ПИРЕТРИНИ @bg
id: EUPH:3746
denoted by: 232-319-8
denoted by: 8003-34-7
denoted by: C43H56O8
denoted by: I05_02_04
denoted by: InChI=1S/C22H28O5.C21H28O3/c1-7-8-9-10-15-14(3)18(12-17(15)23)27-21(25)19-16(22(19,4)5)11-13(2)20(24)26-6;1-7-8-9-10-15-14(4)18(12-17(15)22)24-20(23)19-16(11-13(2)3)21(19,5)6/h7-9,11,16,18-19H,1,10,12H2,2-6H3;7-9,11,16,18-19H,1,10,12H2,2-6H3/b9-8-,13-11+;9-8-/t2*16-,18+,19+/m11/s1
denoted by: RF-0374-001-PPP
denoted by: cis-[(1S)-2-methyl-4-oxo-3-[(2Z)-penta-2,4-dienyl]cyclopent-2-en-1-yl] (1R,3R)-2,2-dimethyl-3-(2-methylprop-1-enyl)cyclopropane-1-carboxylate;cis-[(1S)-2-methyl-4-oxo-3-[(2Z)-penta-2,4-dienyl]cyclopent-2-en-1-yl] (1R,3R)-3-[(E)-3-methoxy-2-methyl-3-oxoprop-1-enyl]-2,2-dimethylcyclopropane-1-carboxylate

Axiom
annotated source: pyrethrins
annotated property: denoted by
annotated target: 232-319-8
has db xref: https://w3id.org/euph/8101

Axiom
annotated source: pyrethrins
annotated property: denoted by
annotated target: 8003-34-7
has db xref: CAS registry number

Axiom
annotated source: pyrethrins
annotated property: denoted by
annotated target: C43H56O8
has db xref: molecular formula

Axiom
annotated source: pyrethrins
annotated property: denoted by
annotated target: I05_02_04
has db xref: harmonised classification of substances code

Axiom
annotated source: pyrethrins
annotated property: denoted by
annotated target: InChI=1S/C22H28O5.C21H28O3/c1-7-8-9-10-15-14(3)18(12-17(15)23)27-21(25)19-16(22(19,4)5)11-13(2)20(24)26-6;1-7-8-9-10-15-14(4)18(12-17(15)22)24-20(23)19-16(11-13(2)3)21(19,5)6/h7-9,11,16,18-19H,1,10,12H2,2-6H3;7-9,11,16,18-19H,1,10,12H2,2-6H3/b9-8-,13-11+;9-8-/t2*16-,18+,19+/m11/s1
has db xref: International Chemical Identifier (InChI)

Axiom
annotated source: pyrethrins
annotated property: denoted by
annotated target: RF-0374-001-PPP
has db xref: EFSA DCF term code

Axiom
annotated source: pyrethrins
annotated property: denoted by
annotated target: cis-[(1S)-2-methyl-4-oxo-3-[(2Z)-penta-2,4-dienyl]cyclopent-2-en-1-yl] (1R,3R)-2,2-dimethyl-3-(2-methylprop-1-enyl)cyclopropane-1-carboxylate;cis-[(1S)-2-methyl-4-oxo-3-[(2Z)-penta-2,4-dienyl]cyclopent-2-en-1-yl] (1R,3R)-3-[(E)-3-methoxy-2-methyl-3-oxoprop-1-enyl]-2,2-dimethylcyclopropane-1-carboxylate
has db xref: preferred IUPAC name (PIN)

chloropyridine
type: Class
subclass of: pyridine
IAO_0000117: Michael Rubinigg
IAO_0000118: chloropyridine
id: EUPH:6956

thiacloprid
type: Class
subclass of: chloropyridine
subclass of: Restriction
  on property: member of
  some values from: pyridymethylamine insecticides [I99_14]
IAO_0000117: Michael Rubinigg
IAO_0000118: THIACLOPRID @da
IAO_0000118: THIACLOPRIDE @fr
IAO_0000118: THIAKLOPRID @cs
IAO_0000118: TIACLOPRID @es
IAO_0000118: TIACLOPRIDE @pt
IAO_0000118: TIAKLOPRID @hr
IAO_0000118: TIAKLOPRIDAS @lt
IAO_0000118: TIAKLOPRIDI @fi
IAO_0000118: TIAKLOPRIID @et
IAO_0000118: TIAKLOPRYD @pl
IAO_0000118: TIAKLOPRĪDS @lv
IAO_0000118: TIJAKLOPRID @mt
IAO_0000118: ТИАКЛОПРИД @bg
id: EUPH:3781
denoted by: 111988-49-9
denoted by: 966-711-1
denoted by: C10H9ClN4S
denoted by: C1CSC(=NC#N)N1CC2=CN=C(C=C2)Cl
denoted by: I99_14_03
denoted by: InChI=1S/C10H9ClN4S/c11-9-2-1-8(5-13-9)6-15-3-4-16-10(15)14-7-12/h1-2,5H,3-4,6H2
denoted by: RF-0417-001-PPP
denoted by: [3-[(6-chloro-3-pyridinyl)methyl]-1,3-thiazolidin-2-ylidene]cyanamide

Axiom
annotated source: thiacloprid
annotated property: denoted by
annotated target: 111988-49-9
has db xref: CAS registry number

Axiom
annotated source: thiacloprid
annotated property: denoted by
annotated target: 966-711-1
has db xref: https://w3id.org/euph/8101

Axiom
annotated source: thiacloprid
annotated property: denoted by
annotated target: C10H9ClN4S
has db xref: molecular formula

Axiom
annotated source: thiacloprid
annotated property: denoted by
annotated target: C1CSC(=NC#N)N1CC2=CN=C(C=C2)Cl
has db xref: simplified molecular input line entry system (SMILES)

Axiom
annotated source: thiacloprid
annotated property: denoted by
annotated target: I99_14_03
has db xref: harmonised classification of substances code

Axiom
annotated source: thiacloprid
annotated property: denoted by
annotated target: InChI=1S/C10H9ClN4S/c11-9-2-1-8(5-13-9)6-15-3-4-16-10(15)14-7-12/h1-2,5H,3-4,6H2
has db xref: International Chemical Identifier (InChI)

Axiom
annotated source: thiacloprid
annotated property: denoted by
annotated target: RF-0417-001-PPP
has db xref: EFSA DCF term code

Axiom
annotated source: thiacloprid
annotated property: denoted by
annotated target: [3-[(6-chloro-3-pyridinyl)methyl]-1,3-thiazolidin-2-ylidene]cyanamide
has db xref: preferred IUPAC name (PIN)

clothianidin
type: Class
subclass of: nitroguanidine derivative
subclass of: Restriction
  on property: member of
  some values from: nitroguanidine insecticides [I99_08]
IAO_0000117: Michael Rubinigg
IAO_0000118: CLOTHIANIDIN @da
IAO_0000118: CLOTHIANIDINE @fr
IAO_0000118: CLOTIANIDIN @ro
IAO_0000118: CLOTIANIDINA @es
IAO_0000118: KLOTHIANIDIN @cs
IAO_0000118: KLOTIANIDIIN @et
IAO_0000118: KLOTIANIDIINI @fi
IAO_0000118: KLOTIANIDIN @hr
IAO_0000118: KLOTIANIDINAS @lt
IAO_0000118: KLOTIANIDYNA @pl
IAO_0000118: KLOTIANIDÍN @sk
IAO_0000118: KLOTIANIDĪNS @lv
IAO_0000118: KLOTIJANIDIN @mt
IAO_0000118: КЛОТИАНИДИН @bg
id: EUPH:3769
denoted by: 1-[(2-chloro-1,3-thiazol-5-yl)methyl]-3-methyl-2-nitroguanidine
denoted by: 210880-92-5
denoted by: 433-460-1
denoted by: C6H8ClN5O2S
denoted by: CN/C(=N[N+](=O)[O-])/NCC1=CN=C(S1)Cl
denoted by: I99_08_01
denoted by: InChI=1S/C6H8ClN5O2S/c1-8-6(11-12(13)14)10-3-4-2-9-5(7)15-4/h2H,3H2,1H3,(H2,8,10,11)
denoted by: RF-0101-001-PPP

Axiom
annotated source: clothianidin
annotated property: denoted by
annotated target: 1-[(2-chloro-1,3-thiazol-5-yl)methyl]-3-methyl-2-nitroguanidine
has db xref: preferred IUPAC name (PIN)

Axiom
annotated source: clothianidin
annotated property: denoted by
annotated target: 210880-92-5
has db xref: CAS registry number

Axiom
annotated source: clothianidin
annotated property: denoted by
annotated target: 433-460-1
has db xref: https://w3id.org/euph/8101

Axiom
annotated source: clothianidin
annotated property: denoted by
annotated target: C6H8ClN5O2S
has db xref: molecular formula

Axiom
annotated source: clothianidin
annotated property: denoted by
annotated target: CN/C(=N[N+](=O)[O-])/NCC1=CN=C(S1)Cl
has db xref: simplified molecular input line entry system (SMILES)

Axiom
annotated source: clothianidin
annotated property: denoted by
annotated target: I99_08_01
has db xref: harmonised classification of substances code

Axiom
annotated source: clothianidin
annotated property: denoted by
annotated target: InChI=1S/C6H8ClN5O2S/c1-8-6(11-12(13)14)10-3-4-2-9-5(7)15-4/h2H,3H2,1H3,(H2,8,10,11)
has db xref: International Chemical Identifier (InChI)

Axiom
annotated source: clothianidin
annotated property: denoted by
annotated target: RF-0101-001-PPP
has db xref: EFSA DCF term code

thiamethoxam
type: Class
subclass of: nitroguanidine derivative
subclass of: Restriction
  on property: member of
  some values from: nitroguanidine insecticides [I99_08]
IAO_0000117: Michael Rubinigg
IAO_0000118: THIAMETHOXAM @cs
IAO_0000118: THIAMÉTHOXAME @fr
IAO_0000118: TIAMETOKSAAM @et
IAO_0000118: TIAMETOKSAAMI @fi
IAO_0000118: TIAMETOKSAM @hr
IAO_0000118: TIAMETOKSAMAS @lt
IAO_0000118: TIAMETOKSAMS @lv
IAO_0000118: TIAMETOXAM @es
IAO_0000118: TIAMETOXAME @pt
IAO_0000118: TIJAMETOKSAM @mt
IAO_0000118: ТИАМЕТОКСАМ @bg
id: EUPH:3770
denoted by: (NE)-N-[3-[(2-chloro-1,3-thiazol-5-yl)methyl]-5-methyl-1,3,5-oxadiazinan-4-ylidene]nitramide
denoted by: 153719-23-4
denoted by: 428-650-4
denoted by: C8H10ClN5O3S
denoted by: CN\1COCN(/C1=N/N+[O-])CC2=CN=C(S2)Cl
denoted by: I99_08_02
denoted by: InChI=1S/C8H10ClN5O3S/c1-12-4-17-5-13(8(12)11-14(15)16)3-6-2-10-7(9)18-6/h2H,3-5H2,1H3/b11-8+
denoted by: RF-0418-001-PPP

Axiom
annotated source: thiamethoxam
annotated property: denoted by
annotated target: (NE)-N-[3-[(2-chloro-1,3-thiazol-5-yl)methyl]-5-methyl-1,3,5-oxadiazinan-4-ylidene]nitramide
has db xref: preferred IUPAC name (PIN)

Axiom
annotated source: thiamethoxam
annotated property: denoted by
annotated target: 153719-23-4
has db xref: CAS registry number

Axiom
annotated source: thiamethoxam
annotated property: denoted by
annotated target: 428-650-4
has db xref: https://w3id.org/euph/8101

Axiom
annotated source: thiamethoxam
annotated property: denoted by
annotated target: C8H10ClN5O3S
has db xref: molecular formula

Axiom
annotated source: thiamethoxam
annotated property: denoted by
annotated target: CN\1COCN(/C1=N/N+[O-])CC2=CN=C(S2)Cl
has db xref: simplified molecular input line entry system (SMILES)

Axiom
annotated source: thiamethoxam
annotated property: denoted by
annotated target: I99_08_02
has db xref: harmonised classification of substances code

Axiom
annotated source: thiamethoxam
annotated property: denoted by
annotated target: InChI=1S/C8H10ClN5O3S/c1-12-4-17-5-13(8(12)11-14(15)16)3-6-2-10-7(9)18-6/h2H,3-5H2,1H3/b11-8+
has db xref: International Chemical Identifier (InChI)

Axiom
annotated source: thiamethoxam
annotated property: denoted by
annotated target: RF-0418-001-PPP
has db xref: EFSA DCF term code

bactericide
type: Class
subclass of: pesticide
subclass of: Restriction
  on property: results in ending of
  some values from: https://w3id.org/euph/84
IAO_0000117: Michael Rubinigg
IAO_0000118: Bakterizid @de
IAO_0000118: bactericide
id: EUPH:901

pyriproxyfen
type: Class
subclass of: aromatic ether
subclass of: Restriction
  on property: member of
  some values from: phenyl-ether insecticides [I99_11]
IAO_0000117: Michael Rubinigg
IAO_0000118: PIRIPROKSIFEN @hr
IAO_0000118: PIRIPROKSIFENAS @lt
IAO_0000118: PIRIPROKSIFĒNS @lv
IAO_0000118: PIRIPROXIFEN @hu
IAO_0000118: PIRIPROXIFENA @pt
IAO_0000118: PIRIPROXIFENE @it
IAO_0000118: PIRIPROXIFÉN @es
IAO_0000118: PIRYPROKSYFEN @pl
IAO_0000118: PYRIPROKSIFEENI @fi
IAO_0000118: PYRIPROXIFEN @sv
IAO_0000118: PYRIPROXYFEN @cs
IAO_0000118: PYRIPROXYFÈNE @fr
IAO_0000118: PYRIPROXYFÉN @sk
IAO_0000118: PÜRIPROKSÜFEEN @et
IAO_0000118: ПИРИПРОКСИФЕН @bg
id: EUPH:3772
denoted by: 2-[1-(4-phenoxyphenoxy)propan-2-yloxy]pyridine
denoted by: 619-166-6
denoted by: 95737-68-1
denoted by: C20H19NO3
denoted by: I99_11_01
denoted by: InChI=1S/C20H19NO3/c1-16(23-20-9-5-6-14-21-20)15-22-17-10-12-19(13-11-17)24-18-7-3-2-4-8-18/h2-14,16H,15H2,1H3
denoted by: RF-0378-001-PPP

Axiom
annotated source: pyriproxyfen
annotated property: denoted by
annotated target: 2-[1-(4-phenoxyphenoxy)propan-2-yloxy]pyridine
has db xref: preferred IUPAC name (PIN)

Axiom
annotated source: pyriproxyfen
annotated property: denoted by
annotated target: 619-166-6
has db xref: https://w3id.org/euph/8101

Axiom
annotated source: pyriproxyfen
annotated property: denoted by
annotated target: 95737-68-1
has db xref: CAS registry number

Axiom
annotated source: pyriproxyfen
annotated property: denoted by
annotated target: C20H19NO3
has db xref: molecular formula

Axiom
annotated source: pyriproxyfen
annotated property: denoted by
annotated target: I99_11_01
has db xref: harmonised classification of substances code

Axiom
annotated source: pyriproxyfen
annotated property: denoted by
annotated target: InChI=1S/C20H19NO3/c1-16(23-20-9-5-6-14-21-20)15-22-17-10-12-19(13-11-17)24-18-7-3-2-4-8-18/h2-14,16H,15H2,1H3
has db xref: International Chemical Identifier (InChI)

Axiom
annotated source: pyriproxyfen
annotated property: denoted by
annotated target: RF-0378-001-PPP
has db xref: EFSA DCF term code

flonicamid
type: Class
subclass of: pyridinecarboxamide
subclass of: Restriction
  on property: member of
  some values from: pyridine insecticides [I99_13]
IAO_0000117: Michael Rubinigg
IAO_0000118: FLONICAMID @da
IAO_0000118: FLONICAMIDE @fr
IAO_0000118: FLONIKAMID @cs
IAO_0000118: FLONIKAMIDAS @lt
IAO_0000118: FLONIKAMIDI @fi
IAO_0000118: FLONIKAMIID @et
IAO_0000118: FLONIKAMĪDS @lv
IAO_0000118: ФЛОНИКАМИД @bg
id: EUPH:3777
denoted by: 158062-67-0
denoted by: 605-127-0
denoted by: C1=CN=CC(=C1C(F)(F)F)C(=O)NCC#N
denoted by: C9H6F3N3O
denoted by: I99_13_02
denoted by: InChI=1S/C9H6F3N3O/c10-9(11,12)7-1-3-14-5-6(7)8(16)15-4-2-13/h1,3,5H,4H2,(H,15,16)
denoted by: N-(cyanomethyl)-4-(trifluoromethyl)pyridine-3-carboxamide
denoted by: RF-0194-002-PPP

Axiom
annotated source: flonicamid
annotated property: denoted by
annotated target: 158062-67-0
has db xref: CAS registry number

Axiom
annotated source: flonicamid
annotated property: denoted by
annotated target: 605-127-0
has db xref: https://w3id.org/euph/8101

Axiom
annotated source: flonicamid
annotated property: denoted by
annotated target: C1=CN=CC(=C1C(F)(F)F)C(=O)NCC#N
has db xref: simplified molecular input line entry system (SMILES)

Axiom
annotated source: flonicamid
annotated property: denoted by
annotated target: C9H6F3N3O
has db xref: molecular formula

Axiom
annotated source: flonicamid
annotated property: denoted by
annotated target: I99_13_02
has db xref: harmonised classification of substances code

Axiom
annotated source: flonicamid
annotated property: denoted by
annotated target: InChI=1S/C9H6F3N3O/c10-9(11,12)7-1-3-14-5-6(7)8(16)15-4-2-13/h1,3,5H,4H2,(H,15,16)
has db xref: International Chemical Identifier (InChI)

Axiom
annotated source: flonicamid
annotated property: denoted by
annotated target: N-(cyanomethyl)-4-(trifluoromethyl)pyridine-3-carboxamide
has db xref: preferred IUPAC name (PIN)

Axiom
annotated source: flonicamid
annotated property: denoted by
annotated target: RF-0194-002-PPP
has db xref: EFSA DCF term code

pymetrozine
type: Class
subclass of: pyridine
subclass of: Restriction
  on property: member of
  some values from: pyridine insecticides [I99_13]
IAO_0000117: Michael Rubinigg
IAO_0000118: PIMETROZIN @hr
IAO_0000118: PIMETROZINA @es
IAO_0000118: PIMETROZINAS @lt
IAO_0000118: PIMETROZINĂ @ro
IAO_0000118: PIMETROZYNA @pl
IAO_0000118: PIMETROZĪNS @lv
IAO_0000118: PIMETROŻINA @mt
IAO_0000118: PYMETROTSIINI @fi
IAO_0000118: PYMETROZIN @cs
IAO_0000118: PYMETROZINE @el
IAO_0000118: PYMETROZÍN @sk
IAO_0000118: PYMÉTROZINE @fr
IAO_0000118: PÜMETROSIIN @et
IAO_0000118: ПИМЕТРОЗИН @bg
id: EUPH:3776
denoted by: 123312-89-0
denoted by: 6-methyl-4-[(E)-pyridin-3-ylmethylideneamino]-2,5-dihydro-1,2,4-triazin-3-one
denoted by: 602-927-1
denoted by: C10H11N5O
denoted by: CC1=NNC(=O)N(C1)/N=C/C2=CN=CC=C2
denoted by: I99_13_01
denoted by: InChI=1S/C10H11N5O/c1-8-7-15(10(16)14-13-8)12-6-9-3-2-4-11-5-9/h2-6H,7H2,1H3,(H,14,16)/b12-6+
denoted by: RF-0369-001-PPP

Axiom
annotated source: pymetrozine
annotated property: denoted by
annotated target: 123312-89-0
has db xref: CAS registry number

Axiom
annotated source: pymetrozine
annotated property: denoted by
annotated target: 6-methyl-4-[(E)-pyridin-3-ylmethylideneamino]-2,5-dihydro-1,2,4-triazin-3-one
has db xref: preferred IUPAC name (PIN)

Axiom
annotated source: pymetrozine
annotated property: denoted by
annotated target: 602-927-1
has db xref: https://w3id.org/euph/8101

Axiom
annotated source: pymetrozine
annotated property: denoted by
annotated target: C10H11N5O
has db xref: molecular formula

Axiom
annotated source: pymetrozine
annotated property: denoted by
annotated target: CC1=NNC(=O)N(C1)/N=C/C2=CN=CC=C2
has db xref: simplified molecular input line entry system (SMILES)

Axiom
annotated source: pymetrozine
annotated property: denoted by
annotated target: I99_13_01
has db xref: harmonised classification of substances code

Axiom
annotated source: pymetrozine
annotated property: denoted by
annotated target: InChI=1S/C10H11N5O/c1-8-7-15(10(16)14-13-8)12-6-9-3-2-4-11-5-9/h2-6H,7H2,1H3,(H,14,16)/b12-6+
has db xref: International Chemical Identifier (InChI)

Axiom
annotated source: pymetrozine
annotated property: denoted by
annotated target: RF-0369-001-PPP
has db xref: EFSA DCF term code

clofentezine
type: Class
subclass of: tetrazine
subclass of: Restriction
  on property: member of
  some values from: tetrazine acaricides [I06_02]
IAO_0000117: Michael Rubinigg
IAO_0000118: CLOFENTEZIN @da
IAO_0000118: CLOFENTEZINA @es
IAO_0000118: CLOFENTEZINE @el
IAO_0000118: CLOFENTÉZINE @fr
IAO_0000118: KLOFENTESIIN @et
IAO_0000118: KLOFENTETSIINI @fi
IAO_0000118: KLOFENTEZIN @cs
IAO_0000118: KLOFENTEZINAS @lt
IAO_0000118: KLOFENTEZYNA @pl
IAO_0000118: KLOFENTEZÍN @sk
IAO_0000118: KLOFENTEZĪNS @lv
IAO_0000118: KLOFENTEŻINA @mt
IAO_0000118: КЛОФЕНТЕЗИН @bg
id: EUPH:3749
denoted by: 277-728-2
denoted by: 3,6-bis(2-chlorophenyl)-1,2,4,5-tetrazine
denoted by: 74115-24-5
denoted by: C14H8Cl2N4
denoted by: I06_02_01
denoted by: InChI=1S/C14H8Cl2N4/c15-11-7-3-1-5-9(11)13-17-19-14(20-18-13)10-6-2-4-8-12(10)16/h1-8H
denoted by: RF-0098-001-PPP

Axiom
annotated source: clofentezine
annotated property: denoted by
annotated target: 277-728-2
has db xref: https://w3id.org/euph/8101

Axiom
annotated source: clofentezine
annotated property: denoted by
annotated target: 3,6-bis(2-chlorophenyl)-1,2,4,5-tetrazine
has db xref: preferred IUPAC name (PIN)

Axiom
annotated source: clofentezine
annotated property: denoted by
annotated target: 74115-24-5
has db xref: CAS registry number

Axiom
annotated source: clofentezine
annotated property: denoted by
annotated target: C14H8Cl2N4
has db xref: molecular formula

Axiom
annotated source: clofentezine
annotated property: denoted by
annotated target: I06_02_01
has db xref: harmonised classification of substances code

Axiom
annotated source: clofentezine
annotated property: denoted by
annotated target: InChI=1S/C14H8Cl2N4/c15-11-7-3-1-5-9(11)13-17-19-14(20-18-13)10-6-2-4-8-12(10)16/h1-8H
has db xref: International Chemical Identifier (InChI)

Axiom
annotated source: clofentezine
annotated property: denoted by
annotated target: RF-0098-001-PPP
has db xref: EFSA DCF term code

tetrazine
type: Class
subclass of: organonitrogen heterocyclic compound
IAO_0000117: Michael Rubinigg
IAO_0000118: tetrazine
id: EUPH:6232

lambda-cyhalothrin
type: Class
subclass of: cyhalothrin
subclass of: Restriction
  on property: member of
  some values from: pyrethroid insecticides [I01_01]
IAO_0000117: Michael Rubinigg
IAO_0000118: LAMBDA CIHALOTRINAS @lt
IAO_0000118: LAMBDA-CIALOTRINA @it
IAO_0000118: LAMBDA-CIHALOTRIN @hr
IAO_0000118: LAMBDA-CIHALOTRINA @es
IAO_0000118: LAMBDA-CIHALOTRĪNS @lv
IAO_0000118: LAMBDA-CYHALOTHRIN @cs
IAO_0000118: LAMBDA-CYHALOTHRINE @fr
IAO_0000118: LAMBDA-CYHALOTRIN @sv
IAO_0000118: LAMBDA-CYHALOTRYNA @pl
IAO_0000118: LAMBDA-CYHALOTRÍN @sk
IAO_0000118: LAMBDA-SYHALOTRIINI @fi
IAO_0000118: LAMBDA-TSÜHALOTRIIN @et
IAO_0000118: LAMBDA-ĊJALOTRINA @mt
IAO_0000118: ЛАМБДА-ЦИХАЛОТРИН @bg
id: EUPH:3704
denoted by: 415-130-7
denoted by: 91465-08-6
denoted by: C23H19ClF3NO3
denoted by: CC1(C@
denoted by: I01_01_11
denoted by: RF-0261-001-PPP
denoted by: trans-[(R)-cyano-(3-phenoxyphenyl)methyl] (1S,3S)-3-[(Z)-2-chloro-3,3,3-trifluoroprop-1-enyl]-2,2-dimethylcyclopropane-1-carboxylate

Axiom
annotated source: lambda-cyhalothrin
annotated property: denoted by
annotated target: 415-130-7
has db xref: https://w3id.org/euph/8101

Axiom
annotated source: lambda-cyhalothrin
annotated property: denoted by
annotated target: 91465-08-6
has db xref: CAS registry number

Axiom
annotated source: lambda-cyhalothrin
annotated property: denoted by
annotated target: C23H19ClF3NO3
has db xref: molecular formula

Axiom
annotated source: lambda-cyhalothrin
annotated property: denoted by
annotated target: CC1(C@
has db xref: simplified molecular input line entry system (SMILES)

Axiom
annotated source: lambda-cyhalothrin
annotated property: denoted by
annotated target: I01_01_11
has db xref: harmonised classification of substances code

Axiom
annotated source: lambda-cyhalothrin
annotated property: denoted by
annotated target: RF-0261-001-PPP
has db xref: EFSA DCF term code

Axiom
annotated source: lambda-cyhalothrin
annotated property: denoted by
annotated target: trans-[(R)-cyano-(3-phenoxyphenyl)methyl] (1S,3S)-3-[(Z)-2-chloro-3,3,3-trifluoroprop-1-enyl]-2,2-dimethylcyclopropane-1-carboxylate
has db xref: preferred IUPAC name (PIN)

hexythiazox
type: Class
subclass of: thiazolidine
subclass of: Restriction
  on property: member of
  some values from: insect growth regulators [I99_06]
IAO_0000117: Michael Rubinigg
IAO_0000118: EKSITIJAŻOKS @mt
IAO_0000118: EXITIAZOX @it
IAO_0000118: HEKSITIAZOKS @hr
IAO_0000118: HEKSITIAZOKSAS @lt
IAO_0000118: HEKSITIAZOKSS @lv
IAO_0000118: HEKSYTIATSOKSI @fi
IAO_0000118: HEKSYTIAZOKS @pl
IAO_0000118: HEKSÜTIASOKS @et
IAO_0000118: HEXITIAZOX @es
IAO_0000118: HEXYTHIAZOX @cs
IAO_0000118: HEXYTIAZOX @sk
IAO_0000118: ХЕКСИТИАЗОКС @bg
id: EUPH:3768
denoted by: (4S,5S)-5-(4-chlorophenyl)-N-cyclohexyl-4-methyl-2-oxo-1,3-thiazolidine-3-carboxamide
denoted by: 616-638-3
denoted by: 78587-05-0
denoted by: C17H21ClN2O2S
denoted by: C[C@H]1C@
denoted by: I99_06_03
denoted by: RF-0242-001-PPP

Axiom
annotated source: hexythiazox
annotated property: denoted by
annotated target: (4S,5S)-5-(4-chlorophenyl)-N-cyclohexyl-4-methyl-2-oxo-1,3-thiazolidine-3-carboxamide
has db xref: preferred IUPAC name (PIN)

Axiom
annotated source: hexythiazox
annotated property: denoted by
annotated target: 616-638-3
has db xref: https://w3id.org/euph/8101

Axiom
annotated source: hexythiazox
annotated property: denoted by
annotated target: 78587-05-0
has db xref: CAS registry number

Axiom
annotated source: hexythiazox
annotated property: denoted by
annotated target: C17H21ClN2O2S
has db xref: molecular formula

Axiom
annotated source: hexythiazox
annotated property: denoted by
annotated target: C[C@H]1C@
has db xref: simplified molecular input line entry system (SMILES)

Axiom
annotated source: hexythiazox
annotated property: denoted by
annotated target: I99_06_03
has db xref: harmonised classification of substances code

Axiom
annotated source: hexythiazox
annotated property: denoted by
annotated target: RF-0242-001-PPP
has db xref: EFSA DCF term code

alpha-cypermethrin
type: Class
subclass of: racemate
subclass of: Restriction
  on property: member of
  some values from: pyrethroid insecticides [I01_01]
IAO_0000117: Michael Rubinigg
IAO_0000118: ALFA CIPERMETRINA @it
IAO_0000118: ALFA CIPERMETRINAS @lt
IAO_0000118: ALFA-CIPERMETRIN @hr
IAO_0000118: ALFA-CIPERMETRINA @pt
IAO_0000118: ALFA-CIPERMETRÍN @es
IAO_0000118: ALFA-CIPERMETRĪNS @lv
IAO_0000118: ALFA-CYPERMETHRIN @cs
IAO_0000118: ALFA-CYPERMETRIN @sv
IAO_0000118: ALFA-CYPERMETRÍN @sk
IAO_0000118: ALFA-SYPERMETRIINI @fi
IAO_0000118: ALFA-TSÜPERMETRIIN @et
IAO_0000118: ALFA-ĊIPERMETRINA @mt
IAO_0000118: ALFACYPERMETRYNA @pl
IAO_0000118: ALPHA-CYPERMETHRIN @da
IAO_0000118: ALPHA-CYPERMÉTHRINE @fr
IAO_0000118: АЛФА-ЦИПЕРМЕТРИН @bg
id: EUPH:3696
denoted by: 614-054-3
denoted by: 67375-30-8
denoted by: C22H19Cl2NO3
denoted by: CC1(C @hc
denoted by: I01_01_02
denoted by: InChI=1S/C22H19Cl2NO3/c1-22(2)17(12-19(23)24)20(22)21(26)28-18(13-25)14-7-6-10-16(11-14)27-15-8-4-3-5-9-15/h3-12,17-18,20H,1-2H3/t17-,18+,20-/m0/s1
denoted by: RF-00000161-VET
denoted by: trans-[(S)-cyano-(3-phenoxyphenyl)methyl] (1R,3R)-3-(2,2-dichloroethenyl)-2,2-dimethylcyclopropane-1-carboxylate

Axiom
annotated source: alpha-cypermethrin
annotated property: denoted by
annotated target: 614-054-3
has db xref: https://w3id.org/euph/8101

Axiom
annotated source: alpha-cypermethrin
annotated property: denoted by
annotated target: 67375-30-8
has db xref: CAS registry number

Axiom
annotated source: alpha-cypermethrin
annotated property: denoted by
annotated target: C22H19Cl2NO3
has db xref: molecular formula

Axiom
annotated source: alpha-cypermethrin
annotated property: denoted by
annotated target: CC1(C @hc
has db xref: simplified molecular input line entry system (SMILES)

Axiom
annotated source: alpha-cypermethrin
annotated property: denoted by
annotated target: I01_01_02
has db xref: harmonised classification of substances code

Axiom
annotated source: alpha-cypermethrin
annotated property: denoted by
annotated target: InChI=1S/C22H19Cl2NO3/c1-22(2)17(12-19(23)24)20(22)21(26)28-18(13-25)14-7-6-10-16(11-14)27-15-8-4-3-5-9-15/h3-12,17-18,20H,1-2H3/t17-,18+,20-/m0/s1
has db xref: International Chemical Identifier (InChI)

Axiom
annotated source: alpha-cypermethrin
annotated property: denoted by
annotated target: RF-00000161-VET
has db xref: EFSA DCF term code

Axiom
annotated source: alpha-cypermethrin
annotated property: denoted by
annotated target: trans-[(S)-cyano-(3-phenoxyphenyl)methyl] (1R,3R)-3-(2,2-dichloroethenyl)-2,2-dimethylcyclopropane-1-carboxylate
has db xref: preferred IUPAC name (PIN)

beta-cypermethrin
type: Class
subclass of: diastereoisomeric mixture
subclass of: Restriction
  on property: member of
  some values from: pyrethroid insecticides [I01_01]
IAO_0000117: Michael Rubinigg
IAO_0000118: BEETA-TSÜPERMETRIIN @et
IAO_0000118: BETA CIPERMETRINAS @lt
IAO_0000118: BETA-CIPERMETRIN @hr
IAO_0000118: BETA-CIPERMETRINA @it
IAO_0000118: BETA-CIPERMETRÍN @es
IAO_0000118: BETA-CIPERMETRĪNS @lv
IAO_0000118: BETA-CYPERMETHRIN @cs
IAO_0000118: BETA-CYPERMETRÍN @sk
IAO_0000118: BETA-SYPERMETRIINI @fi
IAO_0000118: BETA-ĊIPERMETRINA @mt
IAO_0000118: BETACYPERMETRIN @sv
IAO_0000118: BETACYPERMETRYNA @pl
IAO_0000118: BÉTA-CIPERMETRIN @hu
IAO_0000118: BÊTA-CYPERMÉTHRINE @fr
IAO_0000118: БЕТА-ЦИПЕРМЕТРИН @bg
id: EUPH:3708
denoted by: 265-898-0
denoted by: 65731-84-2
denoted by: C22H19Cl2NO3
denoted by: CC1(C@ @hc
denoted by: I01_01_15
denoted by: InChI=1S/C22H19Cl2NO3/c1-22(2)17(12-19(23)24)20(22)21(26)28-18(13-25)14-7-6-10-16(11-14)27-15-8-4-3-5-9-15/h3-12,17-18,20H,1-2H3/t17-,18?,20+/m1/s1
denoted by: RF-0112-003-PPP
denoted by: cis-[cyano-(3-phenoxyphenyl)methyl] (1R,3S)-3-(2,2-dichloroethenyl)-2,2-dimethylcyclopropane-1-carboxylate

Axiom
annotated source: beta-cypermethrin
annotated property: denoted by
annotated target: 265-898-0
has db xref: https://w3id.org/euph/8101

Axiom
annotated source: beta-cypermethrin
annotated property: denoted by
annotated target: 65731-84-2
has db xref: CAS registry number

Axiom
annotated source: beta-cypermethrin
annotated property: denoted by
annotated target: C22H19Cl2NO3
has db xref: molecular formula

Axiom
annotated source: beta-cypermethrin
annotated property: denoted by
annotated target: CC1(C@ @hc
has db xref: simplified molecular input line entry system (SMILES)

Axiom
annotated source: beta-cypermethrin
annotated property: denoted by
annotated target: I01_01_15
has db xref: harmonised classification of substances code

Axiom
annotated source: beta-cypermethrin
annotated property: denoted by
annotated target: InChI=1S/C22H19Cl2NO3/c1-22(2)17(12-19(23)24)20(22)21(26)28-18(13-25)14-7-6-10-16(11-14)27-15-8-4-3-5-9-15/h3-12,17-18,20H,1-2H3/t17-,18?,20+/m1/s1
has db xref: International Chemical Identifier (InChI)

Axiom
annotated source: beta-cypermethrin
annotated property: denoted by
annotated target: RF-0112-003-PPP
has db xref: EFSA DCF term code

Axiom
annotated source: beta-cypermethrin
annotated property: denoted by
annotated target: cis-[cyano-(3-phenoxyphenyl)methyl] (1R,3S)-3-(2,2-dichloroethenyl)-2,2-dimethylcyclopropane-1-carboxylate
has db xref: preferred IUPAC name (PIN)

theta-cypermethrin
type: Class
subclass of: diastereoisomeric mixture
subclass of: Restriction
  on property: part of
  some values from: beta-cypermethrin
IAO_0000117: Michael Rubinigg
IAO_0000118: theta-Cypermethrin
id: EUPH:6896
denoted by: 265-899-6
denoted by: 65732-07-2
denoted by: C22H19Cl2NO3
denoted by: CC1(C@ @hc
denoted by: I01_01_15
denoted by: InChI=1S/C22H19Cl2NO3/c1-22(2)17(12-19(23)24)20(22)21(26)28-18(13-25)14-7-6-10-16(11-14)27-15-8-4-3-5-9-15/h3-12,17-18,20H,1-2H3/t17-,18-,20+/m1/s1
denoted by: cis-[(S)-cyano-(3-phenoxyphenyl)methyl] (1R,3S)-3-(2,2-dichloroethenyl)-2,2-dimethylcyclopropane-1-carboxylate

Axiom
annotated source: theta-cypermethrin
annotated property: denoted by
annotated target: 265-899-6
has db xref: https://w3id.org/euph/8101

Axiom
annotated source: theta-cypermethrin
annotated property: denoted by
annotated target: 65732-07-2
has db xref: CAS registry number

Axiom
annotated source: theta-cypermethrin
annotated property: denoted by
annotated target: C22H19Cl2NO3
has db xref: molecular formula

Axiom
annotated source: theta-cypermethrin
annotated property: denoted by
annotated target: CC1(C@ @hc
has db xref: simplified molecular input line entry system (SMILES)

Axiom
annotated source: theta-cypermethrin
annotated property: denoted by
annotated target: I01_01_15
has db xref: harmonised classification of substances code

Axiom
annotated source: theta-cypermethrin
annotated property: denoted by
annotated target: InChI=1S/C22H19Cl2NO3/c1-22(2)17(12-19(23)24)20(22)21(26)28-18(13-25)14-7-6-10-16(11-14)27-15-8-4-3-5-9-15/h3-12,17-18,20H,1-2H3/t17-,18-,20+/m1/s1
has db xref: International Chemical Identifier (InChI)

Axiom
annotated source: theta-cypermethrin
annotated property: denoted by
annotated target: cis-[(S)-cyano-(3-phenoxyphenyl)methyl] (1R,3S)-3-(2,2-dichloroethenyl)-2,2-dimethylcyclopropane-1-carboxylate
has db xref: preferred IUPAC name (PIN)

zeta-cypermethrin
type: Class
subclass of: diastereoisomeric mixture
subclass of: Restriction
  on property: member of
  some values from: pyrethroid insecticides [I01_01]
IAO_0000117: Michael Rubinigg
IAO_0000118: DZEETA-TSÜPERMETRIIN @et
IAO_0000118: ZETA CIPERMETRINAS @lt
IAO_0000118: ZETA-CIPERMETRIN @hr
IAO_0000118: ZETA-CIPERMETRINA @it
IAO_0000118: ZETA-CIPERMETRÍN @es
IAO_0000118: ZETA-CIPERMETRĪNS @lv
IAO_0000118: ZETA-CYPERMETHRIN @cs
IAO_0000118: ZETA-CYPERMETRYNA @pl
IAO_0000118: ZETA-CYPERMETRÍN @sk
IAO_0000118: ZETA-SYPERMETRIINI @fi
IAO_0000118: ZETACYPERMETRIN @sv
IAO_0000118: ZÉTA-CIPERMETRIN @hu
IAO_0000118: ZÉTA-CYPERMÉTHRINE @fr
IAO_0000118: ŻETA-ĊIPERMETRINA @mt
IAO_0000118: ДЗЕТА-ЦИПЕРМЕТРИН @bg
id: EUPH:3707
denoted by: 257-842-9
denoted by: 52315-07-8
denoted by: C22H19Cl2NO3
denoted by: CC1(C(C1C(=O)OC(C#N)C2=CC(=CC=C2)OC3=CC=CC=C3)C=C(Cl)Cl)C
denoted by: I01_01_14
denoted by: InChI=1S/C22H19Cl2NO3/c1-22(2)17(12-19(23)24)20(22)21(26)28-18(13-25)14-7-6-10-16(11-14)27-15-8-4-3-5-9-15/h3-12,17-18,20H,1-2H3
denoted by: RF-0112-004-PPP
denoted by: [cyano-(3-phenoxyphenyl)methyl] 3-(2,2-dichloroethenyl)-2,2-dimethylcyclopropane-1-carboxylate

Axiom
annotated source: zeta-cypermethrin
annotated property: denoted by
annotated target: 257-842-9
has db xref: https://w3id.org/euph/8101

Axiom
annotated source: zeta-cypermethrin
annotated property: denoted by
annotated target: 52315-07-8
has db xref: CAS registry number

Axiom
annotated source: zeta-cypermethrin
annotated property: denoted by
annotated target: C22H19Cl2NO3
has db xref: molecular formula

Axiom
annotated source: zeta-cypermethrin
annotated property: denoted by
annotated target: CC1(C(C1C(=O)OC(C#N)C2=CC(=CC=C2)OC3=CC=CC=C3)C=C(Cl)Cl)C
has db xref: simplified molecular input line entry system (SMILES)

Axiom
annotated source: zeta-cypermethrin
annotated property: denoted by
annotated target: I01_01_14
has db xref: harmonised classification of substances code

Axiom
annotated source: zeta-cypermethrin
annotated property: denoted by
annotated target: InChI=1S/C22H19Cl2NO3/c1-22(2)17(12-19(23)24)20(22)21(26)28-18(13-25)14-7-6-10-16(11-14)27-15-8-4-3-5-9-15/h3-12,17-18,20H,1-2H3
has db xref: International Chemical Identifier (InChI)

Axiom
annotated source: zeta-cypermethrin
annotated property: denoted by
annotated target: RF-0112-004-PPP
has db xref: EFSA DCF term code

Axiom
annotated source: zeta-cypermethrin
annotated property: denoted by
annotated target: [cyano-(3-phenoxyphenyl)methyl] 3-(2,2-dichloroethenyl)-2,2-dimethylcyclopropane-1-carboxylate
has db xref: preferred IUPAC name (PIN)

esfenvalerate
type: Class
subclass of: fenvalerate
subclass of: Restriction
  on property: member of
  some values from: pyrethroid insecticides [I01_01]
IAO_0000117: Michael Rubinigg
IAO_0000118: ESFENVALERAAT @et
IAO_0000118: ESFENVALERAATTI @fi
IAO_0000118: ESFENVALERAT @da
IAO_0000118: ESFENVALERATAS @lt
IAO_0000118: ESFENVALERATE @el
IAO_0000118: ESFENVALERATO @es
IAO_0000118: ESFENVALERÁT @cs
IAO_0000118: ESFENVALERĀTS @lv
IAO_0000118: ESFENVALÉRATE @fr
IAO_0000118: ESFENWALERAT @pl
IAO_0000118: ESZFENVALERÁT @hu
IAO_0000118: ЕСФЕНВАЛЕРАТ @bg
id: EUPH:3701
denoted by: 613-911-9
denoted by: 66230-04-4
denoted by: C25H22ClNO3
denoted by: CC(C)C@@HC(=O)OC
denoted by: I01_01_08
denoted by: RF-0690-003-PPP
denoted by: [(S)-cyano-(3-phenoxyphenyl)methyl] (2S)-2-(4-chlorophenyl)-3-methylbutanoate

Axiom
annotated source: esfenvalerate
annotated property: denoted by
annotated target: 613-911-9
has db xref: https://w3id.org/euph/8101

Axiom
annotated source: esfenvalerate
annotated property: denoted by
annotated target: 66230-04-4
has db xref: CAS registry number

Axiom
annotated source: esfenvalerate
annotated property: denoted by
annotated target: C25H22ClNO3
has db xref: molecular formula

Axiom
annotated source: esfenvalerate
annotated property: denoted by
annotated target: CC(C)C@@HC(=O)OC
has db xref: simplified molecular input line entry system (SMILES)

Axiom
annotated source: esfenvalerate
annotated property: denoted by
annotated target: I01_01_08
has db xref: harmonised classification of substances code

Axiom
annotated source: esfenvalerate
annotated property: denoted by
annotated target: RF-0690-003-PPP
has db xref: EFSA DCF term code

Axiom
annotated source: esfenvalerate
annotated property: denoted by
annotated target: [(S)-cyano-(3-phenoxyphenyl)methyl] (2S)-2-(4-chlorophenyl)-3-methylbutanoate
has db xref: preferred IUPAC name (PIN)

etofenprox
type: Class
subclass of: aromatic ether
subclass of: Restriction
  on property: member of
  some values from: pyrethroid insecticides [I01_01]
IAO_0000117: Michael Rubinigg
IAO_0000118: ETOFEENPROKS @et
IAO_0000118: ETOFENPROKS @hr
IAO_0000118: ETOFENPROKSAS @lt
IAO_0000118: ETOFENPROKSI @fi
IAO_0000118: ETOFENPROKSS @lv
IAO_0000118: ETOFENPROX @cs
IAO_0000118: ETOFÉNPROX @hu
IAO_0000118: ÉTOFENPROX @fr
IAO_0000118: ЕТОФЕНПРОКС @bg
id: EUPH:3702
denoted by: 1-ethoxy-4-[2-methyl-1-[(3-phenoxyphenyl)methoxy]propan-2-yl]benzene
denoted by: 407-980-2
denoted by: 80844-07-1
denoted by: C25H28O3
denoted by: I01_01_09
denoted by: InChI=1S/C25H28O3/c1-4-27-22-15-13-21(14-16-22)25(2,3)19-26-18-20-9-8-12-24(17-20)28-23-10-6-5-7-11-23/h5-17H,4,18-19H2,1-3H3
denoted by: RF-0168-001-PPP

Axiom
annotated source: etofenprox
annotated property: denoted by
annotated target: 1-ethoxy-4-[2-methyl-1-[(3-phenoxyphenyl)methoxy]propan-2-yl]benzene
has db xref: preferred IUPAC name (PIN)

Axiom
annotated source: etofenprox
annotated property: denoted by
annotated target: 407-980-2
has db xref: https://w3id.org/euph/8101

Axiom
annotated source: etofenprox
annotated property: denoted by
annotated target: 80844-07-1
has db xref: CAS registry number

Axiom
annotated source: etofenprox
annotated property: denoted by
annotated target: C25H28O3
has db xref: molecular formula

Axiom
annotated source: etofenprox
annotated property: denoted by
annotated target: I01_01_09
has db xref: harmonised classification of substances code

Axiom
annotated source: etofenprox
annotated property: denoted by
annotated target: InChI=1S/C25H28O3/c1-4-27-22-15-13-21(14-16-22)25(2,3)19-26-18-20-9-8-12-24(17-20)28-23-10-6-5-7-11-23/h5-17H,4,18-19H2,1-3H3
has db xref: International Chemical Identifier (InChI)

Axiom
annotated source: etofenprox
annotated property: denoted by
annotated target: RF-0168-001-PPP
has db xref: EFSA DCF term code

tau-fluvalinate
type: Class
subclass of: fluvalinate
subclass of: Restriction
  on property: member of
  some values from: pyrethroid insecticides [I01_01]
IAO_0000117: Michael Rubinigg
IAO_0000118: TAU FLUVALINATAS @lt
IAO_0000118: TAU-FLUVALINAAT @et
IAO_0000118: TAU-FLUVALINAATTI @fi
IAO_0000118: TAU-FLUVALINAT @da
IAO_0000118: TAU-FLUVALINATE @el
IAO_0000118: TAU-FLUVALINATO @es
IAO_0000118: TAU-FLUVALINÁT @cs
IAO_0000118: TAU-FLUWALINAT @pl
IAO_0000118: TAUFLUVALINĀTS @lv
IAO_0000118: TAW-FLUVALINAT @mt
IAO_0000118: ТАУ-ФЛУВАЛИНАТ @bg
id: EUPH:3705
denoted by: 102851-06-9
denoted by: 600-363-0
denoted by: C26H22ClF3N2O3
denoted by: CC(C)C
denoted by: I01_01_12
denoted by: RF-0402-001-PPP
denoted by: [cyano-(3-phenoxyphenyl)methyl] (2R)-2-[2-chloro-4-(trifluoromethyl)anilino]-3-methylbutanoate

Axiom
annotated source: tau-fluvalinate
annotated property: denoted by
annotated target: 102851-06-9
has db xref: CAS registry number

Axiom
annotated source: tau-fluvalinate
annotated property: denoted by
annotated target: 600-363-0
has db xref: https://w3id.org/euph/8101

Axiom
annotated source: tau-fluvalinate
annotated property: denoted by
annotated target: C26H22ClF3N2O3
has db xref: molecular formula

Axiom
annotated source: tau-fluvalinate
annotated property: denoted by
annotated target: CC(C)C
has db xref: simplified molecular input line entry system (SMILES)

Axiom
annotated source: tau-fluvalinate
annotated property: denoted by
annotated target: I01_01_12
has db xref: harmonised classification of substances code

Axiom
annotated source: tau-fluvalinate
annotated property: denoted by
annotated target: RF-0402-001-PPP
has db xref: EFSA DCF term code

Axiom
annotated source: tau-fluvalinate
annotated property: denoted by
annotated target: [cyano-(3-phenoxyphenyl)methyl] (2R)-2-[2-chloro-4-(trifluoromethyl)anilino]-3-methylbutanoate
has db xref: preferred IUPAC name (PIN)

buprofezin
type: Class
subclass of: thiadiazinane
subclass of: Restriction
  on property: directly negatively regulates activity of
  some values from: chitin biosynthetic process
subclass of: Restriction
  on property: member of
  some values from: insect growth regulators [I99_06]
IAO_0000117: Michael Rubinigg
IAO_0000118: BUPROFESIIN @et
IAO_0000118: BUPROFETSIINI @fi
IAO_0000118: BUPROFEZIN @cs
IAO_0000118: BUPROFEZINA @es
IAO_0000118: BUPROFEZINAS @lt
IAO_0000118: BUPROFEZYNA @pl
IAO_0000118: BUPROFEZÍN @sk
IAO_0000118: BUPROFEZĪNS @lv
IAO_0000118: BUPROFEŻIN @mt
IAO_0000118: BUPROFÉZINE @fr
IAO_0000118: БУПРОФЕЗИН @bg
id: EUPH:3767
denoted by: 2-tert-butylimino-5-phenyl-3-propan-2-yl-1,3,5-thiadiazinan-4-one
denoted by: 614-948-3
denoted by: 69327-76-0
denoted by: C16H23N3OS
denoted by: I99_06_02
denoted by: InChI=1S/C16H23N3OS/c1-12(2)19-14(17-16(3,4)5)21-11-18(15(19)20)13-9-7-6-8-10-13/h6-10,12H,11H2,1-5H3
denoted by: RF-0056-001-PPP

Axiom
annotated source: buprofezin
annotated property: denoted by
annotated target: 2-tert-butylimino-5-phenyl-3-propan-2-yl-1,3,5-thiadiazinan-4-one
has db xref: preferred IUPAC name (PIN)

Axiom
annotated source: buprofezin
annotated property: denoted by
annotated target: 614-948-3
has db xref: https://w3id.org/euph/8101

Axiom
annotated source: buprofezin
annotated property: denoted by
annotated target: 69327-76-0
has db xref: CAS registry number

Axiom
annotated source: buprofezin
annotated property: denoted by
annotated target: C16H23N3OS
has db xref: molecular formula

Axiom
annotated source: buprofezin
annotated property: denoted by
annotated target: I99_06_02
has db xref: harmonised classification of substances code

Axiom
annotated source: buprofezin
annotated property: denoted by
annotated target: InChI=1S/C16H23N3OS/c1-12(2)19-14(17-16(3,4)5)21-11-18(15(19)20)13-9-7-6-8-10-13/h6-10,12H,11H2,1-5H3
has db xref: International Chemical Identifier (InChI)

Axiom
annotated source: buprofezin
annotated property: denoted by
annotated target: RF-0056-001-PPP
has db xref: EFSA DCF term code

lufenuron
type: Class
subclass of: dichlorobenzene
subclass of: Restriction
  on property: member of
  some values from: benzoylurea insecticides [I99_03]
IAO_0000117: Michael Rubinigg
IAO_0000118: LUFENURON @cs
IAO_0000118: LUFENURONAS @lt
IAO_0000118: LUFENURONI @fi
IAO_0000118: LUFENURONS @lv
IAO_0000118: LUFENUROON @et
IAO_0000118: LUFENURÃO @pt
IAO_0000118: LUFENURÓN @es
IAO_0000118: LUFÉNURON @fr
IAO_0000118: ЛУФЕНУРОН @bg
id: EUPH:3759
denoted by: 103055-07-8
denoted by: 410-690-9
denoted by: C17H8Cl2F8N2O3
denoted by: I99_03_03
denoted by: N-[[2,5-dichloro-4-(1,1,2,3,3,3-hexafluoropropoxy)phenyl]carbamoyl]-2,6-difluorobenzamide
denoted by: RF-0265-001-PPP

Axiom
annotated source: lufenuron
annotated property: denoted by
annotated target: 103055-07-8
has db xref: CAS registry number

Axiom
annotated source: lufenuron
annotated property: denoted by
annotated target: 410-690-9
has db xref: https://w3id.org/euph/8101

Axiom
annotated source: lufenuron
annotated property: denoted by
annotated target: C17H8Cl2F8N2O3
has db xref: molecular formula

Axiom
annotated source: lufenuron
annotated property: denoted by
annotated target: I99_03_03
has db xref: harmonised classification of substances code

Axiom
annotated source: lufenuron
annotated property: denoted by
annotated target: N-[[2,5-dichloro-4-(1,1,2,3,3,3-hexafluoropropoxy)phenyl]carbamoyl]-2,6-difluorobenzamide
has db xref: preferred IUPAC name (PIN)

Axiom
annotated source: lufenuron
annotated property: denoted by
annotated target: RF-0265-001-PPP
has db xref: EFSA DCF term code

teflubenzuron
type: Class
subclass of: dichlorobenzene
subclass of: Restriction
  on property: member of
  some values from: benzoylurea insecticides [I99_03]
IAO_0000117: Michael Rubinigg
IAO_0000118: TEFLUBENSUROON @et
IAO_0000118: TEFLUBENTSURONI @fi
IAO_0000118: TEFLUBENZURON @cs
IAO_0000118: TEFLUBENZURONAS @lt
IAO_0000118: TEFLUBENZURONS @lv
IAO_0000118: TEFLUBENZURÃO @pt
IAO_0000118: TEFLUBENZURÓN @es
IAO_0000118: TEFLUBENŻURON @mt
IAO_0000118: ТЕФЛУБЕНЗУРОН @bg
id: EUPH:3760
denoted by: 617-441-5
denoted by: 83121-18-0
denoted by: C14H6Cl2F4N2O2
denoted by: I99_03_05
denoted by: N-[(3,5-dichloro-2,4-difluorophenyl)carbamoyl]-2,6-difluorobenzamide
denoted by: RF-0407-001-PPP

Axiom
annotated source: teflubenzuron
annotated property: denoted by
annotated target: 617-441-5
has db xref: https://w3id.org/euph/8101

Axiom
annotated source: teflubenzuron
annotated property: denoted by
annotated target: 83121-18-0
has db xref: CAS registry number

Axiom
annotated source: teflubenzuron
annotated property: denoted by
annotated target: C14H6Cl2F4N2O2
has db xref: molecular formula

Axiom
annotated source: teflubenzuron
annotated property: denoted by
annotated target: I99_03_05
has db xref: harmonised classification of substances code

Axiom
annotated source: teflubenzuron
annotated property: denoted by
annotated target: N-[(3,5-dichloro-2,4-difluorophenyl)carbamoyl]-2,6-difluorobenzamide
has db xref: preferred IUPAC name (PIN)

Axiom
annotated source: teflubenzuron
annotated property: denoted by
annotated target: RF-0407-001-PPP
has db xref: EFSA DCF term code

triflumuron
type: Class
subclass of: monochlorobenzene
subclass of: Restriction
  on property: member of
  some values from: benzoylurea insecticides [I99_03]
IAO_0000117: Michael Rubinigg
IAO_0000118: TRIFLUMURON @cs
IAO_0000118: TRIFLUMURONAS @lt
IAO_0000118: TRIFLUMURONI @fi
IAO_0000118: TRIFLUMURONS @lv
IAO_0000118: TRIFLUMUROON @et
IAO_0000118: TRIFLUMURÃO @pt
IAO_0000118: TRIFLUMURÓN @es
IAO_0000118: ТРИФЛУМУРОН @bg
id: EUPH:3761
denoted by: 264-980-3
denoted by: 64628-44-0
denoted by: C15H10ClF3N2O3
denoted by: I99_03_06
denoted by: RF-0441-001-PPP

Axiom
annotated source: triflumuron
annotated property: denoted by
annotated target: 264-980-3
has db xref: https://w3id.org/euph/8101

Axiom
annotated source: triflumuron
annotated property: denoted by
annotated target: 64628-44-0
has db xref: CAS registry number

Axiom
annotated source: triflumuron
annotated property: denoted by
annotated target: C15H10ClF3N2O3
has db xref: molecular formula

Axiom
annotated source: triflumuron
annotated property: denoted by
annotated target: I99_03_06
has db xref: harmonised classification of substances code

Axiom
annotated source: triflumuron
annotated property: denoted by
annotated target: RF-0441-001-PPP
has db xref: EFSA DCF term code

limonoid
type: Class
subclass of: triterpenoid
IAO_0000117: Michael Rubinigg
IAO_0000118: limonoid
id: EUPH:4323

cyfluthrin
type: Class
subclass of: cyclopropanecarboxylate ester
subclass of: Restriction
  on property: member of
  some values from: pyrethroid insecticides [I01_01]
IAO_0000117: Michael Rubinigg
IAO_0000118: BEETA-TSÜFLUTRIIN @et
IAO_0000118: BETA CIFLUTRINAS @lt
IAO_0000118: BETA-CIFLUTRIN @hr
IAO_0000118: BETA-CIFLUTRINA @it
IAO_0000118: BETA-CIFLUTRÍN @es
IAO_0000118: BETA-CIFLUTRĪNS @lv
IAO_0000118: BETA-CYFLUTHRIN @cs
IAO_0000118: BETA-CYFLUTRIN @sv
IAO_0000118: BETA-CYFLUTRÍN @sk
IAO_0000118: BETA-SYFLUTRIINI @fi
IAO_0000118: BETA-ĊIFLUTRINA @mt
IAO_0000118: BETACYFLUTRYNA @pl
IAO_0000118: BÉTA-CIFLUTRIN @hu
IAO_0000118: BÉTA-CYFLUTHRINE @fr
IAO_0000118: БЕТА-ЦИФЛУТРИН @bg
id: EUPH:3697
denoted by: 269-855-7
denoted by: 68359-37-5
denoted by: C22H18Cl2FNO3
denoted by: I01_01_03
denoted by: RF-0108-003-PPP
denoted by: [cyano-(4-fluoro-3-phenoxyphenyl)methyl] 3-(2,2-dichloroethenyl)-2,2-dimethylcyclopropane-1-carboxylate

Axiom
annotated source: cyfluthrin
annotated property: denoted by
annotated target: 269-855-7
has db xref: https://w3id.org/euph/8101

Axiom
annotated source: cyfluthrin
annotated property: denoted by
annotated target: 68359-37-5
has db xref: CAS registry number

Axiom
annotated source: cyfluthrin
annotated property: denoted by
annotated target: C22H18Cl2FNO3
has db xref: molecular formula

Axiom
annotated source: cyfluthrin
annotated property: denoted by
annotated target: I01_01_03
has db xref: harmonised classification of substances code

Axiom
annotated source: cyfluthrin
annotated property: denoted by
annotated target: RF-0108-003-PPP
has db xref: EFSA DCF term code

Axiom
annotated source: cyfluthrin
annotated property: denoted by
annotated target: [cyano-(4-fluoro-3-phenoxyphenyl)methyl] 3-(2,2-dichloroethenyl)-2,2-dimethylcyclopropane-1-carboxylate
has db xref: preferred IUPAC name (PIN)

cyhalothrin
type: Class
subclass of: cyclopropanecarboxylate ester
IAO_0000117: Michael Rubinigg
IAO_0000118: CIALOTRINA @it
IAO_0000118: CIHALOTRIN @hr
IAO_0000118: CIHALOTRINA @es
IAO_0000118: CIHALOTRINAS @lt
IAO_0000118: CIHALOTRĪNS @lv
IAO_0000118: CYHALOTHRIN @cs
IAO_0000118: CYHALOTHRINE @fr
IAO_0000118: CYHALOTRIN @sv
IAO_0000118: CYHALOTRYNA @pl
IAO_0000118: CYHALOTRÍN @sk
IAO_0000118: SYHALOTRIINI @fi
IAO_0000118: TSÜHALOTRIIN @et
IAO_0000118: ĊJALOTRINA @mt
IAO_0000118: ЦИХАЛОТРИН @bg
id: EUPH:3422
denoted by: 268-450-2
denoted by: 68085-85-8
denoted by: C23H19ClF3NO3
denoted by: CC1(C(C1C(=O)OC(C#N)C2=CC(=CC=C2)OC3=CC=CC=C3)/C=C(/C(F)(F)F)\Cl)C
denoted by: RF-0584-001-PPP
denoted by: [cyano-(3-phenoxyphenyl)methyl] 3-[(Z)-2-chloro-3,3,3-trifluoroprop-1-enyl]-2,2-dimethylcyclopropane-1-carboxylate

Axiom
annotated source: cyhalothrin
annotated property: denoted by
annotated target: 268-450-2
has db xref: https://w3id.org/euph/8101

Axiom
annotated source: cyhalothrin
annotated property: denoted by
annotated target: 68085-85-8
has db xref: CAS registry number

Axiom
annotated source: cyhalothrin
annotated property: denoted by
annotated target: C23H19ClF3NO3
has db xref: molecular formula

Axiom
annotated source: cyhalothrin
annotated property: denoted by
annotated target: CC1(C(C1C(=O)OC(C#N)C2=CC(=CC=C2)OC3=CC=CC=C3)/C=C(/C(F)(F)F)\Cl)C
has db xref: simplified molecular input line entry system (SMILES)

Axiom
annotated source: cyhalothrin
annotated property: denoted by
annotated target: RF-0584-001-PPP
has db xref: EFSA DCF term code

Axiom
annotated source: cyhalothrin
annotated property: denoted by
annotated target: [cyano-(3-phenoxyphenyl)methyl] 3-[(Z)-2-chloro-3,3,3-trifluoroprop-1-enyl]-2,2-dimethylcyclopropane-1-carboxylate
has db xref: preferred IUPAC name (PIN)

cypermethrin
type: Class
subclass of: cyclopropanecarboxylate ester
subclass of: Restriction
  on property: member of
  some values from: pyrethroid insecticides [I01_01]
IAO_0000117: Michael Rubinigg
IAO_0000118: CIPERMETRIN @hr
IAO_0000118: CIPERMETRINA @it
IAO_0000118: CIPERMETRINAS @lt
IAO_0000118: CIPERMETRÍN @es
IAO_0000118: CIPERMETRĪNS @lv
IAO_0000118: CYPERMETHRIN @cs
IAO_0000118: CYPERMETRIN @sv
IAO_0000118: CYPERMETRYNA @pl
IAO_0000118: CYPERMETRÍN @sk
IAO_0000118: CYPERMÉTHRINE @fr
IAO_0000118: SYPERMETRIINI @fi
IAO_0000118: TSÜPERMETRIIN @et
IAO_0000118: ĊIPERMETRINA @mt
IAO_0000118: ЦИПЕРМЕТРИН @bg
id: EUPH:3699
denoted by: 257-842-9
denoted by: 52315-07-8
denoted by: C22H19Cl2NO3
denoted by: CC1(C(C1C(=O)OC(C#N)C2=CC(=CC=C2)OC3=CC=CC=C3)C=C(Cl)Cl)C
denoted by: I01_01_06
denoted by: InChI=1S/C22H19Cl2NO3/c1-22(2)17(12-19(23)24)20(22)21(26)28-18(13-25)14-7-6-10-16(11-14)27-15-8-4-3-5-9-15/h3-12,17-18,20H,1-2H3
denoted by: RF-0112-004-PPP
denoted by: [cyano-(3-phenoxyphenyl)methyl] 3-(2,2-dichloroethenyl)-2,2-dimethylcyclopropane-1-carboxylate

Axiom
annotated source: cypermethrin
annotated property: denoted by
annotated target: 257-842-9
has db xref: https://w3id.org/euph/8101

Axiom
annotated source: cypermethrin
annotated property: denoted by
annotated target: 52315-07-8
has db xref: CAS registry number

Axiom
annotated source: cypermethrin
annotated property: denoted by
annotated target: C22H19Cl2NO3
has db xref: molecular formula

Axiom
annotated source: cypermethrin
annotated property: denoted by
annotated target: CC1(C(C1C(=O)OC(C#N)C2=CC(=CC=C2)OC3=CC=CC=C3)C=C(Cl)Cl)C
has db xref: simplified molecular input line entry system (SMILES)

Axiom
annotated source: cypermethrin
annotated property: denoted by
annotated target: I01_01_06
has db xref: harmonised classification of substances code

Axiom
annotated source: cypermethrin
annotated property: denoted by
annotated target: InChI=1S/C22H19Cl2NO3/c1-22(2)17(12-19(23)24)20(22)21(26)28-18(13-25)14-7-6-10-16(11-14)27-15-8-4-3-5-9-15/h3-12,17-18,20H,1-2H3
has db xref: International Chemical Identifier (InChI)

Axiom
annotated source: cypermethrin
annotated property: denoted by
annotated target: RF-0112-004-PPP
has db xref: EFSA DCF term code

Axiom
annotated source: cypermethrin
annotated property: denoted by
annotated target: [cyano-(3-phenoxyphenyl)methyl] 3-(2,2-dichloroethenyl)-2,2-dimethylcyclopropane-1-carboxylate
has db xref: preferred IUPAC name (PIN)

5-hydroxymethylfurfural
type: Class
subclass of: furan
subclass of: Restriction
  on property: derives from
  some values from: glucose
subclass of: Restriction
  on property: derives from
  some values from: fructose
IAO_0000117: Michael Rubinigg
IAO_0000118: HMF @bg
IAO_0000118: Hydroxymethylfurfural @de
IAO_0000118: hidroksimetilfurfural @hr
IAO_0000118: hidroksimetilfurfurala @sl
IAO_0000118: hidroksimetilfurfurola @lv
IAO_0000118: hidroksimetilfurfurolas @lt
IAO_0000118: hidroximetil-furfurol @hu
IAO_0000118: hidroximetilfurfural @es
IAO_0000118: hydroksimetyylifurfuraal @fi
IAO_0000118: hydroksymetylofurfural @pl
IAO_0000118: hydroximetylfurfural @sv
IAO_0000118: hydroxymethylfurfural @cs
IAO_0000118: hydroxymetylfurfural @sk
IAO_0000118: hydroxyméthylfurfural @fr
IAO_0000118: hüdroksümetüülfurfuraal @et
IAO_0000118: idrossimetilfurfurale @it
IAO_0000118: υδροξυμεθυλοφουρφουράλη @el
IAO_0000118: хидроксиметилфурфурол @bg
id: EUPH:3709
denoted by: 200-654-9
denoted by: 5-(hydroxymethyl)furan-2-carbaldehyde
denoted by: 67-47-0
denoted by: C1=C(OC(=C1)C=O)CO
denoted by: C6H6O3
denoted by: InChI=1S/C6H6O3/c7-3-5-1-2-6(4-8)9-5/h1-3,8H,4H2

Axiom
annotated source: 5-hydroxymethylfurfural
annotated property: denoted by
annotated target: 200-654-9
has db xref: https://w3id.org/euph/8101

Axiom
annotated source: 5-hydroxymethylfurfural
annotated property: denoted by
annotated target: 5-(hydroxymethyl)furan-2-carbaldehyde
has db xref: preferred IUPAC name (PIN)

Axiom
annotated source: 5-hydroxymethylfurfural
annotated property: denoted by
annotated target: 67-47-0
has db xref: CAS registry number

Axiom
annotated source: 5-hydroxymethylfurfural
annotated property: denoted by
annotated target: C1=C(OC(=C1)C=O)CO
has db xref: simplified molecular input line entry system (SMILES)

Axiom
annotated source: 5-hydroxymethylfurfural
annotated property: denoted by
annotated target: C6H6O3
has db xref: molecular formula

Axiom
annotated source: 5-hydroxymethylfurfural
annotated property: denoted by
annotated target: InChI=1S/C6H6O3/c7-3-5-1-2-6(4-8)9-5/h1-3,8H,4H2
has db xref: International Chemical Identifier (InChI)

deltamethrin
type: Class
subclass of: cyclopropanecarboxylate ester
subclass of: Restriction
  on property: directly negatively regulates activity of
  some values from: protein-serine/threonine phosphatase
subclass of: Restriction
  on property: member of
  some values from: pyrethroid insecticides [I01_01]
IAO_0000117: Michael Rubinigg
IAO_0000118: DELTAMETHRIN @cs
IAO_0000118: DELTAMETRIIN @et
IAO_0000118: DELTAMETRIINI @fi
IAO_0000118: DELTAMETRIN @hr
IAO_0000118: DELTAMETRINA @it
IAO_0000118: DELTAMETRINAS @lt
IAO_0000118: DELTAMETRYNA @pl
IAO_0000118: DELTAMETRÍN @es
IAO_0000118: DELTAMETRĪNS @lv
IAO_0000118: DELTAMÉTHRINE @fr
IAO_0000118: ДЕЛТАМЕТРИН @bg
id: EUPH:3700
denoted by: 258-256-6
denoted by: 52918-63-5
denoted by: C22H19Br2NO3
denoted by: CC1(C @hc
denoted by: I01_01_07
denoted by: InChI=1S/C22H19Br2NO3/c1-22(2)17(12-19(23)24)20(22)21(26)28-18(13-25)14-7-6-10-16(11-14)27-15-8-4-3-5-9-15/h3-12,17-18,20H,1-2H3/t17-,18+,20-/m0/s1
denoted by: RF-0120-001-PPP
denoted by: trans-[(S)-cyano-(3-phenoxyphenyl)methyl] (1R,3R)-3-(2,2-dibromoethenyl)-2,2-dimethylcyclopropane-1-carboxylate

Axiom
annotated source: deltamethrin
annotated property: denoted by
annotated target: 258-256-6
has db xref: https://w3id.org/euph/8101

Axiom
annotated source: deltamethrin
annotated property: denoted by
annotated target: 52918-63-5
has db xref: CAS registry number

Axiom
annotated source: deltamethrin
annotated property: denoted by
annotated target: C22H19Br2NO3
has db xref: molecular formula

Axiom
annotated source: deltamethrin
annotated property: denoted by
annotated target: CC1(C @hc
has db xref: simplified molecular input line entry system (SMILES)

Axiom
annotated source: deltamethrin
annotated property: denoted by
annotated target: I01_01_07
has db xref: harmonised classification of substances code

Axiom
annotated source: deltamethrin
annotated property: denoted by
annotated target: InChI=1S/C22H19Br2NO3/c1-22(2)17(12-19(23)24)20(22)21(26)28-18(13-25)14-7-6-10-16(11-14)27-15-8-4-3-5-9-15/h3-12,17-18,20H,1-2H3/t17-,18+,20-/m0/s1
has db xref: International Chemical Identifier (InChI)

Axiom
annotated source: deltamethrin
annotated property: denoted by
annotated target: RF-0120-001-PPP
has db xref: EFSA DCF term code

Axiom
annotated source: deltamethrin
annotated property: denoted by
annotated target: trans-[(S)-cyano-(3-phenoxyphenyl)methyl] (1R,3R)-3-(2,2-dibromoethenyl)-2,2-dimethylcyclopropane-1-carboxylate
has db xref: preferred IUPAC name (PIN)

2-hydroxy monocarboxylic acid
type: Class
subclass of: hydroxy monocarboxylic acid
IAO_0000117: Michael Rubinigg
IAO_0000118: 2-hydroxy monocarboxylic acid
id: EUPH:8222

fenoxycarb
type: Class
subclass of: carbamate ester
subclass of: Restriction
  on property: member of
  some values from: carbamate insecticides [I03_02]
IAO_0000117: Michael Rubinigg
IAO_0000118: FENOKSIKARB @hr
IAO_0000118: FENOKSIKARBAS @lt
IAO_0000118: FENOKSIKARBI @fi
IAO_0000118: FENOKSIKARBS @lv
IAO_0000118: FENOKSYKARB @pl
IAO_0000118: FENOKSÜKARB @et
IAO_0000118: FENOXICARB @es
IAO_0000118: FENOXICARBE @pt
IAO_0000118: FENOXIKARB @hu
IAO_0000118: FENOXYCARB @da
IAO_0000118: FENOXYKARB @cs
IAO_0000118: FÉNOXYCARBE @fr
IAO_0000118: ФЕНОКСИКАРБ @bg
id: EUPH:3714
denoted by: 276-696-7
denoted by: 72490-01-8
denoted by: C17H19NO4
denoted by: CCOC(=O)NCCOC1=CC=C(C=C1)OC2=CC=CC=C2
denoted by: I03_02_01
denoted by: InChI=1S/C17H19NO4/c1-2-20-17(19)18-12-13-21-14-8-10-16(11-9-14)22-15-6-4-3-5-7-15/h3-11H,2,12-13H2,1H3,(H,18,19)
denoted by: RF-0182-001-PPP
denoted by: ethyl N-[2-(4-phenoxyphenoxy)ethyl]carbamate

Axiom
annotated source: fenoxycarb
annotated property: denoted by
annotated target: 276-696-7
has db xref: https://w3id.org/euph/8101

Axiom
annotated source: fenoxycarb
annotated property: denoted by
annotated target: 72490-01-8
has db xref: CAS registry number

Axiom
annotated source: fenoxycarb
annotated property: denoted by
annotated target: C17H19NO4
has db xref: molecular formula

Axiom
annotated source: fenoxycarb
annotated property: denoted by
annotated target: CCOC(=O)NCCOC1=CC=C(C=C1)OC2=CC=CC=C2
has db xref: simplified molecular input line entry system (SMILES)

Axiom
annotated source: fenoxycarb
annotated property: denoted by
annotated target: I03_02_01
has db xref: harmonised classification of substances code

Axiom
annotated source: fenoxycarb
annotated property: denoted by
annotated target: InChI=1S/C17H19NO4/c1-2-20-17(19)18-12-13-21-14-8-10-16(11-9-14)22-15-6-4-3-5-7-15/h3-11H,2,12-13H2,1H3,(H,18,19)
has db xref: International Chemical Identifier (InChI)

Axiom
annotated source: fenoxycarb
annotated property: denoted by
annotated target: RF-0182-001-PPP
has db xref: EFSA DCF term code

Axiom
annotated source: fenoxycarb
annotated property: denoted by
annotated target: ethyl N-[2-(4-phenoxyphenoxy)ethyl]carbamate
has db xref: preferred IUPAC name (PIN)

fenpyroximate
type: Class
subclass of: pyrazole
subclass of: Restriction
  on property: member of
  some values from: pyrazole acaricide [I06_01]
IAO_0000117: Michael Rubinigg
IAO_0000118: FENEPIROXIMATO @pt
IAO_0000118: FENPIROKSIMAT @hr
IAO_0000118: FENPIROKSIMATAS @lt
IAO_0000118: FENPIROKSIMĀTS @lv
IAO_0000118: FENPIROKSYMAT @pl
IAO_0000118: FENPIROSSIMAT @mt
IAO_0000118: FENPIROSSIMATO @it
IAO_0000118: FENPIROXIMAT @ro
IAO_0000118: FENPIROXIMATO @es
IAO_0000118: FENPIROXIMÁT @hu
IAO_0000118: FENPYROKSIMAATTI @fi
IAO_0000118: FENPYROXIMAAT @nl
IAO_0000118: FENPYROXIMAT @da
IAO_0000118: FENPYROXIMATE @el
IAO_0000118: FENPYROXIMÁT @cs
IAO_0000118: FENPÜROKSIMAAT @et
IAO_0000118: ФЕНПИРОКСИМАТ @bg
id: EUPH:3748
denoted by: 134098-61-6
denoted by: 603-792-1
denoted by: C24H27N3O4
denoted by: I06_01_01
denoted by: InChI=1S/C24H27N3O4/c1-17-21(22(27(5)26-17)30-20-9-7-6-8-10-20)15-25-29-16-18-11-13-19(14-12-18)23(28)31-24(2,3)4/h6-15H,16H2,1-5H3/b25-15+
denoted by: RF-0186-001-PPP
denoted by: tert-butyl 4-[[(E)-(1,3-dimethyl-5-phenoxypyrazol-4-yl)methylideneamino]oxymethyl]benzoate

Axiom
annotated source: fenpyroximate
annotated property: denoted by
annotated target: 134098-61-6
has db xref: CAS registry number

Axiom
annotated source: fenpyroximate
annotated property: denoted by
annotated target: 603-792-1
has db xref: https://w3id.org/euph/8101

Axiom
annotated source: fenpyroximate
annotated property: denoted by
annotated target: C24H27N3O4
has db xref: molecular formula

Axiom
annotated source: fenpyroximate
annotated property: denoted by
annotated target: I06_01_01
has db xref: harmonised classification of substances code

Axiom
annotated source: fenpyroximate
annotated property: denoted by
annotated target: InChI=1S/C24H27N3O4/c1-17-21(22(27(5)26-17)30-20-9-7-6-8-10-20)15-25-29-16-18-11-13-19(14-12-18)23(28)31-24(2,3)4/h6-15H,16H2,1-5H3/b25-15+
has db xref: International Chemical Identifier (InChI)

Axiom
annotated source: fenpyroximate
annotated property: denoted by
annotated target: RF-0186-001-PPP
has db xref: EFSA DCF term code

Axiom
annotated source: fenpyroximate
annotated property: denoted by
annotated target: tert-butyl 4-[[(E)-(1,3-dimethyl-5-phenoxypyrazol-4-yl)methylideneamino]oxymethyl]benzoate
has db xref: preferred IUPAC name (PIN)

fenvalerate
type: Class
subclass of: carboxylic ester
IAO_0000117: Michael Rubinigg
IAO_0000118: fenvalerate
IAO_0000118: fenvalerate/esfenvalerate (sum)
id: EUPH:6893
denoted by: 257-326-3
denoted by: 51630-58-1
denoted by: C25H22ClNO3
denoted by: CC(C)C(C1=CC=C(C=C1)Cl)C(=O)OC(C#N)C2=CC(=CC=C2)OC3=CC=CC=C3
denoted by: F-0690-001-PPP
denoted by: InChI=1S/C25H22ClNO3/c1-17(2)24(18-11-13-20(26)14-12-18)25(28)30-23(16-27)19-7-6-10-22(15-19)29-21-8-4-3-5-9-21/h3-15,17,23-24H,1-2H3
denoted by: [cyano-(3-phenoxyphenyl)methyl] 2-(4-chlorophenyl)-3-methylbutanoate

Axiom
annotated source: fenvalerate
annotated property: denoted by
annotated target: 257-326-3
has db xref: https://w3id.org/euph/8101

Axiom
annotated source: fenvalerate
annotated property: denoted by
annotated target: 51630-58-1
has db xref: CAS registry number

Axiom
annotated source: fenvalerate
annotated property: denoted by
annotated target: C25H22ClNO3
has db xref: molecular formula

Axiom
annotated source: fenvalerate
annotated property: denoted by
annotated target: CC(C)C(C1=CC=C(C=C1)Cl)C(=O)OC(C#N)C2=CC(=CC=C2)OC3=CC=CC=C3
has db xref: simplified molecular input line entry system (SMILES)

Axiom
annotated source: fenvalerate
annotated property: denoted by
annotated target: F-0690-001-PPP
has db xref: EFSA DCF term code

Axiom
annotated source: fenvalerate
annotated property: denoted by
annotated target: InChI=1S/C25H22ClNO3/c1-17(2)24(18-11-13-20(26)14-12-18)25(28)30-23(16-27)19-7-6-10-22(15-19)29-21-8-4-3-5-9-21/h3-15,17,23-24H,1-2H3
has db xref: International Chemical Identifier (InChI)

Axiom
annotated source: fenvalerate
annotated property: denoted by
annotated target: [cyano-(3-phenoxyphenyl)methyl] 2-(4-chlorophenyl)-3-methylbutanoate
has db xref: preferred IUPAC name (PIN)

cyclopropanecarboxylate ester
type: Class
subclass of: carboxylic ester
IAO_0000117: Michael Rubinigg
IAO_0000118: cyclopropanecarboxylate ester
id: EUPH:6578

butenolide
type: Class
subclass of: lactone
IAO_0000117: Michael Rubinigg
IAO_0000118: butenolide
id: EUPH:6604

fipronil
type: Class
subclass of: pyrazole
subclass of: Restriction
  on property: member of
  some values from: pyrazole (phenyl-)insecticides [I99_12]
IAO_0000117: Michael Rubinigg
IAO_0000118: FIPRONIIL @et
IAO_0000118: FIPRONIILI @fi
IAO_0000118: FIPRONIL @cs
IAO_0000118: FIPRONILAS @lt
IAO_0000118: FIPRONILS @lv
IAO_0000118: ФИПРОНИЛ @bg
id: EUPH:3773
denoted by: 120068-37-3
denoted by: 424-610-5
denoted by: 5-amino-1-[2,6-dichloro-4-(trifluoromethyl)phenyl]-4-(trifluoromethylsulfinyl)pyrazole-3-carbonitrile
denoted by: C12H4Cl2F6N4OS
denoted by: C1=C(C=C(C(=C1Cl)N2C(=C(C(=N2)C#N)S(=O)C(F)(F)F)N)Cl)C(F)(F)F
denoted by: I99_12_02
denoted by: RF-0192-003-PPP

Axiom
annotated source: fipronil
annotated property: denoted by
annotated target: 120068-37-3
has db xref: CAS registry number

Axiom
annotated source: fipronil
annotated property: denoted by
annotated target: 424-610-5
has db xref: https://w3id.org/euph/8101

Axiom
annotated source: fipronil
annotated property: denoted by
annotated target: 5-amino-1-[2,6-dichloro-4-(trifluoromethyl)phenyl]-4-(trifluoromethylsulfinyl)pyrazole-3-carbonitrile
has db xref: preferred IUPAC name (PIN)

Axiom
annotated source: fipronil
annotated property: denoted by
annotated target: C12H4Cl2F6N4OS
has db xref: molecular formula

Axiom
annotated source: fipronil
annotated property: denoted by
annotated target: C1=C(C=C(C(=C1Cl)N2C(=C(C(=N2)C#N)S(=O)C(F)(F)F)N)Cl)C(F)(F)F
has db xref: simplified molecular input line entry system (SMILES)

Axiom
annotated source: fipronil
annotated property: denoted by
annotated target: I99_12_02
has db xref: harmonised classification of substances code

Axiom
annotated source: fipronil
annotated property: denoted by
annotated target: RF-0192-003-PPP
has db xref: EFSA DCF term code

oligosaccharide
type: Class
subclass of: carbohydrate
IAO_0000117: Michael Rubinigg
IAO_0000118: Oligosaccharid @de
IAO_0000118: oligosaccharide
id: EUPH:918

organic molecular entity
type: Class
subclass of: molecular entity
IAO_0000117: Michael Rubinigg
IAO_0000118: organic molecular entity
id: EUPH:8190

fluvalinate
type: Class
subclass of: aromatic ether
IAO_0000117: Michael Rubinigg
IAO_0000118: FLUVALINAAT @et
IAO_0000118: FLUVALINAATTI @fi
IAO_0000118: FLUVALINAT @da
IAO_0000118: FLUVALINATAS @lt
IAO_0000118: FLUVALINATE @el
IAO_0000118: FLUVALINATO @es
IAO_0000118: FLUVALINÁT @cs
IAO_0000118: FLUVALINĀTS @lv
IAO_0000118: FLUWALINAT @pl
IAO_0000118: ФЛУВАЛИНАТ @bg
id: EUPH:3427
denoted by: 69409-94-5
denoted by: 805-993-1
denoted by: C26H22ClF3N2O3
denoted by: RF-0721-001-PPP
denoted by: [cyano-(3-phenoxyphenyl)methyl] 2-[2-chloro-4-(trifluoromethyl)anilino]-3-methylbutanoate

Axiom
annotated source: fluvalinate
annotated property: denoted by
annotated target: 69409-94-5
has db xref: CAS registry number

Axiom
annotated source: fluvalinate
annotated property: denoted by
annotated target: 805-993-1
has db xref: https://w3id.org/euph/8101

Axiom
annotated source: fluvalinate
annotated property: denoted by
annotated target: C26H22ClF3N2O3
has db xref: molecular formula

Axiom
annotated source: fluvalinate
annotated property: denoted by
annotated target: RF-0721-001-PPP
has db xref: EFSA DCF term code

Axiom
annotated source: fluvalinate
annotated property: denoted by
annotated target: [cyano-(3-phenoxyphenyl)methyl] 2-[2-chloro-4-(trifluoromethyl)anilino]-3-methylbutanoate
has db xref: preferred IUPAC name (PIN)

imidacloprid
type: Class
subclass of: chloropyridine
subclass of: Restriction
  on property: member of
  some values from: pyridymethylamine insecticides [I99_14]
IAO_0000117: Michael Rubinigg
IAO_0000118: IMIDACLOPRID @da
IAO_0000118: IMIDACLOPRIDE @fr
IAO_0000118: IMIDAKLOPRID @cs
IAO_0000118: IMIDAKLOPRIDAS @lt
IAO_0000118: IMIDAKLOPRIDI @fi
IAO_0000118: IMIDAKLOPRIID @et
IAO_0000118: IMIDAKLOPRYD @pl
IAO_0000118: IMIDAKLOPRĪDS @lv
IAO_0000118: ИМИДАКЛОПРИД @bg
id: EUPH:3780
denoted by: (NE)-N-[1-[(6-chloro-3-pyridinyl)methyl]imidazolidin-2-ylidene]nitramide
denoted by: 138261-41-3
denoted by: 428-040-8
denoted by: C1CN(/C(=N/N+[O-])/N1)CC2=CN=C(C=C2)Cl
denoted by: C9H10ClN5O2
denoted by: I99_14_02
denoted by: InChI=1S/C9H10ClN5O2/c10-8-2-1-7(5-12-8)6-14-4-3-11-9(14)13-15(16)17/h1-2,5H,3-4,6H2,(H,11,13)
denoted by: RF-0250-001-PPP

Axiom
annotated source: imidacloprid
annotated property: denoted by
annotated target: (NE)-N-[1-[(6-chloro-3-pyridinyl)methyl]imidazolidin-2-ylidene]nitramide
has db xref: preferred IUPAC name (PIN)

Axiom
annotated source: imidacloprid
annotated property: denoted by
annotated target: 138261-41-3
has db xref: CAS registry number

Axiom
annotated source: imidacloprid
annotated property: denoted by
annotated target: 428-040-8
has db xref: https://w3id.org/euph/8101

Axiom
annotated source: imidacloprid
annotated property: denoted by
annotated target: C1CN(/C(=N/N+[O-])/N1)CC2=CN=C(C=C2)Cl
has db xref: simplified molecular input line entry system (SMILES)

Axiom
annotated source: imidacloprid
annotated property: denoted by
annotated target: C9H10ClN5O2
has db xref: molecular formula

Axiom
annotated source: imidacloprid
annotated property: denoted by
annotated target: I99_14_02
has db xref: harmonised classification of substances code

Axiom
annotated source: imidacloprid
annotated property: denoted by
annotated target: InChI=1S/C9H10ClN5O2/c10-8-2-1-7(5-12-8)6-14-4-3-11-9(14)13-15(16)17/h1-2,5H,3-4,6H2,(H,11,13)
has db xref: International Chemical Identifier (InChI)

Axiom
annotated source: imidacloprid
annotated property: denoted by
annotated target: RF-0250-001-PPP
has db xref: EFSA DCF term code

mixture
type: Class
subclass of: chemical substance
IAO_0000117: Michael Rubinigg
IAO_0000118: mixture
id: EUPH:4131

amide fungicide
type: Class
subclass of: amide antifungal agent
IAO_0000117: Michael Rubinigg
IAO_0000118: amide fungicide
id: EUPH:8257

racemate
type: Class
subclass of: mixture
IAO_0000117: Michael Rubinigg
IAO_0000118: racemate
id: EUPH:6248

diastereoisomeric mixture
type: Class
subclass of: mixture
IAO_0000117: Michael Rubinigg
IAO_0000118: diastereoisomeric mixture
id: EUPH:4065

fatty acid derivative
type: Class
subclass of: lipid
IAO_0000117: Michael Rubinigg
IAO_0000118: Fettsäurederivat @de
IAO_0000118: fatty acid derivative
id: EUPH:5889

organic acid
type: Class
subclass of: organic molecular entity
IAO_0000117: Michael Rubinigg
IAO_0000118: organic acid
IAO_0000118: organische Säure @de
id: EUPH:8198

polysaccharide derivative
type: Class
subclass of: biomacromolecule
IAO_0000117: Michael Rubinigg
IAO_0000118: Polysaccharidderivat @de
IAO_0000118: polysaccharide derivative
id: EUPH:913

malathion
type: Class
subclass of: racemate
subclass of: Restriction
  on property: member of
  some values from: organophosphorus insecticides [I04_01]
IAO_0000117: Michael Rubinigg
IAO_0000118: MALATHION @cs
IAO_0000118: MALATIJON @mt
IAO_0000118: MALATION @hr
IAO_0000118: MALATIONAS @lt
IAO_0000118: MALATIONI @fi
IAO_0000118: MALATIONS @lv
IAO_0000118: MALATIOON @et
IAO_0000118: MALATIÃO @pt
IAO_0000118: MALATIÓN @es
IAO_0000118: МАЛАТИОН @bg
id: EUPH:3723
denoted by: 121-75-5
denoted by: 204-497-7
denoted by: C10H19O6PS2
denoted by: CCOC(=O)CC(C(=O)OCC)SP(=S)(OC)OC
denoted by: I04_01_07
denoted by: InChI=1S/C10H19O6PS2/c1-5-15-9(11)7-8(10(12)16-6-2)19-17(18,13-3)14-4/h8H,5-7H2,1-4H3
denoted by: RF-0266-003-PPP
denoted by: diethyl 2-dimethoxyphosphinothioylsulfanylbutanedioate

Axiom
annotated source: malathion
annotated property: denoted by
annotated target: 121-75-5
has db xref: CAS registry number

Axiom
annotated source: malathion
annotated property: denoted by
annotated target: 204-497-7
has db xref: https://w3id.org/euph/8101

Axiom
annotated source: malathion
annotated property: denoted by
annotated target: C10H19O6PS2
has db xref: molecular formula

Axiom
annotated source: malathion
annotated property: denoted by
annotated target: CCOC(=O)CC(C(=O)OCC)SP(=S)(OC)OC
has db xref: simplified molecular input line entry system (SMILES)

Axiom
annotated source: malathion
annotated property: denoted by
annotated target: I04_01_07
has db xref: harmonised classification of substances code

Axiom
annotated source: malathion
annotated property: denoted by
annotated target: InChI=1S/C10H19O6PS2/c1-5-15-9(11)7-8(10(12)16-6-2)19-17(18,13-3)14-4/h8H,5-7H2,1-4H3
has db xref: International Chemical Identifier (InChI)

Axiom
annotated source: malathion
annotated property: denoted by
annotated target: RF-0266-003-PPP
has db xref: EFSA DCF term code

Axiom
annotated source: malathion
annotated property: denoted by
annotated target: diethyl 2-dimethoxyphosphinothioylsulfanylbutanedioate
has db xref: preferred IUPAC name (PIN)

chlorantraniliprole
type: Class
subclass of: pyrazole
subclass of: Restriction
  on property: member of
  some values from: pyrazole (phenyl-)insecticides [I99_12]
IAO_0000117: Michael Rubinigg
IAO_0000118: CHLORANTRANILIPROL @cs
IAO_0000118: CHLORANTRANILIPROLAS @lt
IAO_0000118: CHLORANTRANILIPROLE @el
IAO_0000118: CLORANTRANILIPROL @es
IAO_0000118: CLORANTRANILIPROLE @it
IAO_0000118: HLORANTRANILIPROLS @lv
IAO_0000118: KLOORANTRANILIPROOL @et
IAO_0000118: KLORANTRANILIPROL @hr
IAO_0000118: KLORANTRANILIPROLI @fi
IAO_0000118: KLÓRANTRANILIPROL @hu
IAO_0000118: ХЛОРАНТРАНИЛИПРОЛ @bg
id: EUPH:3775
denoted by: 3-bromo-N-[4-chloro-2-methyl-6-(methylcarbamoyl)phenyl]-1-(3-chloro-2-pyridinyl)pyrazole-5-carboxamide
denoted by: 500008-45-7
denoted by: 610-489-8
denoted by: C18H14BrCl2N5O2
denoted by: I99_12_04
denoted by: RF-0072-001-PPP

Axiom
annotated source: chlorantraniliprole
annotated property: denoted by
annotated target: 3-bromo-N-[4-chloro-2-methyl-6-(methylcarbamoyl)phenyl]-1-(3-chloro-2-pyridinyl)pyrazole-5-carboxamide
has db xref: preferred IUPAC name (PIN)

Axiom
annotated source: chlorantraniliprole
annotated property: denoted by
annotated target: 500008-45-7
has db xref: CAS registry number

Axiom
annotated source: chlorantraniliprole
annotated property: denoted by
annotated target: 610-489-8
has db xref: https://w3id.org/euph/8101

Axiom
annotated source: chlorantraniliprole
annotated property: denoted by
annotated target: C18H14BrCl2N5O2
has db xref: molecular formula

Axiom
annotated source: chlorantraniliprole
annotated property: denoted by
annotated target: I99_12_04
has db xref: harmonised classification of substances code

Axiom
annotated source: chlorantraniliprole
annotated property: denoted by
annotated target: RF-0072-001-PPP
has db xref: EFSA DCF term code

melezitose
type: Class
subclass of: trisaccharide
subclass of: Restriction
  on property: has role
  some values from: macronutrient
subclass of: Restriction
  on property: part of
  some values from: https://w3id.org/euph/75
IAO_0000117: Michael Rubinigg
IAO_0000118: Melezitose @de
IAO_0000118: melezitose
id: EUPH:4050
denoted by: (2R,3R,4S,5S,6R)-2-[(2S,3S,4R,5R)-4-hydroxy-2,5-bis(hydroxymethyl)-2-[(2R,3R,4S,5S,6R)-3,4,5-trihydroxy-6-(hydroxymethyl)oxan-2-yl]oxyoxolan-3-yl]oxy-6-(hydroxymethyl)oxane-3,4,5-triol
denoted by: 209-894-9
denoted by: 597-12-6
denoted by: C([C@@H]1C @ho
denoted by: C18H32O16
denoted by: InChI=1S/C18H32O16/c19-1-5-8(23)11(26)13(28)16(30-5)32-15-10(25)7(3-21)33-18(15,4-22)34-17-14(29)12(27)9(24)6(2-20)31-17/h5-17,19-29H,1-4H2/t5-,6-,7-,8-,9-,10-,11+,12+,13-,14-,15+,16-,17-,18+/m1/s1

Axiom
annotated source: melezitose
annotated property: denoted by
annotated target: (2R,3R,4S,5S,6R)-2-[(2S,3S,4R,5R)-4-hydroxy-2,5-bis(hydroxymethyl)-2-[(2R,3R,4S,5S,6R)-3,4,5-trihydroxy-6-(hydroxymethyl)oxan-2-yl]oxyoxolan-3-yl]oxy-6-(hydroxymethyl)oxane-3,4,5-triol
has db xref: preferred IUPAC name (PIN)

Axiom
annotated source: melezitose
annotated property: denoted by
annotated target: 209-894-9
has db xref: https://w3id.org/euph/8101

Axiom
annotated source: melezitose
annotated property: denoted by
annotated target: 597-12-6
has db xref: CAS registry number

Axiom
annotated source: melezitose
annotated property: denoted by
annotated target: C([C@@H]1C @ho
has db xref: simplified molecular input line entry system (SMILES)

Axiom
annotated source: melezitose
annotated property: denoted by
annotated target: C18H32O16
has db xref: molecular formula

Axiom
annotated source: melezitose
annotated property: denoted by
annotated target: InChI=1S/C18H32O16/c19-1-5-8(23)11(26)13(28)16(30-5)32-15-10(25)7(3-21)33-18(15,4-22)34-17-14(29)12(27)9(24)6(2-20)31-17/h5-17,19-29H,1-4H2/t5-,6-,7-,8-,9-,10-,11+,12+,13-,14-,15+,16-,17-,18+/m1/s1
has db xref: International Chemical Identifier (InChI)

methomyl
type: Class
subclass of: carbamate ester
subclass of: Restriction
  on property: directly negatively regulates activity of
  some values from: acetylcholinesterase
subclass of: Restriction
  on property: member of
  some values from: oxime-carbamate insecticides [I03_01]
IAO_0000117: Michael Rubinigg
IAO_0000118: METHOMYL @cs
IAO_0000118: METOMIL @hr
IAO_0000118: METOMILAS @lt
IAO_0000118: METOMILO @es
IAO_0000118: METOMILS @lv
IAO_0000118: METOMYL @pl
IAO_0000118: METOMYYLI @fi
IAO_0000118: METOMÜÜL @et
IAO_0000118: MÉTHOMYL @fr
IAO_0000118: МЕТОМИЛ @bg
id: EUPH:3712
denoted by: 16752-77-5
denoted by: 240-815-0
denoted by: C5H10N2O2S
denoted by: CC(=NOC(=O)NC)SC
denoted by: I03_01_01
denoted by: InChI=1S/C5H10N2O2S/c1-4(10-3)7-9-5(8)6-2/h1-3H3,(H,6,8)
denoted by: RF-0293-003-PPP
denoted by: methyl N-(methylcarbamoyloxy)ethanimidothioate

Axiom
annotated source: methomyl
annotated property: denoted by
annotated target: 16752-77-5
has db xref: CAS registry number

Axiom
annotated source: methomyl
annotated property: denoted by
annotated target: 240-815-0
has db xref: https://w3id.org/euph/8101

Axiom
annotated source: methomyl
annotated property: denoted by
annotated target: C5H10N2O2S
has db xref: molecular formula

Axiom
annotated source: methomyl
annotated property: denoted by
annotated target: CC(=NOC(=O)NC)SC
has db xref: simplified molecular input line entry system (SMILES)

Axiom
annotated source: methomyl
annotated property: denoted by
annotated target: I03_01_01
has db xref: harmonised classification of substances code

Axiom
annotated source: methomyl
annotated property: denoted by
annotated target: InChI=1S/C5H10N2O2S/c1-4(10-3)7-9-5(8)6-2/h1-3H3,(H,6,8)
has db xref: International Chemical Identifier (InChI)

Axiom
annotated source: methomyl
annotated property: denoted by
annotated target: RF-0293-003-PPP
has db xref: EFSA DCF term code

Axiom
annotated source: methomyl
annotated property: denoted by
annotated target: methyl N-(methylcarbamoyloxy)ethanimidothioate
has db xref: preferred IUPAC name (PIN)

azole
type: Class
subclass of: organonitrogen heterocyclic compound
IAO_0000117: Michael Rubinigg
IAO_0000118: azole
id: EUPH:6128

dodine
type: Class
subclass of: aliphatic nitrogen antifungal agent
subclass of: Restriction
  on property: member of
  some values from: aliphatic nitrogen fungicides [F99_01]
IAO_0000117: Michael Rubinigg
IAO_0000118: DODIIN @et
IAO_0000118: DODIINI @fi
IAO_0000118: DODIN @cs
IAO_0000118: DODINA @es
IAO_0000118: DODINAS @lt
IAO_0000118: DODINE @el
IAO_0000118: DODINĂ @ro
IAO_0000118: DODYNA @pl
IAO_0000118: DODÍN @sk
IAO_0000118: DODĪNS @lv
IAO_0000118: ДОДИН @bg
id: EUPH:3496
denoted by: 2-dodecylguanidine acetate
denoted by: 219-459-5
denoted by: 2439-10-3
denoted by: C15H33N3O2
denoted by: CCCCCCCCCCCCN=C(N)N.CC(=O)O
denoted by: F99_01_02
denoted by: InChI=1S/C13H29N3.C2H4O2/c1-2-3-4-5-6-7-8-9-10-11-12-16-13(14)15;1-2(3)4/h2-12H2,1H3,(H4,14,15,16);1H3,(H,3,4)
denoted by: RF-0154-001-PPP

Axiom
annotated source: dodine
annotated property: denoted by
annotated target: 2-dodecylguanidine acetate
has db xref: preferred IUPAC name (PIN)

Axiom
annotated source: dodine
annotated property: denoted by
annotated target: 219-459-5
has db xref: https://w3id.org/euph/8101

Axiom
annotated source: dodine
annotated property: denoted by
annotated target: 2439-10-3
has db xref: CAS registry number

Axiom
annotated source: dodine
annotated property: denoted by
annotated target: C15H33N3O2
has db xref: molecular formula

Axiom
annotated source: dodine
annotated property: denoted by
annotated target: CCCCCCCCCCCCN=C(N)N.CC(=O)O
has db xref: simplified molecular input line entry system (SMILES)

Axiom
annotated source: dodine
annotated property: denoted by
annotated target: F99_01_02
has db xref: harmonised classification of substances code

Axiom
annotated source: dodine
annotated property: denoted by
annotated target: InChI=1S/C13H29N3.C2H4O2/c1-2-3-4-5-6-7-8-9-10-11-12-16-13(14)15;1-2(3)4/h2-12H2,1H3,(H4,14,15,16);1H3,(H,3,4)
has db xref: International Chemical Identifier (InChI)

Axiom
annotated source: dodine
annotated property: denoted by
annotated target: RF-0154-001-PPP
has db xref: EFSA DCF term code

lactic acid
type: Class
subclass of: 2-hydroxy monocarboxylic acid
subclass of: Restriction
  on property: is substance that treats
  some values from: varroosis of honey bees
IAO_0000117: Michael Rubinigg
IAO_0000118: 2-hydroxypropanoic acid
IAO_0000118: Milchsäure @de
IAO_0000118: acid lactic @ro
IAO_0000118: acide lactique @fr
IAO_0000118: acido lattico @it
IAO_0000118: lactic acid
IAO_0000118: melkesyre @no
IAO_0000118: melkzuur @nl
IAO_0000118: mjölksyra @sv
IAO_0000118: mælkesyre @da
IAO_0000118: ácido láctico @es
id: EUPH:8223
denoted by: 1S/C3H6O3/c1-2(4)3(5)6/h2,4H,1H3,(H,5,6)
denoted by: 2-hydroxypropanoic acid
denoted by: 200-018-0
denoted by: 50-21-5
denoted by: C3H6O3
denoted by: CC(C(=O)O)O

Axiom
annotated source: lactic acid
annotated property: denoted by
annotated target: 1S/C3H6O3/c1-2(4)3(5)6/h2,4H,1H3,(H,5,6)
has db xref: International Chemical Identifier (InChI)

Axiom
annotated source: lactic acid
annotated property: denoted by
annotated target: 2-hydroxypropanoic acid
has db xref: preferred IUPAC name (PIN)

Axiom
annotated source: lactic acid
annotated property: denoted by
annotated target: 200-018-0
has db xref: https://w3id.org/euph/8101

Axiom
annotated source: lactic acid
annotated property: denoted by
annotated target: 50-21-5
has db xref: CAS registry number

Axiom
annotated source: lactic acid
annotated property: denoted by
annotated target: C3H6O3
has db xref: molecular formula

Axiom
annotated source: lactic acid
annotated property: denoted by
annotated target: CC(C(=O)O)O
has db xref: simplified molecular input line entry system (SMILES)

fluopicolide
type: Class
subclass of: benzamide fungicide
subclass of: Restriction
  on property: member of
  some values from: amide fungicides [F99_02]
IAO_0000117: Michael Rubinigg
IAO_0000118: FLUOPICOLID @da
IAO_0000118: FLUOPICOLIDA @pt
IAO_0000118: FLUOPICOLIDE @el
IAO_0000118: FLUOPIKOLID @cs
IAO_0000118: FLUOPIKOLIDAS @lt
IAO_0000118: FLUOPIKOLIDI @fi
IAO_0000118: FLUOPIKOLIID @et
IAO_0000118: FLUOPIKOLĪDS @lv
IAO_0000118: FLUWOPIKOLID @mt
IAO_0000118: ФЛУОПИКОЛИД @bg
id: EUPH:3498
denoted by: 2,6-dichloro-N-[[3-chloro-5-(trifluoromethyl)-2-pyridinyl]methyl]benzamide
denoted by: 239110-15-7
denoted by: 607-285-6
denoted by: C14H8Cl3F3N2O
denoted by: F99_02_02
denoted by: RF-0208-001-PPP

Axiom
annotated source: fluopicolide
annotated property: denoted by
annotated target: 2,6-dichloro-N-[[3-chloro-5-(trifluoromethyl)-2-pyridinyl]methyl]benzamide
has db xref: preferred IUPAC name (PIN)

Axiom
annotated source: fluopicolide
annotated property: denoted by
annotated target: 239110-15-7
has db xref: CAS registry number

Axiom
annotated source: fluopicolide
annotated property: denoted by
annotated target: 607-285-6
has db xref: https://w3id.org/euph/8101

Axiom
annotated source: fluopicolide
annotated property: denoted by
annotated target: C14H8Cl3F3N2O
has db xref: molecular formula

Axiom
annotated source: fluopicolide
annotated property: denoted by
annotated target: F99_02_02
has db xref: harmonised classification of substances code

Axiom
annotated source: fluopicolide
annotated property: denoted by
annotated target: RF-0208-001-PPP
has db xref: EFSA DCF term code

penthiopyrad
type: Class
subclass of: amide fungicide
subclass of: Restriction
  on property: member of
  some values from: amide fungicides [F99_02]
IAO_0000117: Michael Rubinigg
IAO_0000118: PENTHIOPYRAD @cs
IAO_0000118: PENTHIOPYRADE @fr
IAO_0000118: PENTIJOPIRAD @mt
IAO_0000118: PENTIOPIRAD @es
IAO_0000118: PENTIOPIRADAS @lt
IAO_0000118: PENTIOPIRADE @pt
IAO_0000118: PENTIOPIRÁD @hu
IAO_0000118: PENTIOPIRĀDS @lv
IAO_0000118: PENTIOPYRAD @sk
IAO_0000118: PENTIOPYRADI @fi
IAO_0000118: PENTIOPÜRAAD @et
IAO_0000118: ПЕНТИОПИРАД @bg
id: EUPH:3503
denoted by: 1-methyl-N-[2-(4-methylpentan-2-yl)thiophen-3-yl]-3-(trifluoromethyl)-1H-pyrazole-4-carboxamide
denoted by: 183675-82-3
denoted by: 606-001-8
denoted by: C16H20F3N3OS
denoted by: F99_02_07
denoted by: InChI=1S/C16H20F3N3OS/c1-9(2)7-10(3)13-12(5-6-24-13)20-15(23)11-8-22(4)21-14(11)16(17,18)19/h5-6,8-10H,7H2,1-4H3,(H,20,23)
denoted by: RF-00002609-PAR

Axiom
annotated source: penthiopyrad
annotated property: denoted by
annotated target: 1-methyl-N-[2-(4-methylpentan-2-yl)thiophen-3-yl]-3-(trifluoromethyl)-1H-pyrazole-4-carboxamide
has db xref: preferred IUPAC name (PIN)

Axiom
annotated source: penthiopyrad
annotated property: denoted by
annotated target: 183675-82-3
has db xref: CAS registry number

Axiom
annotated source: penthiopyrad
annotated property: denoted by
annotated target: 606-001-8
has db xref: https://w3id.org/euph/8101

Axiom
annotated source: penthiopyrad
annotated property: denoted by
annotated target: C16H20F3N3OS
has db xref: molecular formula

Axiom
annotated source: penthiopyrad
annotated property: denoted by
annotated target: F99_02_07
has db xref: harmonised classification of substances code

Axiom
annotated source: penthiopyrad
annotated property: denoted by
annotated target: InChI=1S/C16H20F3N3OS/c1-9(2)7-10(3)13-12(5-6-24-13)20-15(23)11-8-22(4)21-14(11)16(17,18)19/h5-6,8-10H,7H2,1-4H3,(H,20,23)
has db xref: International Chemical Identifier (InChI)

Axiom
annotated source: penthiopyrad
annotated property: denoted by
annotated target: RF-00002609-PAR
has db xref: EFSA DCF term code

cymoxanil
type: Class
subclass of: aliphatic nitrogen antifungal agent
subclass of: Restriction
  on property: member of
  some values from: aliphatic nitrogen fungicides [F99_01]
IAO_0000117: Michael Rubinigg
IAO_0000118: CIMOKSANIL @hr
IAO_0000118: CIMOKSANILAS @lt
IAO_0000118: CIMOKSANILS @lv
IAO_0000118: CIMOXANIL @hu
IAO_0000118: CIMOXANILO @es
IAO_0000118: CYMOKSANIL @pl
IAO_0000118: CYMOXANIL @cs
IAO_0000118: SYMOKSANIILI @fi
IAO_0000118: TSÜMOKSANIIL @et
IAO_0000118: ĊIMOKSANIL @mt
IAO_0000118: ЦИМОКСАНИЛ @bg
id: EUPH:3495
denoted by: (1E)-2-(ethylcarbamoylamino)-N-methoxy-2-oxoethanimidoyl cyanide
denoted by: 261-043-0
denoted by: 57966-95-7
denoted by: C7H10N4O3
denoted by: CCNC(=O)NC(=O)/C(=N/OC)/C#N
denoted by: F99_01_01
denoted by: InChI=1S/C7H10N4O3/c1-3-9-7(13)10-6(12)5(4-8)11-14-2/h3H2,1-2H3,(H2,9,10,12,13)/b11-5+
denoted by: RF-0111-001-PPP

Axiom
annotated source: cymoxanil
annotated property: denoted by
annotated target: (1E)-2-(ethylcarbamoylamino)-N-methoxy-2-oxoethanimidoyl cyanide
has db xref: preferred IUPAC name (PIN)

Axiom
annotated source: cymoxanil
annotated property: denoted by
annotated target: 261-043-0
has db xref: https://w3id.org/euph/8101

Axiom
annotated source: cymoxanil
annotated property: denoted by
annotated target: 57966-95-7
has db xref: CAS registry number

Axiom
annotated source: cymoxanil
annotated property: denoted by
annotated target: C7H10N4O3
has db xref: molecular formula

Axiom
annotated source: cymoxanil
annotated property: denoted by
annotated target: CCNC(=O)NC(=O)/C(=N/OC)/C#N
has db xref: simplified molecular input line entry system (SMILES)

Axiom
annotated source: cymoxanil
annotated property: denoted by
annotated target: F99_01_01
has db xref: harmonised classification of substances code

Axiom
annotated source: cymoxanil
annotated property: denoted by
annotated target: InChI=1S/C7H10N4O3/c1-3-9-7(13)10-6(12)5(4-8)11-14-2/h3H2,1-2H3,(H2,9,10,12,13)/b11-5+
has db xref: International Chemical Identifier (InChI)

Axiom
annotated source: cymoxanil
annotated property: denoted by
annotated target: RF-0111-001-PPP
has db xref: EFSA DCF term code

cyflufenamid
type: Class
subclass of: amide fungicide
subclass of: Restriction
  on property: member of
  some values from: amide fungicides [F99_02]
IAO_0000117: Michael Rubinigg
IAO_0000118: CIFLUFENAMID @hr
IAO_0000118: CIFLUFENAMIDA @es
IAO_0000118: CIFLUFENAMIDAS @lt
IAO_0000118: CIFLUFENAMĪDS @lv
IAO_0000118: CYFLUFENAMID @cs
IAO_0000118: CYFLUFENAMIDE @nl
IAO_0000118: CYFLUFÉNAMIDE @fr
IAO_0000118: SYFLUFENAMIDI @fi
IAO_0000118: TSÜFLUFENAMIID @et
IAO_0000118: ĊIFLUFENAMID @mt
IAO_0000118: ЦИФЛУФЕНАМИД @bg
id: EUPH:3497
denoted by: 180409-60-3
denoted by: 605-896-2
denoted by: C20H17F5N2O2
denoted by: F99_02_01
denoted by: InChI=1S/C20H17F5N2O2/c21-15-9-8-14(20(23,24)25)17(18(15)22)19(27-29-11-13-6-7-13)26-16(28)10-12-4-2-1-3-5-12/h1-5,8-9,13H,6-7,10-11H2,(H,26,27,28)
denoted by: N-[(Z)-N-(cyclopropylmethoxy)-C-[2,3-difluoro-6-(trifluoromethyl)phenyl]carbonimidoyl]-2-phenylacetamide
denoted by: RF-00004819-PAR

Axiom
annotated source: cyflufenamid
annotated property: denoted by
annotated target: 180409-60-3
has db xref: CAS registry number

Axiom
annotated source: cyflufenamid
annotated property: denoted by
annotated target: 605-896-2
has db xref: https://w3id.org/euph/8101

Axiom
annotated source: cyflufenamid
annotated property: denoted by
annotated target: C20H17F5N2O2
has db xref: molecular formula

Axiom
annotated source: cyflufenamid
annotated property: denoted by
annotated target: F99_02_01
has db xref: harmonised classification of substances code

Axiom
annotated source: cyflufenamid
annotated property: denoted by
annotated target: InChI=1S/C20H17F5N2O2/c21-15-9-8-14(20(23,24)25)17(18(15)22)19(27-29-11-13-6-7-13)26-16(28)10-12-4-2-1-3-5-12/h1-5,8-9,13H,6-7,10-11H2,(H,26,27,28)
has db xref: International Chemical Identifier (InChI)

Axiom
annotated source: cyflufenamid
annotated property: denoted by
annotated target: N-[(Z)-N-(cyclopropylmethoxy)-C-[2,3-difluoro-6-(trifluoromethyl)phenyl]carbonimidoyl]-2-phenylacetamide
has db xref: preferred IUPAC name (PIN)

Axiom
annotated source: cyflufenamid
annotated property: denoted by
annotated target: RF-00004819-PAR
has db xref: EFSA DCF term code

mandipropamid
type: Class
subclass of: amide fungicide
subclass of: Restriction
  on property: member of
  some values from: amide fungicides [F99_02]
IAO_0000117: Michael Rubinigg
IAO_0000118: MANDIPROPAMID @cs
IAO_0000118: MANDIPROPAMIDA @pt
IAO_0000118: MANDIPROPAMIDAS @lt
IAO_0000118: MANDIPROPAMIDE @fr
IAO_0000118: MANDIPROPAMIDI @fi
IAO_0000118: MANDIPROPAMIID @et
IAO_0000118: MANDIPROPAMĪDS @lv
IAO_0000118: МАНДИПРОПАМИД @bg
id: EUPH:3502
denoted by: (RS)-2-(4-chlorophenyl)-N-[3-methoxy-4-(prop-2-ynyloxy)phenethyl]-2-(prop-2-ynyloxy)acetamide
denoted by: 374726-62-2
denoted by: 609-434-0
denoted by: C23H22ClNO4
denoted by: F99_02_06
denoted by: InChI=1S/C23H22ClNO4/c1-4-14-28-20-11-6-17(16-21(20)27-3)12-13-25-23(26)22(29-15-5-2)18-7-9-19(24)10-8-18/h1-2,6-11,16,22H,12-15H2,3H3,(H,25,26)
denoted by: RF-0268-001-PPP (deprecated since 2022-02-01)

Axiom
annotated source: mandipropamid
annotated property: denoted by
annotated target: (RS)-2-(4-chlorophenyl)-N-[3-methoxy-4-(prop-2-ynyloxy)phenethyl]-2-(prop-2-ynyloxy)acetamide
has db xref: preferred IUPAC name (PIN)

Axiom
annotated source: mandipropamid
annotated property: denoted by
annotated target: 374726-62-2
has db xref: CAS registry number

Axiom
annotated source: mandipropamid
annotated property: denoted by
annotated target: 609-434-0
has db xref: https://w3id.org/euph/8101

Axiom
annotated source: mandipropamid
annotated property: denoted by
annotated target: C23H22ClNO4
has db xref: molecular formula

Axiom
annotated source: mandipropamid
annotated property: denoted by
annotated target: F99_02_06
has db xref: harmonised classification of substances code

Axiom
annotated source: mandipropamid
annotated property: denoted by
annotated target: InChI=1S/C23H22ClNO4/c1-4-14-28-20-11-6-17(16-21(20)27-3)12-13-25-23(26)22(29-15-5-2)18-7-9-19(24)10-8-18/h1-2,6-11,16,22H,12-15H2,3H3,(H,25,26)
has db xref: International Chemical Identifier (InChI)

Axiom
annotated source: mandipropamid
annotated property: denoted by
annotated target: RF-0268-001-PPP (deprecated since 2022-02-01)
has db xref: EFSA DCF term code

zoxamide
type: Class
subclass of: benzamide fungicide
subclass of: Restriction
  on property: member of
  some values from: amide fungicides [F99_02]
IAO_0000117: Michael Rubinigg
IAO_0000118: SOKSAMIID @et
IAO_0000118: ZOKSAMID @hr
IAO_0000118: ZOKSAMIDAS @lt
IAO_0000118: ZOKSAMIDI @fi
IAO_0000118: ZOKSAMĪDS @lv
IAO_0000118: ZOXAMID @cs
IAO_0000118: ZOXAMIDA @es
IAO_0000118: ZOXAMIDE @el
IAO_0000118: ZOXAMIDĂ @ro
IAO_0000118: ŻOKSAMID @mt
IAO_0000118: ЗОКСАМИД @bg
id: EUPH:3501
denoted by: 156052-68-5
denoted by: 3,5-dichloro-N-(1-chloro-3-methyl-2-oxopentan-3-yl)-4-methylbenzamide
denoted by: 605-037-1
denoted by: C14H16Cl3NO2
denoted by: F99_02_05
denoted by: InChI=1S/C14H16Cl3NO2/c1-4-14(3,12(19)7-15)18-13(20)9-5-10(16)8(2)11(17)6-9/h5-6H,4,7H2,1-3H3,(H,18,20)
denoted by: RF-0452-001-PPP

Axiom
annotated source: zoxamide
annotated property: denoted by
annotated target: 156052-68-5
has db xref: CAS registry number

Axiom
annotated source: zoxamide
annotated property: denoted by
annotated target: 3,5-dichloro-N-(1-chloro-3-methyl-2-oxopentan-3-yl)-4-methylbenzamide
has db xref: preferred IUPAC name (PIN)

Axiom
annotated source: zoxamide
annotated property: denoted by
annotated target: 605-037-1
has db xref: https://w3id.org/euph/8101

Axiom
annotated source: zoxamide
annotated property: denoted by
annotated target: C14H16Cl3NO2
has db xref: molecular formula

Axiom
annotated source: zoxamide
annotated property: denoted by
annotated target: F99_02_05
has db xref: harmonised classification of substances code

Axiom
annotated source: zoxamide
annotated property: denoted by
annotated target: InChI=1S/C14H16Cl3NO2/c1-4-14(3,12(19)7-15)18-13(20)9-5-10(16)8(2)11(17)6-9/h5-6H,4,7H2,1-3H3,(H,18,20)
has db xref: International Chemical Identifier (InChI)

Axiom
annotated source: zoxamide
annotated property: denoted by
annotated target: RF-0452-001-PPP
has db xref: EFSA DCF term code

pirimicarb
type: Class
subclass of: carbamate ester
subclass of: Restriction
  on property: directly negatively regulates activity of
  some values from: acetylcholinesterase
subclass of: Restriction
  on property: member of
  some values from: carbamate insecticides [I03_02]
IAO_0000117: Michael Rubinigg
IAO_0000118: PIRIMICARB @da
IAO_0000118: PIRIMICARBE @fr
IAO_0000118: PIRIMIKARB @cs
IAO_0000118: PIRIMIKARBAS @lt
IAO_0000118: PIRIMIKARBI @fi
IAO_0000118: PIRIMIKARBS @lv
IAO_0000118: PIRYMIKARB @pl
IAO_0000118: ПИРИМИКАРБ @bg
id: EUPH:3717
denoted by: 23103-98-2
denoted by: 245-430-1
denoted by: C11H18N4O2
denoted by: CC1=C(N=C(N=C1OC(=O)N(C)C)N(C)C)C
denoted by: I03_02_04
denoted by: InChI=1S/C11H18N4O2/c1-7-8(2)12-10(14(3)4)13-9(7)17-11(16)15(5)6/h1-6H3
denoted by: RF-0347-002-PPP
denoted by: [2-(dimethylamino)-5,6-dimethylpyrimidin-4-yl] N,N-dimethylcarbamate

Axiom
annotated source: pirimicarb
annotated property: denoted by
annotated target: 23103-98-2
has db xref: CAS registry number

Axiom
annotated source: pirimicarb
annotated property: denoted by
annotated target: 245-430-1
has db xref: https://w3id.org/euph/8101

Axiom
annotated source: pirimicarb
annotated property: denoted by
annotated target: C11H18N4O2
has db xref: molecular formula

Axiom
annotated source: pirimicarb
annotated property: denoted by
annotated target: CC1=C(N=C(N=C1OC(=O)N(C)C)N(C)C)C
has db xref: simplified molecular input line entry system (SMILES)

Axiom
annotated source: pirimicarb
annotated property: denoted by
annotated target: I03_02_04
has db xref: harmonised classification of substances code

Axiom
annotated source: pirimicarb
annotated property: denoted by
annotated target: InChI=1S/C11H18N4O2/c1-7-8(2)12-10(14(3)4)13-9(7)17-11(16)15(5)6/h1-6H3
has db xref: International Chemical Identifier (InChI)

Axiom
annotated source: pirimicarb
annotated property: denoted by
annotated target: RF-0347-002-PPP
has db xref: EFSA DCF term code

Axiom
annotated source: pirimicarb
annotated property: denoted by
annotated target: [2-(dimethylamino)-5,6-dimethylpyrimidin-4-yl] N,N-dimethylcarbamate
has db xref: preferred IUPAC name (PIN)

isofetamid
type: Class
subclass of: amide fungicide
subclass of: Restriction
  on property: member of
  some values from: amide fungicides [F99_02]
IAO_0000117: Michael Rubinigg
IAO_0000118: ISOFETAMID @cs
IAO_0000118: ISOFETAMIDA @pt
IAO_0000118: ISOFETAMIDI @fi
IAO_0000118: ISOFETAMIID @et
IAO_0000118: ISOFÉTAMIDE @fr
IAO_0000118: IZOFETAMID @hr
IAO_0000118: IZOFETAMIDAS @lt
IAO_0000118: IZOFETAMĪDS @lv
IAO_0000118: ИЗОФЕТАМИД @bg
id: EUPH:3505
denoted by: 694-975-5
denoted by: 875915-78-9
denoted by: C20H25NO3S
denoted by: F99_02_09
denoted by: InChI=1S/C20H25NO3S/c1-12(2)24-15-7-8-16(14(4)11-15)18(22)20(5,6)21-19(23)17-13(3)9-10-25-17/h7-12H,1-6H3,(H,21,23)
denoted by: N-[1,1-dimethyl-2-(4-isopropoxy-o-tolyl)-2-oxoethyl]-3-methylthiophene-2-carboxamide
denoted by: RF-00007585-PAR

Axiom
annotated source: isofetamid
annotated property: denoted by
annotated target: 694-975-5
has db xref: https://w3id.org/euph/8101

Axiom
annotated source: isofetamid
annotated property: denoted by
annotated target: 875915-78-9
has db xref: CAS registry number

Axiom
annotated source: isofetamid
annotated property: denoted by
annotated target: C20H25NO3S
has db xref: molecular formula

Axiom
annotated source: isofetamid
annotated property: denoted by
annotated target: F99_02_09
has db xref: harmonised classification of substances code

Axiom
annotated source: isofetamid
annotated property: denoted by
annotated target: InChI=1S/C20H25NO3S/c1-12(2)24-15-7-8-16(14(4)11-15)18(22)20(5,6)21-19(23)17-13(3)9-10-25-17/h7-12H,1-6H3,(H,21,23)
has db xref: International Chemical Identifier (InChI)

Axiom
annotated source: isofetamid
annotated property: denoted by
annotated target: N-[1,1-dimethyl-2-(4-isopropoxy-o-tolyl)-2-oxoethyl]-3-methylthiophene-2-carboxamide
has db xref: preferred IUPAC name (PIN)

Axiom
annotated source: isofetamid
annotated property: denoted by
annotated target: RF-00007585-PAR
has db xref: EFSA DCF term code

fluopyram
type: Class
subclass of: benzamide fungicide
subclass of: Restriction
  on property: member of
  some values from: amide fungicides [F99_02]
IAO_0000117: Michael Rubinigg
IAO_0000118: FLUOPIRAM @es
IAO_0000118: FLUOPIRAMAS @lt
IAO_0000118: FLUOPIRAME @pt
IAO_0000118: FLUOPIRAMS @lv
IAO_0000118: FLUOPYRAM @cs
IAO_0000118: FLUOPYRAMI @fi
IAO_0000118: FLUOPÜRAAM @et
IAO_0000118: FLUWOPIRAM @mt
IAO_0000118: ФЛУОПИРАМ @bg
id: EUPH:3507
denoted by: 619-797-7
denoted by: 658066-35-4
denoted by: C16H11ClF6N2O
denoted by: F99_02_11
denoted by: N-[2-[3-chloro-5-(trifluoromethyl)pyridin-2-yl]ethyl]-2-(trifluoromethyl)benzamide
denoted by: RF-1071-001-PPP

Axiom
annotated source: fluopyram
annotated property: denoted by
annotated target: 619-797-7
has db xref: https://w3id.org/euph/8101

Axiom
annotated source: fluopyram
annotated property: denoted by
annotated target: 658066-35-4
has db xref: CAS registry number

Axiom
annotated source: fluopyram
annotated property: denoted by
annotated target: C16H11ClF6N2O
has db xref: molecular formula

Axiom
annotated source: fluopyram
annotated property: denoted by
annotated target: F99_02_11
has db xref: harmonised classification of substances code

Axiom
annotated source: fluopyram
annotated property: denoted by
annotated target: N-[2-[3-chloro-5-(trifluoromethyl)pyridin-2-yl]ethyl]-2-(trifluoromethyl)benzamide
has db xref: preferred IUPAC name (PIN)

Axiom
annotated source: fluopyram
annotated property: denoted by
annotated target: RF-1071-001-PPP
has db xref: EFSA DCF term code

benzovindiflupyr
type: Class
subclass of: amide fungicide
subclass of: Restriction
  on property: member of
  some values from: amide fungicides [F99_02]
IAO_0000117: Michael Rubinigg
IAO_0000118: BENSOVINDIFLUPYR @sv
IAO_0000118: BENSOVINDIFLUPÜÜR @et
IAO_0000118: BENTSOVINDIFLUPYRI @fi
IAO_0000118: BENZOVINDIFLUPIR @es
IAO_0000118: BENZOVINDIFLUPIRAS @lt
IAO_0000118: BENZOVINDIFLUPYR @cs
IAO_0000118: BENZOWYNDIFLUPYR @pl
IAO_0000118: BENZVINDIFLUPĪRS @lv
IAO_0000118: BENŻOVINDIFLUPIR @mt
IAO_0000118: БЕНЗОВИНДИФЛУПИР @bg
id: EUPH:3504
denoted by: 1072957-71-1
denoted by: 691-719-4
denoted by: C18H15Cl2F2N3O
denoted by: 3
denoted by: F99_02_08
denoted by: N-[(1S,8R)-11-(dichloromethylidene)-3-tricyclo[6.2.1.02,7]undeca-2(7),3,5-trienyl]-3-(difluoromethyl)-1-methylpyrazole-4-carboxamide
denoted by: RF-00003386-PAR

Axiom
annotated source: benzovindiflupyr
annotated property: denoted by
annotated target: 1072957-71-1
has db xref: CAS registry number

Axiom
annotated source: benzovindiflupyr
annotated property: denoted by
annotated target: 691-719-4
has db xref: https://w3id.org/euph/8101

Axiom
annotated source: benzovindiflupyr
annotated property: denoted by
annotated target: C18H15Cl2F2N3O
has db xref: molecular formula

Axiom
annotated source: benzovindiflupyr
annotated property: denoted by
annotated target: F99_02_08
has db xref: harmonised classification of substances code

Axiom
annotated source: benzovindiflupyr
annotated property: denoted by
annotated target: N-[(1S,8R)-11-(dichloromethylidene)-3-tricyclo[6.2.1.02,7]undeca-2(7),3,5-trienyl]-3-(difluoromethyl)-1-methylpyrazole-4-carboxamide
has db xref: preferred IUPAC name (PIN)

Axiom
annotated source: benzovindiflupyr
annotated property: denoted by
annotated target: RF-00003386-PAR
has db xref: EFSA DCF term code

mandestrobin
type: Class
subclass of: amide fungicide
subclass of: Restriction
  on property: member of
  some values from: amide fungicides [F99_02]
IAO_0000117: Michael Rubinigg
IAO_0000118: MANDESTROBIIN @et
IAO_0000118: MANDESTROBIINI @fi
IAO_0000118: MANDESTROBIN @cs
IAO_0000118: MANDESTROBINA @pl
IAO_0000118: MANDESTROBINAS @lt
IAO_0000118: MANDESTROBINE @fr
IAO_0000118: MANDESTROBÍN @sk
IAO_0000118: MANDESTROBĪNS @lv
IAO_0000118: MANDESZTROBIN @hu
IAO_0000118: МАНДЕСТРОБИН @bg
id: EUPH:3506
denoted by: 173662-97-0
denoted by: 2-[2-[(2,5-dimethylphenoxy)methyl]phenyl]-2-methoxy-N-methylacetamide
denoted by: 695-819-9
denoted by: C19H23NO3
denoted by: F99_02_10
denoted by: InChI=1S/C19H23NO3/c1-13-9-10-14(2)17(11-13)23-12-15-7-5-6-8-16(15)18(22-4)19(21)20-3/h5-11,18H,12H2,1-4H3,(H,20,21)
denoted by: RF-00004671-PAR

Axiom
annotated source: mandestrobin
annotated property: denoted by
annotated target: 173662-97-0
has db xref: CAS registry number

Axiom
annotated source: mandestrobin
annotated property: denoted by
annotated target: 2-[2-[(2,5-dimethylphenoxy)methyl]phenyl]-2-methoxy-N-methylacetamide
has db xref: preferred IUPAC name (PIN)

Axiom
annotated source: mandestrobin
annotated property: denoted by
annotated target: 695-819-9
has db xref: https://w3id.org/euph/8101

Axiom
annotated source: mandestrobin
annotated property: denoted by
annotated target: C19H23NO3
has db xref: molecular formula

Axiom
annotated source: mandestrobin
annotated property: denoted by
annotated target: F99_02_10
has db xref: harmonised classification of substances code

Axiom
annotated source: mandestrobin
annotated property: denoted by
annotated target: InChI=1S/C19H23NO3/c1-13-9-10-14(2)17(11-13)23-12-15-7-5-6-8-16(15)18(22-4)19(21)20-3/h5-11,18H,12H2,1-4H3,(H,20,21)
has db xref: International Chemical Identifier (InChI)

Axiom
annotated source: mandestrobin
annotated property: denoted by
annotated target: RF-00004671-PAR
has db xref: EFSA DCF term code

silthiofam
type: Class
subclass of: amide fungicide
subclass of: Restriction
  on property: member of
  some values from: amide fungicides [F99_02]
IAO_0000117: Michael Rubinigg
IAO_0000118: SILTHIOFAM @cs
IAO_0000118: SILTIJOFAM @mt
IAO_0000118: SILTIOFAAM @et
IAO_0000118: SILTIOFAAMI @fi
IAO_0000118: SILTIOFAM @es
IAO_0000118: SILTIOFAMAS @lt
IAO_0000118: SILTIOFAME @pt
IAO_0000118: SILTIOFAMS @lv
IAO_0000118: SZILTIOFAM @hu
IAO_0000118: СИЛТИОФАМ @bg
id: EUPH:3500
denoted by: 175217-20-6
denoted by: 4,5-dimethyl-N-prop-2-enyl-2-trimethylsilylthiophene-3-carboxamide
denoted by: 605-752-9
denoted by: C13H21NOSSi
denoted by: CC1=C(SC(=C1C(=O)NCC=C)Si(C)C)C
denoted by: F99_02_04
denoted by: InChI=1S/C13H21NOSSi/c1-7-8-14-12(15)11-9(2)10(3)16-13(11)17(4,5)6/h7H,1,8H2,2-6H3,(H,14,15)
denoted by: RF-0389-001-PPP

Axiom
annotated source: silthiofam
annotated property: denoted by
annotated target: 175217-20-6
has db xref: CAS registry number

Axiom
annotated source: silthiofam
annotated property: denoted by
annotated target: 4,5-dimethyl-N-prop-2-enyl-2-trimethylsilylthiophene-3-carboxamide
has db xref: preferred IUPAC name (PIN)

Axiom
annotated source: silthiofam
annotated property: denoted by
annotated target: 605-752-9
has db xref: https://w3id.org/euph/8101

Axiom
annotated source: silthiofam
annotated property: denoted by
annotated target: C13H21NOSSi
has db xref: molecular formula

Axiom
annotated source: silthiofam
annotated property: denoted by
annotated target: CC1=C(SC(=C1C(=O)NCC=C)Si(C)C)C
has db xref: simplified molecular input line entry system (SMILES)

Axiom
annotated source: silthiofam
annotated property: denoted by
annotated target: F99_02_04
has db xref: harmonised classification of substances code

Axiom
annotated source: silthiofam
annotated property: denoted by
annotated target: InChI=1S/C13H21NOSSi/c1-7-8-14-12(15)11-9(2)10(3)16-13(11)17(4,5)6/h7H,1,8H2,2-6H3,(H,14,15)
has db xref: International Chemical Identifier (InChI)

Axiom
annotated source: silthiofam
annotated property: denoted by
annotated target: RF-0389-001-PPP
has db xref: EFSA DCF term code

monochlorobenzene
type: Class
subclass of: chlorobenzene
IAO_0000117: Michael Rubinigg
IAO_0000118: monochlorobenzene
id: EUPH:6442

prochloraz
type: Class
subclass of: amide fungicide
subclass of: Restriction
  on property: member of
  some values from: amide fungicides [F99_02]
IAO_0000117: Michael Rubinigg
IAO_0000118: PROCHLORAZ @cs
IAO_0000118: PROCHLORAZAS @lt
IAO_0000118: PROCLORAZ @es
IAO_0000118: PROHLORAZS @lv
IAO_0000118: PROKLORAAS @et
IAO_0000118: PROKLORATSI @fi
IAO_0000118: PROKLORAZ @hr
IAO_0000118: PROKLORAŻ @mt
IAO_0000118: PROKLORÁZ @hu
IAO_0000118: ПРОХЛОРАЗ @bg
id: EUPH:3499
denoted by: 266-994-5
denoted by: 67747-09-5
denoted by: C15H16Cl3N3O2
denoted by: F99_02_03
denoted by: N-propyl-N-[2-(2,4,6-trichlorophenoxy)ethyl]imidazole-1-carboxamide
denoted by: RF-0349-002-PPP

Axiom
annotated source: prochloraz
annotated property: denoted by
annotated target: 266-994-5
has db xref: https://w3id.org/euph/8101

Axiom
annotated source: prochloraz
annotated property: denoted by
annotated target: 67747-09-5
has db xref: CAS registry number

Axiom
annotated source: prochloraz
annotated property: denoted by
annotated target: C15H16Cl3N3O2
has db xref: molecular formula

Axiom
annotated source: prochloraz
annotated property: denoted by
annotated target: F99_02_03
has db xref: harmonised classification of substances code

Axiom
annotated source: prochloraz
annotated property: denoted by
annotated target: N-propyl-N-[2-(2,4,6-trichlorophenoxy)ethyl]imidazole-1-carboxamide
has db xref: preferred IUPAC name (PIN)

Axiom
annotated source: prochloraz
annotated property: denoted by
annotated target: RF-0349-002-PPP
has db xref: EFSA DCF term code

nitroguanidine derivative
type: Class
subclass of: guanidine
IAO_0000117: Michael Rubinigg
IAO_0000118: nitroguanidine derivative
id: EUPH:6283

aliphatic nitrogen antifungal agent
type: Class
subclass of: organonitrogen compound
IAO_0000117: Michael Rubinigg
IAO_0000118: aliphatic nitrogen antifungal agent
id: EUPH:8255

amide antifungal agent
type: Class
subclass of: organonitrogen compound
IAO_0000117: Michael Rubinigg
IAO_0000118: amide antifungal agent
id: EUPH:8256

benzamide fungicide
type: Class
subclass of: amide fungicide
IAO_0000117: Michael Rubinigg
IAO_0000118: benzamide fungicide
id: EUPH:7239

tebufenpyrad
type: Class
subclass of: pyrazole
subclass of: Restriction
  on property: member of
  some values from: pyrazole (phenyl-)insecticides [I99_12]
IAO_0000117: Michael Rubinigg
IAO_0000118: TEBUFENEPIRADE @pt
IAO_0000118: TEBUFENPIRAD @es
IAO_0000118: TEBUFENPIRADAS @lt
IAO_0000118: TEBUFENPYRAD @cs
IAO_0000118: TEBUFENPYRADI @fi
IAO_0000118: TEBUFENPÜRAAD @et
IAO_0000118: TEBUFÉNPYRAD @sk
IAO_0000118: TEBUFĒNPIRĀDS @lv
IAO_0000118: TÉBUFENPYRAD @fr
IAO_0000118: ТЕБУФЕНПИРАД @bg
id: EUPH:3774
denoted by: 119168-77-3
denoted by: 601-585-0
denoted by: C18H24ClN3O
denoted by: I99_12_02
denoted by: InChI=1S/C18H24ClN3O/c1-6-14-15(19)16(22(5)21-14)17(23)20-11-12-7-9-13(10-8-12)18(2,3)4/h7-10H,6,11H2,1-5H3,(H,20,23)
denoted by: N-[(4-tert-butylphenyl)methyl]-4-chloro-3-ethyl-1-methylpyrazole-5-carboxamide
denoted by: RF-0405-001-PPP

Axiom
annotated source: tebufenpyrad
annotated property: denoted by
annotated target: 119168-77-3
has db xref: CAS registry number

Axiom
annotated source: tebufenpyrad
annotated property: denoted by
annotated target: 601-585-0
has db xref: https://w3id.org/euph/8101

Axiom
annotated source: tebufenpyrad
annotated property: denoted by
annotated target: C18H24ClN3O
has db xref: molecular formula

Axiom
annotated source: tebufenpyrad
annotated property: denoted by
annotated target: I99_12_02
has db xref: harmonised classification of substances code

Axiom
annotated source: tebufenpyrad
annotated property: denoted by
annotated target: InChI=1S/C18H24ClN3O/c1-6-14-15(19)16(22(5)21-14)17(23)20-11-12-7-9-13(10-8-12)18(2,3)4/h7-10H,6,11H2,1-5H3,(H,20,23)
has db xref: International Chemical Identifier (InChI)

Axiom
annotated source: tebufenpyrad
annotated property: denoted by
annotated target: N-[(4-tert-butylphenyl)methyl]-4-chloro-3-ethyl-1-methylpyrazole-5-carboxamide
has db xref: preferred IUPAC name (PIN)

Axiom
annotated source: tebufenpyrad
annotated property: denoted by
annotated target: RF-0405-001-PPP
has db xref: EFSA DCF term code

tefluthrin
type: Class
subclass of: racemate
subclass of: Restriction
  on property: member of
  some values from: pyrethroid insecticides [I01_01]
IAO_0000117: Michael Rubinigg
IAO_0000118: TEFLUTHRIN @cs
IAO_0000118: TEFLUTRIIN @et
IAO_0000118: TEFLUTRIINI @fi
IAO_0000118: TEFLUTRIN @hr
IAO_0000118: TEFLUTRINA @it
IAO_0000118: TEFLUTRINAS @lt
IAO_0000118: TEFLUTRYNA @pl
IAO_0000118: TEFLUTRÍN @es
IAO_0000118: TEFLUTRĪNS @lv
IAO_0000118: TÉFLUTHRINE @fr
IAO_0000118: ТЕФЛУТРИН @bg
id: EUPH:3706
denoted by: 616-699-6
denoted by: 79538-32-2
denoted by: C17H14ClF7O2
denoted by: CC1=C(C(=C(C(=C1F)F)COC(=O)[C@H]2C
denoted by: I01_01_13
denoted by: InChI=1S/C17H14ClF7O2/c1-6-11(19)13(21)7(14(22)12(6)20)5-27-15(26)10-8(16(10,2)3)4-9(18)17(23,24)25/h4,8,10H,5H2,1-3H3/b9-4-/t8-,10-/m1/s1
denoted by: RF-0408-001-PPP
denoted by: trans-(2,3,5,6-tetrafluoro-4-methylphenyl)methyl (1S,3S)-3-[(Z)-2-chloro-3,3,3-trifluoroprop-1-enyl]-2,2-dimethylcyclopropane-1-carboxylate

Axiom
annotated source: tefluthrin
annotated property: denoted by
annotated target: 616-699-6
has db xref: https://w3id.org/euph/8101

Axiom
annotated source: tefluthrin
annotated property: denoted by
annotated target: 79538-32-2
has db xref: CAS registry number

Axiom
annotated source: tefluthrin
annotated property: denoted by
annotated target: C17H14ClF7O2
has db xref: molecular formula

Axiom
annotated source: tefluthrin
annotated property: denoted by
annotated target: CC1=C(C(=C(C(=C1F)F)COC(=O)[C@H]2C
has db xref: simplified molecular input line entry system (SMILES)

Axiom
annotated source: tefluthrin
annotated property: denoted by
annotated target: I01_01_13
has db xref: harmonised classification of substances code

Axiom
annotated source: tefluthrin
annotated property: denoted by
annotated target: InChI=1S/C17H14ClF7O2/c1-6-11(19)13(21)7(14(22)12(6)20)5-27-15(26)10-8(16(10,2)3)4-9(18)17(23,24)25/h4,8,10H,5H2,1-3H3/b9-4-/t8-,10-/m1/s1
has db xref: International Chemical Identifier (InChI)

Axiom
annotated source: tefluthrin
annotated property: denoted by
annotated target: RF-0408-001-PPP
has db xref: EFSA DCF term code

Axiom
annotated source: tefluthrin
annotated property: denoted by
annotated target: trans-(2,3,5,6-tetrafluoro-4-methylphenyl)methyl (1S,3S)-3-[(Z)-2-chloro-3,3,3-trifluoroprop-1-enyl]-2,2-dimethylcyclopropane-1-carboxylate
has db xref: preferred IUPAC name (PIN)

assay output
type: Class
subclass of: information content entity in chemistry
IAO_0000117: Michael Rubinigg
IAO_0000118: assay output
id: EUPH:1394

analyte
type: Class
subclass of: role in chemistry
subclass of: Restriction
  on property: role of
  some values from: chemical entity
IAO_0000117: Michael Rubinigg
IAO_0000118: analyte
id: EUPH:3315

apiary
type: Class
subclass of: two-dimensional spatial region in beekeeping
subclass of: Restriction
  on property: target participant in
  some values from: apiary management
subclass of: Restriction
  on property: location of
  some values from: https://w3id.org/euph/8
subclass of: Restriction
  on property: part of
  some values from: beekeeping establishment
IAO_0000117: Michael Rubinigg
IAO_0000118: Bienenstand @de
IAO_0000118: apiario @es
IAO_0000118: apiary
IAO_0000118: apiário @pt
IAO_0000118: bee yard
IAO_0000118: bigård @da
IAO_0000118: bijenstal @nl
IAO_0000118: bijenstand @nl
IAO_0000118: colmeal @pt
IAO_0000118: colmenar @es
IAO_0000118: rucher @fr
IAO_0000118: stupină @ro
IAO_0000118: vatră @ro
id: EUPH:5

habitat
type: Class
subclass of: https://w3id.org/euph/7836
subclass of: Restriction
  on property: member of
  some values from: https://w3id.org/euph/7509
subclass of: Restriction
  on property: member of
  some values from: https://w3id.org/euph/7639
IAO_0000117: Michael Rubinigg
IAO_0000118: Habitat @de
IAO_0000118: habitat
id: EUPH:7607

cloud
type: Class
subclass of: object in meteorology
IAO_0000117: Michael Rubinigg
IAO_0000118: Wolke @de
IAO_0000118: cloud
id: EUPH:1061

wind
type: Class
subclass of: https://w3id.org/euph/8178
IAO_0000117: Michael Rubinigg
IAO_0000118: Wind @de
IAO_0000118: vent @fr
IAO_0000118: vento @it
IAO_0000118: wind
id: EUPH:7357

rainfall
type: Class
subclass of: hydrological precipitation process
IAO_0000117: Michael Rubinigg
IAO_0000118: Regenfall @de
IAO_0000118: rainfall
IAO_0000118: water-based rainfall
id: EUPH:2235

flower strip
type: Class
subclass of: https://w3id.org/euph/7836
IAO_0000117: Michael Rubinigg
IAO_0000118: Blühstreifen @de
IAO_0000118: flower strip
id: EUPH:7826

snowfall
type: Class
subclass of: hydrological precipitation process
IAO_0000117: Michael Rubinigg
IAO_0000118: Schneefall @de
IAO_0000118: snowfall
id: EUPH:2233

volume of hydrological precipitation
type: Class
subclass of: meteorological quantity
subclass of: Restriction
  on property: quality of
  some values from: precipitation
IAO_0000117: Michael Rubinigg
IAO_0000118: Niederschlagsmenge @de
IAO_0000118: precipitation amount
IAO_0000118: volume of hydrological precipitation
id: EUPH:7353

rain
type: Class
subclass of: precipitation
subclass of: Restriction
  on property: output of
  some values from: rainfall
IAO_0000117: Michael Rubinigg
IAO_0000118: Regen @de
IAO_0000118: rain
id: EUPH:1337

cloud cover
type: Class
subclass of: meteorological quantity
subclass of: Restriction
  on property: quality of
  some values from: cloud
IAO_0000117: Michael Rubinigg
IAO_0000118: cloud cover
id: EUPH:7817

wind gust
type: Class
subclass of: wind speed
IAO_0000117: Michael Rubinigg
IAO_0000118: Windböe @de
IAO_0000118: raffica di vento @it
IAO_0000118: wind gust
id: EUPH:7360

falling sleet
type: Class
subclass of: precipitation
IAO_0000117: Michael Rubinigg
IAO_0000118: Graupel @de
IAO_0000118: sleet
id: EUPH:2756

hail
type: Class
subclass of: precipitation
IAO_0000117: Michael Rubinigg
IAO_0000118: Hagel @de
IAO_0000118: hail
id: EUPH:1784

falling snow
type: Class
subclass of: precipitation
subclass of: Restriction
  on property: output of
  some values from: snowfall
IAO_0000117: Michael Rubinigg
IAO_0000118: Schnee @de
IAO_0000118: neige @fr
IAO_0000118: neve @it
IAO_0000118: sneeuw @nl
IAO_0000118: snow
id: EUPH:7355

plant food product
type: Class
subclass of: object in plant production
subclass of: Restriction
  on property: derives from part of
  some values from: crop
IAO_0000117: Michael Rubinigg
IAO_0000118: pflanzliches Nahrungsmittel @de
IAO_0000118: plant food product
id: EUPH:1802

plant fruit food product
type: Class
subclass of: plant food product
subclass of: Restriction
  on property: derives from part of
  some values from: fruit
IAO_0000117: Michael Rubinigg
IAO_0000118: plant fruit food product
id: EUPH:2653

pomaceous fruit food product
type: Class
subclass of: plant fruit food product
subclass of: Restriction
  on property: derives from part of
  some values from: pome fruit
IAO_0000117: Michael Rubinigg
IAO_0000118: pomaceous fruit food product
id: EUPH:2380

nut food product
type: Class
subclass of: plant fruit food product
subclass of: Restriction
  on property: derives from part of
  some values from: nut fruit
IAO_0000117: Michael Rubinigg
IAO_0000118: nut food product
id: EUPH:2655

plant seed food product
type: Class
subclass of: plant food product
subclass of: Restriction
  on property: derives from part of
  some values from: seed
IAO_0000117: Michael Rubinigg
IAO_0000118: plant seed food product
id: EUPH:2668

drupe fruit food product
type: Class
subclass of: plant fruit food product
subclass of: Restriction
  on property: derives from part of
  some values from: drupe fruit
IAO_0000117: Michael Rubinigg
IAO_0000118: drupe fruit food product
IAO_0000118: stone fruit food product
id: EUPH:2015

apple
type: Class
subclass of: pomaceous fruit food product
subclass of: Restriction
  on property: derives from part of
  some values from: https://www.gbif.org/species/3001244
IAO_0000117: Michael Rubinigg
IAO_0000118: Apfel @de
IAO_0000118: apple
id: EUPH:1547

pear
type: Class
subclass of: pomaceous fruit food product
subclass of: Restriction
  on property: derives from part of
  some values from: https://www.gbif.org/species/5362573
IAO_0000117: Michael Rubinigg
IAO_0000118: Birne @de
IAO_0000118: pear
id: EUPH:2480

sweet cherry
type: Class
subclass of: cherry
subclass of: Restriction
  on property: derives from part of
  some values from: https://www.gbif.org/species/3020791
IAO_0000117: Michael Rubinigg
IAO_0000118: Süßkirsche @de
IAO_0000118: sweet cherry
id: EUPH:1548

apricot
type: Class
subclass of: drupe fruit food product
subclass of: Restriction
  on property: derives from part of
  some values from: https://www.gbif.org/species/7818643
IAO_0000117: Michael Rubinigg
IAO_0000118: Aprikose @de
IAO_0000118: Marille @de
IAO_0000118: apricot
id: EUPH:1549

cherry
type: Class
subclass of: drupe fruit food product
IAO_0000117: Michael Rubinigg
IAO_0000118: Kirsche @de
IAO_0000118: cherry
id: EUPH:1529

plum
type: Class
subclass of: plum and sloe
subclass of: Restriction
  on property: derives from part of
  some values from: https://www.gbif.org/species/7931731
IAO_0000117: Michael Rubinigg
IAO_0000118: Pflaume @de
IAO_0000118: Zwetschge @de
IAO_0000118: plum
id: EUPH:1525

almond
type: Class
subclass of: drupe fruit food product
subclass of: Restriction
  on property: derives from part of
  some values from: https://www.gbif.org/species/3020980
IAO_0000117: Michael Rubinigg
IAO_0000118: Mandel @de
IAO_0000118: almond
id: EUPH:1530

sour cherry
type: Class
subclass of: cherry
subclass of: Restriction
  on property: derives from part of
  some values from: https://www.gbif.org/species/3021922
IAO_0000117: Michael Rubinigg
IAO_0000118: Sauerkirsche @de
IAO_0000118: sour cherry
id: EUPH:1711

chestnut
type: Class
subclass of: nut food product
subclass of: Restriction
  on property: derives from part of
  some values from: https://www.gbif.org/species/2882140
IAO_0000117: Michael Rubinigg
IAO_0000118: chestnut
id: EUPH:1710

nectarine
type: Class
subclass of: peach
subclass of: Restriction
  on property: derives from part of
  some values from: https://www.gbif.org/species/8149923
IAO_0000117: Michael Rubinigg
IAO_0000118: Nektarine @de
IAO_0000118: nectarine
id: EUPH:1577

bramble berry
type: Class
subclass of: small fruit
subclass of: Restriction
  on property: derives from part of
  some values from: https://www.gbif.org/species/8436459
IAO_0000117: Michael Rubinigg
IAO_0000118: Brombeere @de
IAO_0000118: bramble berry
id: EUPH:1551

buckwheat
type: Class
subclass of: plant seed food product
subclass of: Restriction
  on property: derives from part of
  some values from: https://www.gbif.org/species/2889373
IAO_0000117: Michael Rubinigg
IAO_0000118: Buchweizen @de
IAO_0000118: buckwheat
id: EUPH:3295

mead
type: Class
subclass of: processed hive product
subclass of: Restriction
  on property: derives from
  some values from: extracted honey
IAO_0000117: Michael Rubinigg
IAO_0000118: Honigmet @de
IAO_0000118: Met @de
IAO_0000118: hidromel @pt
IAO_0000118: hidromiel @es
IAO_0000118: honingmede @nl
IAO_0000118: hydromel @fr
IAO_0000118: idromele @it
IAO_0000118: mead
IAO_0000118: mede @nl
IAO_0000118: mjöd @sv
IAO_0000118: mjød @da
IAO_0000118: vin de miere @ro
IAO_0000118: vinho de mel @pt
IAO_0000118: vino de miel @es
id: EUPH:1193

peach
type: Class
subclass of: drupe fruit food product
IAO_0000117: Michael Rubinigg
IAO_0000118: Pfirsich
IAO_0000118: peach
id: EUPH:2478

sweet chestnut
type: Class
subclass of: chestnut
subclass of: Restriction
  on property: derives from part of
  some values from: https://www.gbif.org/species/5333294
IAO_0000117: Michael Rubinigg
IAO_0000118: Esskastanie @de
IAO_0000118: Marone @de
IAO_0000118: sweet chestnut
id: EUPH:1712

sloe
type: Class
subclass of: plum and sloe
subclass of: Restriction
  on property: derives from part of
  some values from: https://www.gbif.org/species/3023221
IAO_0000117: Michael Rubinigg
IAO_0000118: Schlehe @de
IAO_0000118: sloe
id: EUPH:2174

catalytic activity
type: Class
subclass of: physical quantity
IAO_0000117: Michael Rubinigg
IAO_0000118: catalytic activity
IAO_0000118: katalytische Aktivität @de
id: EUPH:461

chitin biosynthetic process
type: Class
subclass of: metabolic process
IAO_0000117: Michael Rubinigg
IAO_0000118: chitin biosynthetic process
id: EUPH:6042

behavior
type: Class
subclass of: multicellular organismal process
subclass of: Restriction
  on property: member of
  some values from: occurrence
subclass of: Restriction
  on property: member of
  some values from: https://w3id.org/euph/7509
IAO_0000117: Michael Rubinigg
IAO_0000118: Benehmen @de
IAO_0000118: Betragen @de
IAO_0000118: Verhalten @de
IAO_0000118: behavior
IAO_0000118: behaviour
IAO_0000118: beteende @sv
IAO_0000118: comportament @ro
IAO_0000118: comportamento @it
IAO_0000118: comportamiento @es
IAO_0000118: comportement @fr
IAO_0000118: gedrag @nl
IAO_0000118: opførsel @da
IAO_0000118: oppførsel @no
id: EUPH:7571

process in biology
type: Class
subclass of: occurrent in biology
IAO_0000117: Michael Rubinigg
IAO_0000118: biological process
id: EUPH:6186

metabolic process
type: Class
subclass of: cellular process
IAO_0000117: Michael Rubinigg
IAO_0000118: metabolic process
id: EUPH:6414

cellular process
type: Class
subclass of: process in biology
IAO_0000117: Michael Rubinigg
IAO_0000118: cellular process
id: EUPH:6256

wax biosynthetic process
type: Class
subclass of: metabolic process
subclass of: Restriction
  on property: has input
  some values from: glucose
subclass of: Restriction
  on property: occurs in
  some values from: wax gland
subclass of: Restriction
  on property: has output
  some values from: wax scale
IAO_0000117: Michael Rubinigg
IAO_0000118: Wachsbiosyntheseprozess @de
IAO_0000118: wax biosynthetic process
id: EUPH:3306

honey diastase activity
type: Class
subclass of: hive product quality
subclass of: Restriction
  on property: member of
  some values from: EU directive 2001-110
subclass of: Restriction
  on property: characteristic of
  some values from: amylase
subclass of: Restriction
  on property: quality of
  some values from: honey
IAO_0000117: Michael Rubinigg
IAO_0000118: Diastaseindex @de
IAO_0000118: activitate de diastază @ro
IAO_0000118: aktivnost dijastaze @hr
IAO_0000118: aktywność diastazy @pl
IAO_0000118: attività diastase @mt
IAO_0000118: diastaasarv @et
IAO_0000118: diastaasiaktiivisuus @fi
IAO_0000118: diastasaktivitet @sv
IAO_0000118: diastase activity
IAO_0000118: diastase-index @nl
IAO_0000118: diastasová aktivita @cs
IAO_0000118: diastatická aktivita @sk
IAO_0000118: diastatisk indeks @da
IAO_0000118: diastazno število @sl
IAO_0000118: diastazės aktyvumo @lt
IAO_0000118: diastāzes skaitlis @lv
IAO_0000118: diasztáz-tevékenység @hu
IAO_0000118: indice diastasico @it
IAO_0000118: indice diastasique @fr
IAO_0000118: índice diastásico @es
IAO_0000118: δείκτης διάστασης @el
IAO_0000118: диастазна активност @bg
id: EUPH:6635

reproductive behavior
type: Class
subclass of: behavior
IAO_0000117: Michael Rubinigg
IAO_0000118: Fortpflanzungsverhalten @de
IAO_0000118: reproductive behavior
id: EUPH:3391

reproductive process
type: Class
subclass of: multicellular organismal process
IAO_0000117: Michael Rubinigg
IAO_0000118: Fortpflanzung @de
IAO_0000118: forplantning @da
IAO_0000118: fortplantning @sv
IAO_0000118: reproducción @es
IAO_0000118: reproducere @ro
IAO_0000118: reproduction
IAO_0000118: reproductive process
IAO_0000118: reproducţie @ro
IAO_0000118: reprodução @pt
IAO_0000118: riproduzione @it
IAO_0000118: voortplanting @nl
id: EUPH:999

multicellular organismal process
type: Class
subclass of: process in biology
IAO_0000117: Michael Rubinigg
IAO_0000118: multicellular organismal process
id: EUPH:6219

social behavior
type: Class
subclass of: behavior
IAO_0000117: Michael Rubinigg
IAO_0000118: Sozialverhalten @de
IAO_0000118: comportamento sociale @it
IAO_0000118: comportement social @fr
IAO_0000118: social behavior
id: EUPH:7339

secrete
type: Class
subclass of: localisation
subclass of: Restriction
  on property: has output
  some values from: secretion
IAO_0000117: Michael Rubinigg
IAO_0000118: a secreta @ro
IAO_0000118: afscheiden @nl
IAO_0000118: at udsondre @da
IAO_0000118: att avsöndra @sv
IAO_0000118: att utsöndra @sv
IAO_0000118: ausscheiden @de
IAO_0000118: secernere @it
IAO_0000118: secretar @es
IAO_0000118: segregar @es
IAO_0000118: sezernieren @de
IAO_0000118: sécréter @fr
IAO_0000118: to secrete
IAO_0000118: å utskille @no
id: EUPH:1223

localisation
type: Class
subclass of: process in biology
IAO_0000117: Michael Rubinigg
IAO_0000118: localisation
id: EUPH:1219

foraging behavior
type: Class
subclass of: behavior
IAO_0000117: Michael Rubinigg
IAO_0000118: Futtersuchverhalten @de
IAO_0000118: foraging behavior
id: EUPH:698

accessory gland
type: Class
subclass of: gland
IAO_0000117: Michael Rubinigg
IAO_0000118: accessory gland
id: EUPH:7923

antenna cleaner
type: Class
subclass of: fore leg
IAO_0000117: Michael Rubinigg
IAO_0000118: Fühlerputzapparat @de
IAO_0000118: antenna cleaner
IAO_0000118: antennerenser @da
IAO_0000118: antennputsare @sv
IAO_0000118: aparato de limpieza de las antenas @es
IAO_0000118: aparelho de limpeza das antenas @pt
IAO_0000118: apparato per la pulizia delle antenne @it
IAO_0000118: appareil de nettoyage des antennes @fr
IAO_0000118: dispozitiv de curățire a antenei @ro
IAO_0000118: limpador de antenas @pt
IAO_0000118: pusseapparat @no
IAO_0000118: sprietenreiniger @nl
id: EUPH:7946

arolium
type: Class
subclass of: pretarsus
IAO_0000117: Michael Rubinigg
IAO_0000118: Haftlappen @de
IAO_0000118: arolio @it
IAO_0000118: arolium
IAO_0000118: arólio @pt
IAO_0000118: hechtlapje @nl
IAO_0000118: hefteskive @no
IAO_0000118: häftskiva @sv
IAO_0000118: hæfteskive @da
IAO_0000118: ventosa @es
IAO_0000118: ventouse @fr
IAO_0000118: ventuză @ro
id: EUPH:8017

basitarsus
type: Class
subclass of: tarsus
IAO_0000117: Michael Rubinigg
IAO_0000118: Basitarsus @de
IAO_0000118: basitarso @es
IAO_0000118: basitarsus
IAO_0000118: bazitars @ro
IAO_0000118: eerste tarslid @nl
IAO_0000118: erstes Tarsenglied @de
IAO_0000118: första tarsleden @sv
IAO_0000118: første fodled @da
IAO_0000118: første fodledd @no
IAO_0000118: premier article du tarse @fr
IAO_0000118: primeiro segmento do tarso @pt
IAO_0000118: primo articolo del tarso @it
IAO_0000118: primul articol tarsal @ro
id: EUPH:8018

coxa
type: Class
subclass of: leg segment
IAO_0000117: Michael Rubinigg
IAO_0000118: Coxa @de
IAO_0000118: Hüftglied @de
IAO_0000118: anca @it
IAO_0000118: cadera @es
IAO_0000118: coxa @da
IAO_0000118: coxă @ro
IAO_0000118: heup @nl
IAO_0000118: hofte @da
IAO_0000118: höftled @sv
id: EUPH:8015

egg
type: Class
subclass of: multicellular organism
subclass of: Restriction
  on property: produced by
  some values from: adult queen bee
subclass of: Restriction
  on property: located in
  some values from: cell
IAO_0000117: Michael Rubinigg
IAO_0000118: Ei @de
IAO_0000118: egg
IAO_0000118: ei @nl
IAO_0000118: eitje @nl
IAO_0000118: huevo @es
IAO_0000118: ou @ro
IAO_0000118: ovo @pt
IAO_0000118: uovo @it
IAO_0000118: ägg @sv
IAO_0000118: æg @da
IAO_0000118: œuf @fr
id: EUPH:29

femur
type: Class
subclass of: leg segment
IAO_0000117: Michael Rubinigg
IAO_0000118: Femur @de
IAO_0000118: Oberschenkel @de
IAO_0000118: dij @nl
IAO_0000118: femore @it
IAO_0000118: femur
IAO_0000118: fémur @es
IAO_0000118: lår @da
id: EUPH:8014

fore leg
type: Class
subclass of: leg
subclass of: Restriction
  on property: connected to
  some values from: prothorax
IAO_0000117: Michael Rubinigg
IAO_0000118: Vorderbein @de
IAO_0000118: fore leg
IAO_0000118: patte antérieure @fr
id: EUPH:7941

hind leg
type: Class
subclass of: leg
subclass of: Restriction
  on property: connected to
  some values from: metathorax
IAO_0000117: Michael Rubinigg
IAO_0000118: Hinterbein @de
IAO_0000118: hind leg
IAO_0000118: patte postérieure @fr
id: EUPH:7940

leg
type: Class
subclass of: multi-limb segment region
IAO_0000117: Michael Rubinigg
IAO_0000118: Bein @de
IAO_0000118: bein @no
IAO_0000118: ben @da
IAO_0000118: leg
IAO_0000118: pata @es
IAO_0000118: patte @fr
IAO_0000118: perna @pt
IAO_0000118: picior @ro
IAO_0000118: poot @nl
IAO_0000118: zampa @it
id: EUPH:7943

leg segment
type: Class
subclass of: leg
IAO_0000117: Michael Rubinigg
IAO_0000118: Beinsegment @de
IAO_0000118: leg segment
id: EUPH:8010

mandibular gland
type: Class
subclass of: gland
subclass of: Restriction
  on property: in taxon
  some values from: https://www.gbif.org/species/216
subclass of: Restriction
  on property: located in
  some values from: insect adult head
IAO_0000117: Michael Rubinigg
IAO_0000118: Mandibeldrüse @de
IAO_0000118: mandibular gland
id: EUPH:4049
denoted by: Mandibular glands, side view © Adam Tofilski www.honeybee.drawwing.org

Axiom
annotated source: mandibular gland
annotated property: denoted by
annotated target: Mandibular glands, side view © Adam Tofilski www.honeybee.drawwing.org
has db xref: see also

mesothorax
type: Class
subclass of: insect adult thoracic segment
IAO_0000117: Michael Rubinigg
IAO_0000118: Mesothorax @de
IAO_0000118: Mittelbrustring @de
IAO_0000118: mellembryst @da
IAO_0000118: mellombryst @no
IAO_0000118: mesothorax @da
IAO_0000118: mesotorace @it
IAO_0000118: mesotórax @es
IAO_0000118: mezotorace @ro
IAO_0000118: middenborststuk @nl
IAO_0000118: midtbryst @no
IAO_0000118: mésothorax @fr
id: EUPH:7936

metathorax
type: Class
subclass of: insect adult thoracic segment
IAO_0000117: Michael Rubinigg
IAO_0000118: Hinterbrustring @de
IAO_0000118: Metathorax @de
IAO_0000118: achterborststuk @nl
IAO_0000118: bagbryst @da
IAO_0000118: bakbryst @no
IAO_0000118: bakre brystring @no
IAO_0000118: metathorax @da
IAO_0000118: metatorace @it
IAO_0000118: metatórax @es
IAO_0000118: métathorax @fr
id: EUPH:7945

metatibia
type: Class
subclass of: hind leg
IAO_0000117: Michael Rubinigg
IAO_0000118: metatibia
id: EUPH:3392

mid leg
type: Class
subclass of: leg
subclass of: Restriction
  on property: connected to
  some values from: mesothorax
IAO_0000117: Michael Rubinigg
IAO_0000118: Mittelbein @de
IAO_0000118: mid leg
IAO_0000118: patte médiane @fr
id: EUPH:7942

pretarsus
type: Class
subclass of: tarsus
IAO_0000117: Michael Rubinigg
IAO_0000118: Krallenglied @de
IAO_0000118: Praetarsus @de
IAO_0000118: kloledd @no
IAO_0000118: laatste voetlid @nl
IAO_0000118: praetarsus @nl
IAO_0000118: pretars @ro
IAO_0000118: pretarso @es
IAO_0000118: pretarsus
IAO_0000118: prætarsus @da
IAO_0000118: prétarse @fr
id: EUPH:8016

prothorax
type: Class
subclass of: insect adult thoracic segment
IAO_0000117: Michael Rubinigg
IAO_0000118: Prothorax @de
IAO_0000118: Vorderbrustring @de
IAO_0000118: forbryst @da
IAO_0000118: prothorax @da
IAO_0000118: protorace @it
IAO_0000118: prototórax @es
IAO_0000118: protórax @es
IAO_0000118: voorborststuk @nl
id: EUPH:7937

tarsus
type: Class
subclass of: leg segment
IAO_0000117: Michael Rubinigg
IAO_0000118: Ferse @de
IAO_0000118: Tarsus @de
IAO_0000118: fod @da
IAO_0000118: fot @no
IAO_0000118: tars @ro
IAO_0000118: tarse @fr
IAO_0000118: tarso @es
IAO_0000118: tarsus @da
IAO_0000118: voetlid @nl
id: EUPH:8013

tibia
type: Class
subclass of: leg segment
IAO_0000117: Michael Rubinigg
IAO_0000118: Schienbein @de
IAO_0000118: Schiene @de
IAO_0000118: Tibia @de
IAO_0000118: legg @no
IAO_0000118: scheen @nl
IAO_0000118: skenben @sv
IAO_0000118: skinnebein @no
IAO_0000118: skinneben @da
IAO_0000118: tibia @da
IAO_0000118: tíbia @pt
id: EUPH:8012

trochanter
type: Class
subclass of: leg segment
IAO_0000117: Michael Rubinigg
IAO_0000118: Schenkelring @de
IAO_0000118: Trochanter @de
IAO_0000118: dijring @nl
IAO_0000118: hoftering @da
IAO_0000118: lårring @sv
IAO_0000118: trocantere @it
IAO_0000118: trochanter @da
IAO_0000118: trocánter @es
IAO_0000118: trocânter @pt
id: EUPH:8011

metabasitarsus
type: Class
subclass of: basitarsus
subclass of: Restriction
  on property: part of
  some values from: hind leg
IAO_0000117: Michael Rubinigg
IAO_0000118: metabasitarsus
id: EUPH:8019

corbicula
type: Class
subclass of: metatibia
IAO_0000117: Michael Rubinigg
IAO_0000118: Körbchen @de
IAO_0000118: cesta de pólen @pt
IAO_0000118: cestella del polline @it
IAO_0000118: cestilla de polen @es
IAO_0000118: corbeille à pollen @fr
IAO_0000118: corbella del polline @it
IAO_0000118: corbicula
IAO_0000118: corbícula @pt
IAO_0000118: coşuleţ de polen @ro
IAO_0000118: korfje @nl
IAO_0000118: kurv @da
IAO_0000118: pollen basket
IAO_0000118: pollenkorg @sv
IAO_0000118: pollenkurv @da
id: EUPH:3393

auricle
type: Class
subclass of: metabasitarsus
IAO_0000117: Michael Rubinigg
IAO_0000118: Fersenhenkel @de
IAO_0000118: Pollenkneter @de
IAO_0000118: Pollenschieber @de
IAO_0000118: auricle
IAO_0000118: auricul @ro
IAO_0000118: aurícula @es
IAO_0000118: espuela de polen @es
IAO_0000118: margine tarsale della pinza @it
IAO_0000118: pollenknådare @sv
IAO_0000118: pollenskubber @no
IAO_0000118: sperone del polline @it
IAO_0000118: stuifmeelschuiver @nl
IAO_0000118: øret @da
id: EUPH:8020

chorion
type: Class
subclass of: acellular anatomical structure
subclass of: Restriction
  on property: part of
  some values from: egg
IAO_0000117: Michael Rubinigg
IAO_0000118: Chorion @de
IAO_0000118: Schalenhaut @de
IAO_0000118: buitenste eivlies @nl
IAO_0000118: chorion @da
IAO_0000118: corion @it
IAO_0000118: corión @es
IAO_0000118: cório @pt
IAO_0000118: córion @pt
IAO_0000118: yttre fosterhinna @sv
id: EUPH:923

nervous system
type: Class
subclass of: anatomical system
IAO_0000117: Michael Rubinigg
IAO_0000118: Nervensystem @de
IAO_0000118: nervous system
id: EUPH:6170

anus
type: Class
subclass of: anatomical space
IAO_0000117: Michael Rubinigg
IAO_0000118: After @de
IAO_0000118: Anus @de
IAO_0000118: analåpning @no
IAO_0000118: ano @es
IAO_0000118: anus @da
IAO_0000118: endetarmsåbnig @da
IAO_0000118: endetarmsåpning @no
IAO_0000118: ânus @pt
id: EUPH:7952

labial gland
type: Class
subclass of: gland
subclass of: Restriction
  on property: in taxon
  some values from: https://www.gbif.org/species/216
subclass of: Restriction
  on property: located in
  some values from: insect adult head
subclass of: Restriction
  on property: located in
  some values from: insect adult thorax
IAO_0000117: Michael Rubinigg
IAO_0000118: Labialdrüse @de
IAO_0000118: Speicheldrüse @de
IAO_0000118: ghiandola salivare @it
IAO_0000118: glande labiale @fr
IAO_0000118: glande salivaire @fr
IAO_0000118: glandă salivară @ro
IAO_0000118: glándula salival @es
IAO_0000118: glândula salivar @pt
IAO_0000118: labial gland
IAO_0000118: salivary gland
IAO_0000118: speekselklier @nl
IAO_0000118: spottkörtel @sv
IAO_0000118: spytkirtel @da
IAO_0000118: spyttkjertel @no
id: EUPH:8032

venom gland
type: Class
subclass of: accessory gland
subclass of: Restriction
  on property: part of
  some values from: sting organ
IAO_0000117: Michael Rubinigg
IAO_0000118: Giftdrüse @de
IAO_0000118: acid gland
IAO_0000118: ghiandola acida @it
IAO_0000118: gifklier @nl
IAO_0000118: giftkirtel @da
IAO_0000118: giftkjertel @no
IAO_0000118: glande acide @fr
IAO_0000118: glandă acidă @ro
IAO_0000118: glándula ácida @es
IAO_0000118: glândula ácida @pt
IAO_0000118: sur giftkörtel @sv
IAO_0000118: zuurklier @nl
id: EUPH:3301
denoted by: Venom gland © Adam Tofilski www.honeybee.drawwing.org

Axiom
annotated source: venom gland
annotated property: denoted by
annotated target: Venom gland © Adam Tofilski www.honeybee.drawwing.org
has db xref: see also

dufour gland
type: Class
subclass of: accessory gland
subclass of: Restriction
  on property: part of
  some values from: sting organ
IAO_0000117: Michael Rubinigg
IAO_0000118: Dufour'sche Drüse @de
IAO_0000118: alkaliklier @nl
IAO_0000118: alkaline gland
IAO_0000118: alkalische Drüse @de
IAO_0000118: alkalisk (gift)-kjertel @no
IAO_0000118: alkalisk giftkörtel @sv
IAO_0000118: basisk giftkirtel @da
IAO_0000118: ghiandola alcalina @it
IAO_0000118: glanda alcalină @ro
IAO_0000118: glange alcaline
IAO_0000118: glándula alcalina @es
IAO_0000118: glândula alcalina @pt
id: EUPH:3305
denoted by: Hypopharyngeal glands © Adam Tofilski www.honeybee.drawwing.org

Axiom
annotated source: dufour gland
annotated property: denoted by
annotated target: Hypopharyngeal glands © Adam Tofilski www.honeybee.drawwing.org
has db xref: see also

conditional specification
type: Class
subclass of: directive information entity
IAO_0000117: Michael Rubinigg
IAO_0000118: conditional specification
id: EUPH:2301

measurement unit
type: Class
subclass of: https://w3id.org/euph/872
subclass of: Restriction
  on property: has quality
  some values from: multiple of unit
subclass of: Restriction
  on property: has quality
  some values from: measurement unit ID
subclass of: Restriction
  on property: member of
  some values from: https://w3id.org/euph/7509
subclass of: Restriction
  on property: member of
  some values from: https://w3id.org/euph/7639
IAO_0000117: Michael Rubinigg
IAO_0000118: measurement unit
id: EUPH:7599

data item
type: Class
subclass of: https://w3id.org/euph/872
subclass of: Restriction
  on property: has quality
  some values from: measurement determined date
subclass of: Restriction
  on property: has quality
  some values from: measurement ID
subclass of: Restriction
  on property: has quality
  some values from: https://w3id.org/euph/7602
subclass of: Restriction
  on property: has quality
  some values from: https://w3id.org/euph/7704
subclass of: Restriction
  on property: has output
  some values from: https://w3id.org/euph/7522
subclass of: Restriction
  on property: member of
  some values from: https://w3id.org/euph/7507
IAO_0000117: Michael Rubinigg
IAO_0000118: data item
id: EUPH:7521

directive information entity
type: Class
subclass of: https://w3id.org/euph/872
IAO_0000117: Michael Rubinigg
IAO_0000118: directive information entity
id: EUPH:2300

data format specification
type: Class
subclass of: directive information entity
IAO_0000117: Michael Rubinigg
IAO_0000118: data format specification
id: EUPH:7835

data set
type: Class
subclass of: data item
IAO_0000117: Michael Rubinigg
IAO_0000118: dataset
id: EUPH:7524

plan specification
type: Class
subclass of: directive information entity
IAO_0000117: Michael Rubinigg
IAO_0000118: plan specification
id: EUPH:2302

textual entity
type: Class
subclass of: https://w3id.org/euph/872
IAO_0000117: Michael Rubinigg
IAO_0000118: textual entity
id: EUPH:1786

institution ID
type: Class
subclass of: textual entity
subclass of: Restriction
  on property: member of
  some values from: https://w3id.org/euph/7508
IAO_0000117: Jordan Benrezkallah
IAO_0000118: identifiant de l'institution @fr
IAO_0000118: institution ID
IAO_0000118: institution identifier
id: EUPH:7535

document
type: Class
subclass of: https://w3id.org/euph/872
IAO_0000117: Michael Rubinigg
IAO_0000118: Dokument @de
IAO_0000118: document
IAO_0000118: documento @it
IAO_0000118: dokument @sl
id: EUPH:7371

document part
type: Class
subclass of: https://w3id.org/euph/872
IAO_0000117: Michael Rubinigg
IAO_0000118: document part
id: EUPH:1590

open researcher and contributor identifier (ORCID)
type: Class
subclass of: universally unique identifier (UUID)
IAO_0000117: Michael Rubinigg
IAO_0000118: ORCID
IAO_0000118: Open Researcher and Contributor ID
id: EUPH:6618

identifier (ID)
type: Class
subclass of: https://w3id.org/euph/872
subclass of: Restriction
  on property: member of
  some values from: https://w3id.org/euph/7503
IAO_0000117: Michael Rubinigg
IAO_0000118: ID
IAO_0000118: identifier
id: EUPH:8097

code set
type: Class
subclass of: https://w3id.org/euph/872
IAO_0000117: Michael Rubinigg
IAO_0000118: Codesatz @de
IAO_0000118: code set
IAO_0000118: codeset @nl
IAO_0000118: jeu de codes @fr
IAO_0000118: nabor kod @sl
IAO_0000118: set di codici @it
id: EUPH:3321

limit of detection (LOD)
type: Class
subclass of: assay output
IAO_0000117: Gilles San Martin
IAO_0000118: LOD
IAO_0000118: detection limit
IAO_0000118: limit of detection
id: EUPH:3276

gas chromatography/tandem mass spectrometry
type: Class
subclass of: gas chromatography
IAO_0000117: Michael Rubinigg
IAO_0000118: GC-MS/MS
IAO_0000118: gas chromatography/tandem mass spectrometry
id: EUPH:8092

gas chromatography/chemical ionization mass spectrometry
type: Class
subclass of: gas chromatography
IAO_0000117: Michael Rubinigg
IAO_0000118: GC/CI-MS
IAO_0000118: gas chromatography/chemical ionization mass spectrometry
id: EUPH:8090

gas chromatography/electron ionization mass spectrometry
type: Class
subclass of: gas chromatography
IAO_0000117: Michael Rubinigg
IAO_0000118: GC/EI-MS
IAO_0000118: gas chromatography/electron ionization mass spectrometry
id: EUPH:8091

anatomy qualifier
type: Class
subclass of: qualitative attribute
IAO_0000117: Michael Rubinigg
IAO_0000118: anatomische EIgenschaft @de
IAO_0000118: anatomy qualifier
id: EUPH:8148

gas chromatography and flame ionization detection
type: Class
subclass of: gas chromatography
IAO_0000117: Michael Rubinigg
IAO_0000118: GC/FID
IAO_0000118: gas chromatography and flame ionization detection
id: EUPH:8089

data model
type: Class
subclass of: plan specification
IAO_0000117: Michael Rubinigg
IAO_0000118: Datenmodell @de
IAO_0000118: data model
id: EUPH:8133

physical property
type: Class
subclass of: property or attribute
IAO_0000117: Michael Rubinigg
IAO_0000118: physical property
IAO_0000118: physikalische Eigenschaft @de
id: EUPH:8146

agriculture
type: Class
subclass of: https://w3id.org/euph/8138
IAO_0000117: Michael Rubinigg
IAO_0000118: Landwirtschaft @de
IAO_0000118: agricoltura @it
IAO_0000118: agricultura @es
IAO_0000118: agriculture
IAO_0000118: agricultură @ro
IAO_0000118: jordbruk @no
IAO_0000118: landbouw @nl
IAO_0000118: landbrug @da
IAO_0000118: lantbruk @sv
id: EUPH:434

amylase
type: Class
subclass of: enzyme
IAO_0000117: Michael Rubinigg
IAO_0000118: amylase
id: EUPH:6249

biological sciences
type: Class
subclass of: https://w3id.org/euph/8138
IAO_0000117: Michael Rubinigg
IAO_0000118: Biowissenschaften @de
IAO_0000118: biological sciences
IAO_0000118: biologische wetenschappen @nl
IAO_0000118: sciences biologiques @fr
IAO_0000118: scienze biologiche @it
id: EUPH:8105

chromatography
type: Class
subclass of: biomolecule separation technology
IAO_0000117: Michael Rubinigg
IAO_0000118: chromatography
id: EUPH:8086

liquid chromatography
type: Class
subclass of: chromatography
IAO_0000117: Michael Rubinigg
IAO_0000118: Flüssigkeitschromatographie @de
IAO_0000118: LC
IAO_0000118: liquid chromatography
id: EUPH:8093

entomology
type: Class
subclass of: topic
IAO_0000117: Michael Rubinigg
IAO_0000118: Entomologie @de
IAO_0000118: Insektenkunde @de
IAO_0000118: Insektenlehre @de
IAO_0000118: entomologi @da
IAO_0000118: entomologia @it
IAO_0000118: entomologie @fr
IAO_0000118: entomology
IAO_0000118: entomología @es
IAO_0000118: insectenkunde @nl
IAO_0000118: insectenleer @nl
id: EUPH:897

enzyme
type: Class
subclass of: protein
IAO_0000117: Michael Rubinigg
IAO_0000118: enzyme
id: EUPH:6478

female
type: Class
subclass of: general qualifier
IAO_0000117: Michael Rubinigg
IAO_0000118: female
IAO_0000118: femeiesc @ro
IAO_0000118: femel @ro
IAO_0000118: femelle @fr
IAO_0000118: femminile @it
IAO_0000118: fêmea @pt
IAO_0000118: hembra @es
IAO_0000118: honlig @sv
IAO_0000118: hunlig @da
IAO_0000118: vrouwelijk @nl
IAO_0000118: weiblich @de
id: EUPH:8184

health status
type: Class
subclass of: status of animal
subclass of: Restriction
  on property: quality of
  some values from: https://www.gbif.org/species/1
IAO_0000117: Michael Rubinigg
IAO_0000118: Gesundheitszustand @de
IAO_0000118: health status
id: EUPH:1266

language
type: Class
subclass of: https://w3id.org/euph/872
subclass of: Restriction
  on property: member of
  some values from: https://w3id.org/euph/7503
subclass of: Restriction
  on property: member of
  some values from: https://w3id.org/euph/7508
IAO_0000117: Michael Rubinigg
IAO_0000118: Sprache @de
IAO_0000118: language
id: EUPH:7502

physical sciences
type: Class
subclass of: https://w3id.org/euph/8138
IAO_0000117: Michael Rubinigg
IAO_0000118: physical sciences
IAO_0000118: physikalische Wissenschaften @de
IAO_0000118: physische wetenschappen @nl
IAO_0000118: sciences physiques @fr
IAO_0000118: scienze fisiche @it
id: EUPH:8108

social sciences
type: Class
subclass of: https://w3id.org/euph/8138
IAO_0000117: Michael Rubinigg
IAO_0000118: Sozialwissenschaften @de
IAO_0000118: sciences sociales @fr
IAO_0000118: scienze sociali @it
IAO_0000118: social sciences
IAO_0000118: sociale wetenschappen @nl
id: EUPH:8112

technology
type: Class
subclass of: https://w3id.org/euph/8138
IAO_0000117: Michael Rubinigg
IAO_0000118: Technologie @de
IAO_0000118: technologie @fr
IAO_0000118: technology
IAO_0000118: tecnologia @it
id: EUPH:8111

diseased
type: Class
subclass of: qualitative attribute
IAO_0000117: Michael Rubinigg
IAO_0000118: ammalato @it
IAO_0000118: bolnav @ro
IAO_0000118: diseased
IAO_0000118: doente @pt
IAO_0000118: enfermo @es
IAO_0000118: erkrankt @de
IAO_0000118: krank @de
IAO_0000118: malade @fr
IAO_0000118: sjuk @no
IAO_0000118: syg @da
IAO_0000118: syk @no
IAO_0000118: ziek @nl
id: EUPH:3396

other
type: Class
subclass of: general qualifier
IAO_0000117: Michael Rubinigg
IAO_0000118: altro @it
IAO_0000118: andere @de
IAO_0000118: autres @fr
IAO_0000118: other
id: EUPH:7375

ligand binding protein
type: Class
subclass of: protein
IAO_0000117: Michael Rubinigg
IAO_0000118: ligand binding protein
id: EUPH:7039

mass concentration
type: Class
subclass of: physical quantity
IAO_0000117: Michael Rubinigg
IAO_0000118: Massenkonzentration @de
IAO_0000118: mass concentration
id: EUPH:7277

column chromatography
type: Class
subclass of: chromatography
IAO_0000117: Michael Rubinigg
IAO_0000118: column chromatography
id: EUPH:8087

liquid chromatography mass spectrometry
type: Class
subclass of: liquid chromatography
IAO_0000117: Michael Rubinigg
IAO_0000118: LC/MS
IAO_0000118: liquid chromatography mass spectrometry
id: EUPH:8094

biomolecule separation technology
type: Class
subclass of: process in chemistry
IAO_0000117: Michael Rubinigg
IAO_0000118: biomolecule separation technology
id: EUPH:8085

population process
type: Class
subclass of: process in biology
IAO_0000117: Michael Rubinigg
IAO_0000118: population process
id: EUPH:1243

property or attribute
type: Class
subclass of: annotation on information resource
IAO_0000117: Michael Rubinigg
IAO_0000118: Eigenschaft oder Attribut @de
IAO_0000118: property or attribute
id: EUPH:8145

male
type: Class
subclass of: general qualifier
IAO_0000117: Michael Rubinigg
IAO_0000118: bărbătesc @ro
IAO_0000118: hanlig @da
IAO_0000118: macho @es
IAO_0000118: male
IAO_0000118: mannelijk @nl
IAO_0000118: maschile @it
IAO_0000118: mascul @ro
IAO_0000118: mâle @fr
IAO_0000118: männlich @de
id: EUPH:8185

ontology
type: Class
subclass of: plan specification
IAO_0000117: Michael Rubinigg
IAO_0000118: Ontologie @de
IAO_0000118: ontology
id: EUPH:7751

temperature
type: Class
subclass of: physical quantity
IAO_0000117: Michael Rubinigg
IAO_0000118: Temperatur @de
IAO_0000118: temperatura @it
IAO_0000118: temperature
IAO_0000118: temperatuur @nl
IAO_0000118: température @fr
id: EUPH:1454

anterior
type: Class
subclass of: anatomy qualifier
IAO_0000117: Michael Rubinigg
IAO_0000118: anterior
IAO_0000118: anteriore @it
IAO_0000118: antérieur @fr
IAO_0000118: for- @da
IAO_0000118: forreste @da
IAO_0000118: främre @sv
IAO_0000118: för @sv
IAO_0000118: voorste @nl
IAO_0000118: vorder- @de
id: EUPH:7947

number
type: Class
subclass of: https://w3id.org/euph/8076
IAO_0000117: Michael Rubinigg
IAO_0000118: Zahl @de
IAO_0000118: number
id: EUPH:8077

analysis
type: Class
subclass of: process in information science
IAO_0000117: Michael Rubinigg
IAO_0000118: Analyse @de
IAO_0000118: analisi @it
IAO_0000118: analiză @ro
IAO_0000118: analys @sv
IAO_0000118: analyse @da
IAO_0000118: analysis
IAO_0000118: análise @pt
IAO_0000118: análisis @es
IAO_0000118: undersökning @sv
id: EUPH:3277

country
type: Class
subclass of: geopolitical region
IAO_0000117: Michael Rubinigg
IAO_0000118: Land @de
IAO_0000118: country
IAO_0000118: država @sl
IAO_0000118: land @nl
IAO_0000118: paese @it
IAO_0000118: pays @fr
id: EUPH:129

general qualifier
type: Class
subclass of: qualitative attribute
IAO_0000117: Michael Rubinigg
IAO_0000118: allgemeine Eigenschaft @de
IAO_0000118: general qualifier
id: EUPH:8147

gas chromatography
type: Class
subclass of: column chromatography
IAO_0000117: Michael Rubinigg
IAO_0000118: GC
IAO_0000118: Gaschromatographie @de
IAO_0000118: gas chromatography
id: EUPH:8088

data element
type: Class
subclass of: data item
IAO_0000117: Michael Rubinigg
IAO_0000118: Datenelement @de
IAO_0000118: data element
IAO_0000118: élément @fr
id: EUPH:7519

qualitative attribute
type: Class
subclass of: property or attribute
IAO_0000117: Michael Rubinigg
IAO_0000118: qualitative attribute
IAO_0000118: qualitatives Attribut @de
id: EUPH:127

SI unit
type: Class
subclass of: measurement unit
subclass of: Restriction
  on property: member of
  some values from: https://w3id.org/euph/8039
IAO_0000117: Michael Rubinigg
IAO_0000118: SI
IAO_0000118: unit of international system of units
id: EUPH:8123

SI base unit
type: Class
subclass of: SI unit
subclass of: Restriction
  on property: has quality
  some values from: https://w3id.org/euph/965
IAO_0000117: Michael Rubinigg
IAO_0000118: base unit of international system of units
id: EUPH:8124

SI derived unit
type: Class
subclass of: SI unit
subclass of: Restriction
  on property: has quality
  some values from: https://w3id.org/euph/968
IAO_0000117: Michael Rubinigg
IAO_0000118: derived unit of international system of units
id: EUPH:8125

uniform resource identifier (URI)
type: Class
subclass of: https://w3id.org/euph/8081
IAO_0000117: Michael Rubinigg
IAO_0000118: URI
IAO_0000118: Uniform Resource Identifier
id: EUPH:8080

integer
type: Class
subclass of: number
IAO_0000117: Gregor Sušanj
IAO_0000118: Ganzzahl @de
IAO_0000118: entier rationnel @fr
IAO_0000118: entier relatif @fr
IAO_0000118: ganze Zahl @de
IAO_0000118: gehel getal @nl
IAO_0000118: heelgetal @nl
IAO_0000118: integer
IAO_0000118: nombre entier @fr
IAO_0000118: numero intero @it
IAO_0000118: numero intero relativo @it
IAO_0000118: numero relativo @it
id: EUPH:7324

medical sciences
type: Class
subclass of: https://w3id.org/euph/8138
IAO_0000117: Michael Rubinigg
IAO_0000118: medical sciences
IAO_0000118: medische wetenschappen @nl
IAO_0000118: medizinische Wissenschaften @de
IAO_0000118: sciences médicales @fr
IAO_0000118: scienze mediche @it
id: EUPH:8109

universally unique identifier (UUID)
type: Class
subclass of: unique identifier (UID)
IAO_0000117: Michael Rubinigg
IAO_0000118: UUID
IAO_0000118: universally unique identifier
id: EUPH:8099

resource description framework (RDF)
type: Class
subclass of: https://w3id.org/euph/8242
IAO_0000117: Michael Rubinigg
IAO_0000118: RDF
IAO_0000118: Resource Description Framework
id: EUPH:8134

real number
type: Class
subclass of: number
IAO_0000117: Gregor Sušanj
IAO_0000118: Dezimalzahl @de
IAO_0000118: decimaal getal @nl
IAO_0000118: decimal
IAO_0000118: decimal number
IAO_0000118: decimal numeral
IAO_0000118: nombre décimal @fr
IAO_0000118: numero decimale @it
IAO_0000118: real number
id: EUPH:7325

unique identifier (UID)
type: Class
subclass of: identifier (ID)
IAO_0000117: Michael Rubinigg
IAO_0000118: UID
IAO_0000118: unique identifier
id: EUPH:8098

dandelion honey
type: Class
subclass of: unifloral honey
subclass of: Restriction
  on property: derives from part of
  some values from: https://www.gbif.org/species/7787708
IAO_0000117: Michael Rubinigg
IAO_0000118: Löwenzahnhonig @de
IAO_0000118: dandelion honey
id: EUPH:8168

rape honey
type: Class
subclass of: unifloral honey
subclass of: Restriction
  on property: derives from part of
  some values from: https://www.gbif.org/species/3042636
IAO_0000117: Michael Rubinigg
IAO_0000118: Rapshonig @de
IAO_0000118: rape honey
id: EUPH:74

sunflower honey
type: Class
subclass of: unifloral honey
subclass of: Restriction
  on property: derives from part of
  some values from: https://www.gbif.org/species/9206251
IAO_0000117: Michael Rubinigg
IAO_0000118: Sonnenblumenhonig @de
IAO_0000118: sunflower honey
id: EUPH:6509

mating
type: Class
subclass of: https://w3id.org/euph/852
IAO_0000117: Michael Rubinigg
IAO_0000118: Begattung @de
IAO_0000118: Paarung @de
IAO_0000118: acasalamento @pt
IAO_0000118: accoppiamento @it
IAO_0000118: accouplement @fr
IAO_0000118: acoplamiento @es
IAO_0000118: cópula @pt
IAO_0000118: kopulasjon @no
IAO_0000118: mating
IAO_0000118: paring @nl
IAO_0000118: parning @sv
IAO_0000118: parring @da
IAO_0000118: împerechere @ro
id: EUPH:8225

sampling protocol
type: Class
subclass of: plan specification
subclass of: Restriction
  on property: member of
  some values from: https://w3id.org/euph/7509
subclass of: Restriction
  on property: member of
  some values from: https://w3id.org/euph/7639
IAO_0000117: Michael Rubinigg
IAO_0000118: sampling protocol
id: EUPH:7476

physical quantity
type: Class
subclass of: https://w3id.org/euph/977
subclass of: Restriction
  on property: quality of
  some values from: immaterial anatomical entity in animals
subclass of: Restriction
  on property: quality of
  some values from: material entity in veterinary medicine
subclass of: Restriction
  on property: quality of
  some values from: immaterial entity in geography
subclass of: Restriction
  on property: quality of
  some values from: material entity in geography
subclass of: Restriction
  on property: quality of
  some values from: material entity in beekeeping
subclass of: Restriction
  on property: quality of
  some values from: immaterial entity in beekeeping
subclass of: Restriction
  on property: quality of
  some values from: material entity in chemistry
subclass of: Restriction
  on property: quality of
  some values from: https://w3id.org/euph/7573
IAO_0000117: Michael Rubinigg
IAO_0000118: Größe @de
IAO_0000118: quantity
id: EUPH:421

whole plant
type: Class
subclass of: plant structure
IAO_0000117: Michael Rubinigg
IAO_0000118: whole plant
id: EUPH:2081

portion of secretory tissue
type: Class
subclass of: portion of plant tissue
IAO_0000117: Michael Rubinigg
IAO_0000118: portion of secretory tissue
id: EUPH:1681

phyllome
type: Class
subclass of: plant organ
IAO_0000117: Michael Rubinigg
IAO_0000118: phyllome
id: EUPH:2514

fruit
type: Class
subclass of: multi-tissue plant structure
IAO_0000117: Michael Rubinigg
IAO_0000118: Frucht @de
IAO_0000118: fruit
id: EUPH:2669

shoot system
type: Class
subclass of: collective plant organ structure
IAO_0000117: Michael Rubinigg
IAO_0000118: shoot system
id: EUPH:2667

portion of plant tissue
type: Class
subclass of: plant structure
IAO_0000117: Michael Rubinigg
IAO_0000118: portion of plant tissue
id: EUPH:1680

plant organ
type: Class
subclass of: multi-tissue plant structure
IAO_0000117: Michael Rubinigg
IAO_0000118: plant organ
id: EUPH:2512

seed
type: Class
subclass of: multi-tissue plant structure
IAO_0000117: Michael Rubinigg
IAO_0000118: seed
id: EUPH:2665

plant structure
type: Class
subclass of: material anatomical entity in plants
IAO_0000117: Michael Rubinigg
IAO_0000118: plant structure
id: EUPH:1412

sporophyll
type: Class
subclass of: phyllome
IAO_0000117: Michael Rubinigg
IAO_0000118: sporophyll
id: EUPH:2079

megasporophyll
type: Class
subclass of: sporophyll
IAO_0000117: Michael Rubinigg
IAO_0000118: megasporophyll
id: EUPH:2373

microsporophyll
type: Class
subclass of: sporophyll
IAO_0000117: Michael Rubinigg
IAO_0000118: microsporophyll
id: EUPH:2080

stamen
type: Class
subclass of: microsporophyll
IAO_0000117: Michael Rubinigg
IAO_0000118: stamen
id: EUPH:1420

carpel
type: Class
subclass of: megasporophyll
IAO_0000117: Michael Rubinigg
IAO_0000118: carpel
id: EUPH:1415

nectary
type: Class
subclass of: portion of secretory tissue
IAO_0000117: Michael Rubinigg
IAO_0000118: Nektarium @de
IAO_0000118: nectary
id: EUPH:1422

flower
type: Class
subclass of: reproductive shoot system
IAO_0000117: Michael Rubinigg
IAO_0000118: Blüte @de
IAO_0000118: flower
id: EUPH:1038

flower nectary
type: Class
subclass of: nectary
IAO_0000117: Michael Rubinigg
IAO_0000118: florales Nektarium @de
IAO_0000118: flower nectary
id: EUPH:1423

extrafloral nectary
type: Class
subclass of: nectary
IAO_0000117: Michael Rubinigg
IAO_0000118: extrafloral nectary
IAO_0000118: extraflorales Nektarium @de
id: EUPH:1421

androecium
type: Class
subclass of: collective phyllome structure
IAO_0000117: Michael Rubinigg
IAO_0000118: androecium
id: EUPH:1414

gynoecium
type: Class
subclass of: collective phyllome structure
IAO_0000117: Michael Rubinigg
IAO_0000118: gynoecium
id: EUPH:1413

anther
type: Class
subclass of: collective plant organ structure
IAO_0000117: Michael Rubinigg
IAO_0000118: anther
id: EUPH:1418

filament
type: Class
subclass of: stalk
IAO_0000117: Michael Rubinigg
IAO_0000118: filament
id: EUPH:1419

plant ovary
type: Class
subclass of: plant structure
IAO_0000117: Michael Rubinigg
IAO_0000118: plant ovary
id: EUPH:1417

stigma
type: Class
subclass of: cardinal organ part
IAO_0000117: Michael Rubinigg
IAO_0000118: Narbe @de
IAO_0000118: Stigma @de
IAO_0000118: arr @no
IAO_0000118: estigma @es
IAO_0000118: märke @sv
IAO_0000118: stigma
IAO_0000118: stigmat @ro
IAO_0000118: stigmate @fr
IAO_0000118: stimma @it
IAO_0000118: støvfang @da
id: EUPH:1036

style
type: Class
subclass of: cardinal organ part
IAO_0000117: Michael Rubinigg
IAO_0000118: style
id: EUPH:1416

cardinal organ part
type: Class
subclass of: cardinal part of multi-tissue plant structure
IAO_0000117: Michael Rubinigg
IAO_0000118: cardinal organ part
id: EUPH:1660

collective plant organ structure
type: Class
subclass of: collective plant structure
IAO_0000117: Michael Rubinigg
IAO_0000118: collective plant organ structure
id: EUPH:2378

collective phyllome structure
type: Class
subclass of: collective plant organ structure
IAO_0000117: Michael Rubinigg
IAO_0000118: collective phyllome structure
id: EUPH:2087

stalk
type: Class
subclass of: cardinal organ part
IAO_0000117: Michael Rubinigg
IAO_0000118: stalk
id: EUPH:1661

reproductive shoot system
type: Class
subclass of: shoot system
IAO_0000117: Michael Rubinigg
IAO_0000118: reproductive shoot system
id: EUPH:2511

sporangium
type: Class
subclass of: plant organ
IAO_0000117: Michael Rubinigg
IAO_0000118: sporangium
id: EUPH:1662

material anatomical entity in plants
type: Class
subclass of: fiat object part in biology
IAO_0000117: Michael Rubinigg
IAO_0000118: pflanzliche anatomische Einheit @de
IAO_0000118: plant anatomical entity
id: EUPH:3290

microsporangium
type: Class
subclass of: sporangium
IAO_0000117: Michael Rubinigg
IAO_0000118: microsporangium
id: EUPH:2083

pollen sac
type: Class
subclass of: microsporangium
IAO_0000117: Michael Rubinigg
IAO_0000118: Pollensack @de
IAO_0000118: pollen sac
id: EUPH:2564

microgametophyte
type: Class
subclass of: whole plant
IAO_0000117: Michael Rubinigg
IAO_0000118: microgametophyte
id: EUPH:2082

pollen grain
type: Class
subclass of: microgametophyte
subclass of: Restriction
  on property: located in
  some values from: pollen sac
IAO_0000117: Michael Rubinigg
IAO_0000118: Pollenkorn @de
IAO_0000118: grain de pollen @fr
IAO_0000118: grano de polen @es
IAO_0000118: granulo pollinico @it
IAO_0000118: grão de pólen @pt
IAO_0000118: grăuncior de polen @ro
IAO_0000118: pollen grain
IAO_0000118: pollenkorn @da
IAO_0000118: stuifmeelkorrel @nl
id: EUPH:2371

multi-tissue plant structure
type: Class
subclass of: plant structure
IAO_0000117: Michael Rubinigg
IAO_0000118: multi-tissue plant structure
id: EUPH:1682

collective plant structure
type: Class
subclass of: plant structure
IAO_0000117: Michael Rubinigg
IAO_0000118: collective plant structure
id: EUPH:1683

cardinal part of multi-tissue plant structure
type: Class
subclass of: plant structure
IAO_0000117: Michael Rubinigg
IAO_0000118: cardinal part of multi-tissue plant structure
id: EUPH:2370

aggregate fruit
type: Class
subclass of: fruit
IAO_0000117: Michael Rubinigg
IAO_0000118: aggregate fruit
id: EUPH:2127

nut fruit
type: Class
subclass of: fruit
IAO_0000117: Michael Rubinigg
IAO_0000118: nut fruit
id: EUPH:2372

drupe fruit
type: Class
subclass of: fruit
IAO_0000117: Michael Rubinigg
IAO_0000118: Steinfrucht @de
IAO_0000118: drupe fruit
id: EUPH:2666

berry fruit
type: Class
subclass of: fruit
IAO_0000117: Michael Rubinigg
IAO_0000118: berry fruit
id: EUPH:1972

pome fruit
type: Class
subclass of: berry fruit
IAO_0000117: Michael Rubinigg
IAO_0000118: pome fruit
id: EUPH:1838

ryanodine receptor
type: Class
subclass of: ligand binding protein
IAO_0000117: Michael Rubinigg
IAO_0000118: RyRs
IAO_0000118: Ryanodin-Rezeptor @de
IAO_0000118: recettore rianodinico @it
IAO_0000118: ryanodine receptor
IAO_0000118: ryanodinereceptor @nl
IAO_0000118: récepteur de la ryanodine @fr
id: EUPH:6543

measure of dispersion
type: Class
subclass of: statistic
IAO_0000117: Michael Rubinigg
IAO_0000118: measure of dispersion
id: EUPH:7845

measure of central tendency
type: Class
subclass of: statistic
IAO_0000117: Michael Rubinigg
IAO_0000118: measure of central tendency
id: EUPH:7838

range
type: Class
subclass of: measure of dispersion
IAO_0000117: Michael Rubinigg
IAO_0000118: range
id: EUPH:7855

standard error of the mean
type: Class
subclass of: standard error of estimate
IAO_0000117: Michael Rubinigg
IAO_0000118: standard error of the mean
id: EUPH:7850

statistic
type: Class
subclass of: data item
subclass of: Restriction
  on property: functionally related to
  some values from: https://w3id.org/euph/7836
IAO_0000117: Michael Rubinigg
IAO_0000118: Statistik @de
IAO_0000118: statistic
id: EUPH:7837

count
type: Class
subclass of: statistic
IAO_0000117: Michael Rubinigg
IAO_0000118: Anzahl @de
IAO_0000118: number
id: EUPH:548

skewness
type: Class
subclass of: statistic
IAO_0000117: Michael Rubinigg
IAO_0000118: skewness
id: EUPH:7864

study group population size
type: Class
subclass of: count
IAO_0000117: Michael Rubinigg
IAO_0000118: Stichprobenumfang @de
IAO_0000118: numero di campioni @it
IAO_0000118: sample size
IAO_0000118: steekproefomvang @nl
IAO_0000118: taille de l'échantillon @fr
id: EUPH:7373

variance
type: Class
subclass of: measure of dispersion
IAO_0000117: Michael Rubinigg
IAO_0000118: Varianz @de
IAO_0000118: variance
id: EUPH:7846

minimum observed value
type: Class
subclass of: statistic
IAO_0000117: Michael Rubinigg
IAO_0000118: minimum
IAO_0000118: minimum observed value
id: EUPH:7861

maximum observed value
type: Class
subclass of: statistic
IAO_0000117: Michael Rubinigg
IAO_0000118: maximum
IAO_0000118: maximum observed value
id: EUPH:7860

quartile
type: Class
subclass of: quantile
IAO_0000117: Michael Rubinigg
IAO_0000118: quartile
id: EUPH:7843

inter quartile range
type: Class
subclass of: measure of dispersion
IAO_0000117: Michael Rubinigg
IAO_0000118: inter quartile range
id: EUPH:7852

kurtosis
type: Class
subclass of: statistic
IAO_0000117: Michael Rubinigg
IAO_0000118: kurtosis
id: EUPH:7859

ratio
type: Class
subclass of: statistic
IAO_0000117: Michael Rubinigg
IAO_0000118: Verhältnis @de
IAO_0000118: ratio
id: EUPH:7862

quantification cycle (Cq)
type: Class
subclass of: number of PCR cycle
IAO_0000117: Michael Rubinigg
IAO_0000118: Cq
IAO_0000118: quantification cycle
id: EUPH:7347

confidence interval
type: Class
subclass of: measure of dispersion
IAO_0000117: Michael Rubinigg
IAO_0000118: Konfidenzintervall @de
IAO_0000118: confidence interval
id: EUPH:7853

number of PCR cycle
type: Class
subclass of: physical quantity
IAO_0000117: Michael Rubinigg
IAO_0000118: number of PCR cycle
id: EUPH:7858

coefficient of variation
type: Class
subclass of: measure of dispersion
IAO_0000117: Michael Rubinigg
IAO_0000118: coefficient of variation
id: EUPH:7854

standard deviation
type: Class
subclass of: measure of dispersion
IAO_0000117: Michael Rubinigg
IAO_0000118: Standardabweichung @de
IAO_0000118: standard deviation
id: EUPH:7851

quantile
type: Class
subclass of: statistic
IAO_0000117: Michael Rubinigg
IAO_0000118: quantile
id: EUPH:7840

decile
type: Class
subclass of: quantile
IAO_0000117: Michael Rubinigg
IAO_0000118: decile
id: EUPH:7841

percentile
type: Class
subclass of: quantile
IAO_0000117: Michael Rubinigg
IAO_0000118: percentile
id: EUPH:7842

accuracy
type: Class
subclass of: ratio
subclass of: Restriction
  on property: member of
  some values from: https://w3id.org/euph/7639
IAO_0000117: Michael Rubinigg
IAO_0000118: accuracy
id: EUPH:3314

precision
type: Class
subclass of: ratio
IAO_0000117: Michael Rubinigg
IAO_0000118: precision
id: EUPH:3316

estimated breeding value
type: Class
subclass of: statistic in animal breeding
subclass of: Restriction
  on property: generically depends on
  some values from: https://w3id.org/euph/7868
IAO_0000117: Michael Rubinigg
IAO_0000118: EBV
IAO_0000118: Zuchtwert @de
IAO_0000118: breeding value
IAO_0000118: estimated breeding value
IAO_0000118: fokwaarde @nl
IAO_0000118: geschätzter Zuchtwert @de
IAO_0000118: indice @it
IAO_0000118: valeur d'élevage @fr
IAO_0000118: valeur génétique @fr
IAO_0000118: valor genético @es
IAO_0000118: valore riproduttivo @it
id: EUPH:2998

heritability
type: Class
subclass of: https://w3id.org/euph/8236
subclass of: Restriction
  on property: has characteristic
  some values from: ratio
IAO_0000117: Michael Rubinigg
IAO_0000118: heritability
id: EUPH:7863

standard error of estimate
type: Class
subclass of: measure of dispersion
IAO_0000117: Michael Rubinigg
IAO_0000118: standard error of estimate
id: EUPH:7849

average value
type: Class
subclass of: measure of central tendency
IAO_0000117: Michael Rubinigg
IAO_0000118: Arithmetisches Mittel @de
IAO_0000118: arithmetic mean
id: EUPH:7839

center value
type: Class
subclass of: measure of central tendency
IAO_0000117: Michael Rubinigg
IAO_0000118: Median @de
IAO_0000118: center value
IAO_0000118: median
IAO_0000118: médiane @fr
IAO_0000118: second quartile
id: EUPH:7844

number of false positive
type: Class
subclass of: count
IAO_0000117: Michael Rubinigg
IAO_0000118: Anzahl falsch positive @de
IAO_0000118: number of false positive
id: EUPH:7857

number of false negative
type: Class
subclass of: count
IAO_0000117: Michael Rubinigg
IAO_0000118: Anzahl falsch negative @de
IAO_0000118: number of false negative
id: EUPH:7856

percent
type: Class
subclass of: https://w3id.org/euph/916
subclass of: Restriction
  on property: is unit of
  some values from: share
subclass of: Restriction
  on property: has characteristic
  some values from: ratio
IAO_0000117: Michael Rubinigg
IAO_0000118: Prozentsatz @de
IAO_0000118: percent
id: EUPH:502

variance for sample
type: Class
subclass of: variance
IAO_0000117: Michael Rubinigg
IAO_0000118: sample variance
id: EUPH:7848

population variance
type: Class
subclass of: variance
IAO_0000117: Michael Rubinigg
IAO_0000118: population variance
id: EUPH:7847

sum
type: Class
subclass of: statistic
IAO_0000117: Michael Rubinigg
IAO_0000118: Summe @de
IAO_0000118: som @nl
IAO_0000118: somma @it
IAO_0000118: somme @fr
IAO_0000118: sum
id: EUPH:7865

frequency
type: Class
subclass of: physical quantity
subclass of: Restriction
  on property: has characteristic
  some values from: ratio
IAO_0000117: Michael Rubinigg
IAO_0000118: Frequenz @de
IAO_0000118: frequency
id: EUPH:455

compound eye
type: Class
subclass of: multi-unit eye
subclass of: Restriction
  on property: composed primarily of
  some values from: ommatidium
IAO_0000117: Michael Rubinigg
IAO_0000118: Facettenauge @de
IAO_0000118: compound eye
IAO_0000118: facetoog @nl
IAO_0000118: fasettöga @sv
IAO_0000118: fasettøye @no
IAO_0000118: occhio composto @it
IAO_0000118: ochi compus @ro
IAO_0000118: oeil composé @fr
IAO_0000118: ojo compuesto @es
IAO_0000118: olho composto @pt
IAO_0000118: samengesteld oog @nl
IAO_0000118: sammensat øje @da
id: EUPH:7911

sense organ
type: Class
subclass of: organ
IAO_0000117: Michael Rubinigg
IAO_0000118: sense organ
id: EUPH:1217

wing
type: Class
subclass of: appendage
IAO_0000117: Michael Rubinigg
IAO_0000118: Flügel @de
IAO_0000118: aile @fr
IAO_0000118: ala @es
IAO_0000118: aripă @ro
IAO_0000118: asa @pt
IAO_0000118: vinge @da
IAO_0000118: vleugel @nl
IAO_0000118: wing
id: EUPH:2832

appendage
type: Class
subclass of: organism subdivision
IAO_0000117: Michael Rubinigg
IAO_0000118: appendage
id: EUPH:2847

anatomical structure
type: Class
subclass of: material anatomical entity in animals
IAO_0000117: Michael Rubinigg
IAO_0000118: connected anatomical structure
IAO_0000118: zusammenhängende anatomische Struktur @de
id: EUPH:7920

organ
type: Class
subclass of: multicellular anatomical structure
IAO_0000117: Michael Rubinigg
IAO_0000118: Organ @de
IAO_0000118: orgaan @nl
IAO_0000118: organ @da
IAO_0000118: organe @fr
IAO_0000118: organo @it
IAO_0000118: órgano @es
IAO_0000118: órgão @pt
id: EUPH:3381

organ part
type: Class
subclass of: multicellular anatomical structure
IAO_0000117: Michael Rubinigg
IAO_0000118: organ part
id: EUPH:1274

amnion
type: Class
subclass of: organ part
subclass of: Restriction
  on property: part of
  some values from: egg
IAO_0000117: Michael Rubinigg
IAO_0000118: Amnion @de
IAO_0000118: amnion @da
IAO_0000118: amnios @es
IAO_0000118: binnenste eivlies @nl
IAO_0000118: inre fosterhinna @sv
IAO_0000118: âmnio @pt
id: EUPH:7925

organism substance
type: Class
subclass of: material anatomical entity in animals
IAO_0000117: Michael Rubinigg
IAO_0000118: organism substance
id: EUPH:1221

anatomical space
type: Class
subclass of: immaterial anatomical entity in animals
IAO_0000117: Michael Rubinigg
IAO_0000118: anatomical space
IAO_0000118: anatomischer Raum @de
id: EUPH:7951

material anatomical entity in animals
type: Class
subclass of: fiat object part in biology
IAO_0000117: Michael Rubinigg
IAO_0000118: material anatomical entity
IAO_0000118: materielle anatomische Einheit @de
id: EUPH:7949

immaterial anatomical entity in animals
type: Class
subclass of: https://w3id.org/euph/7723
IAO_0000117: Michael Rubinigg
IAO_0000118: immaterial anatomical entity
IAO_0000118: immaterielle anatomische Einheit @de
id: EUPH:7950

anatomical system
type: Class
subclass of: anatomical structure
IAO_0000117: Michael Rubinigg
IAO_0000118: anatomical system
IAO_0000118: anatomisches System @de
id: EUPH:7919

multicellular organism
type: Class
subclass of: multicellular anatomical structure
IAO_0000117: Michael Rubinigg
IAO_0000118: multicellular organism
IAO_0000118: multizellulärer Organismus @de
id: EUPH:7924

organism subdivision
type: Class
subclass of: multicellular anatomical structure
IAO_0000117: Michael Rubinigg
IAO_0000118: Unterteilung des Organismus @de
IAO_0000118: organism subdivision
id: EUPH:7918

acellular anatomical structure
type: Class
subclass of: anatomical structure
IAO_0000117: Michael Rubinigg
IAO_0000118: acellular anatomical structure
IAO_0000118: azelluläre anatomische Struktur @de
id: EUPH:3382

tissue
type: Class
subclass of: multicellular anatomical structure
IAO_0000117: Michael Rubinigg
IAO_0000118: Gewebe @de
IAO_0000118: tissue
id: EUPH:4012

organismal segment
type: Class
subclass of: organism subdivision
IAO_0000117: Michael Rubinigg
IAO_0000118: Segment eines Organismus @de
IAO_0000118: organismal segment
IAO_0000118: segment d'un organisme @fr
IAO_0000118: segment van een organisme @nl
IAO_0000118: segmento di un organismo @it
id: EUPH:1032

eye
type: Class
subclass of: sense organ
IAO_0000117: Michael Rubinigg
IAO_0000118: Auge @de
IAO_0000118: eye
IAO_0000118: occhio @it
IAO_0000118: oog @nl
IAO_0000118: œil @fr
id: EUPH:1033

ommatidium
type: Class
subclass of: eye
subclass of: Restriction
  on property: part of
  some values from: compound eye
IAO_0000117: Michael Rubinigg
IAO_0000118: Einzelauge @de
IAO_0000118: Ommatidium @de
IAO_0000118: enkeltøye @da
IAO_0000118: fasett @sv
IAO_0000118: ochi simplu @ro
IAO_0000118: omatidie @ro
IAO_0000118: omatidio @es
IAO_0000118: omatídeo @pt
IAO_0000118: ommatidie @fr
IAO_0000118: ommatidio @it
IAO_0000118: ommatidium @da
id: EUPH:7912

antenna
type: Class
subclass of: lateral structure
IAO_0000117: Michael Rubinigg
IAO_0000118: Antenne @de
IAO_0000118: Fühler @de
IAO_0000118: antena @es
IAO_0000118: antenn @sv
IAO_0000118: antenna
IAO_0000118: antenne @da
IAO_0000118: antenă @ro
IAO_0000118: følehorn @da
IAO_0000118: känselspröt @sv
IAO_0000118: spriet @nl
id: EUPH:7939

reproductive system
type: Class
subclass of: anatomical system
IAO_0000117: Michael Rubinigg
IAO_0000118: Geschlechtsapparat @de
IAO_0000118: aparato genital @es
IAO_0000118: aparelho genital @pt
IAO_0000118: apparato genitale @it
IAO_0000118: appareil génital @fr
IAO_0000118: fortplantningsorgan @sv
IAO_0000118: genital system
IAO_0000118: kjønnsorganer @no
IAO_0000118: könsorgan @sv
IAO_0000118: kønsorganer @da
IAO_0000118: organe sexuale @ro
IAO_0000118: reproductive system
IAO_0000118: sexual organs
IAO_0000118: sistem reproducător @ro
IAO_0000118: sistema reproductor @es
IAO_0000118: sistema reprodutor @pt
IAO_0000118: sistema riproduttivo @it
IAO_0000118: voortplantingsorganen @nl
IAO_0000118: órgãos reprodutores @pt
IAO_0000118: órgãos sexuais @pt
id: EUPH:2354

cuticle
type: Class
subclass of: acellular anatomical structure
IAO_0000117: Michael Rubinigg
IAO_0000118: cuticle
id: EUPH:2841

respiratory system
type: Class
subclass of: anatomical system
IAO_0000117: Michael Rubinigg
IAO_0000118: Atmungsorgane @de
IAO_0000118: Atmungssystem @de
IAO_0000118: ademhalingsstelsel @nl
IAO_0000118: andningsorgan @sv
IAO_0000118: respiratory system
IAO_0000118: sistem respirator @ro
IAO_0000118: sistema respiratorio @es
IAO_0000118: sistema respiratório @pt
IAO_0000118: système respiratoire @fr
IAO_0000118: åndedrettsorganer @no
IAO_0000118: åndedrætsorganer @da
id: EUPH:2545

digestive system
type: Class
subclass of: anatomical system
IAO_0000117: Michael Rubinigg
IAO_0000118: Verdauungskanal @de
IAO_0000118: alimentary canal
IAO_0000118: canal alimentar @pt
IAO_0000118: canale alimentare @it
IAO_0000118: digestive tract
IAO_0000118: fordøjelseskanal @da
IAO_0000118: fordøyelseskanal @no
IAO_0000118: gut
IAO_0000118: matsmältningskanal @sv
IAO_0000118: spijsverteringskanaal @nl
IAO_0000118: tarmkanal @da
IAO_0000118: tracto digestivo @pt
IAO_0000118: tub digestiv @ro
IAO_0000118: tube digestif @fr
IAO_0000118: tubo digerente @it
IAO_0000118: tubo digestivo @es
id: EUPH:3304

muscle tissue
type: Class
subclass of: tissue
IAO_0000117: Michael Rubinigg
IAO_0000118: Muskelgewebe @de
IAO_0000118: muscle tissue
id: EUPH:4011

gland
type: Class
subclass of: organ
IAO_0000117: Michael Rubinigg
IAO_0000118: Drüse @de
IAO_0000118: ghiandola @it
IAO_0000118: gland
IAO_0000118: glande @fr
IAO_0000118: glandă @ro
IAO_0000118: glándula @es
IAO_0000118: glândula @pt
IAO_0000118: kirtel @da
IAO_0000118: kjertel @no
IAO_0000118: klier @nl
IAO_0000118: körtel @sv
id: EUPH:7922

larva
type: Class
subclass of: immature insect
subclass of: Restriction
  on property: located in
  some values from: cell
IAO_0000117: Michael Rubinigg
IAO_0000118: Larve @de
IAO_0000118: larf @nl
IAO_0000118: larv @sv
IAO_0000118: larva
IAO_0000118: larve @da
IAO_0000118: larvă @ro
id: EUPH:7374

ectoderm-derived structure
type: Class
subclass of: anatomical structure
IAO_0000117: Michael Rubinigg
IAO_0000118: ectoderm-derived structure
id: EUPH:849

multi-limb segment region
type: Class
subclass of: subdivision of organism along appendicular axis
IAO_0000117: Michael Rubinigg
IAO_0000118: multi-limb segment region
id: EUPH:1216

multicellular anatomical structure
type: Class
subclass of: anatomical structure
IAO_0000117: Michael Rubinigg
IAO_0000118: multicellular anatomical structure
IAO_0000118: multizelluläre anatomische Struktur @de
id: EUPH:7917

subdivision of organism along appendicular axis
type: Class
subclass of: organism subdivision
IAO_0000117: Michael Rubinigg
IAO_0000118: subdivision of organism along appendicular axis
id: EUPH:1215

organ system subdivision
type: Class
subclass of: multicellular anatomical structure
IAO_0000117: Michael Rubinigg
IAO_0000118: organ system subdivision
id: EUPH:2253

subdivision of organism along main body axis
type: Class
subclass of: organism subdivision
IAO_0000117: Michael Rubinigg
IAO_0000118: subdivision of organism along main body axis
id: EUPH:2196

cocoon
type: Class
subclass of: pupal case
IAO_0000117: Michael Rubinigg
IAO_0000118: Kokon @de
IAO_0000118: bozzolo @it
IAO_0000118: capullo @es
IAO_0000118: casulo @pt
IAO_0000118: cocon @fr
IAO_0000118: cocoon
IAO_0000118: kokon @da
IAO_0000118: kokong @no
IAO_0000118: puppa @sv
IAO_0000118: puppegemme @da
id: EUPH:3384

multi-unit eye
type: Class
subclass of: eye
IAO_0000117: Michael Rubinigg
IAO_0000118: multi-unit eye
id: EUPH:1034

lateral structure
type: Class
subclass of: anatomical structure
IAO_0000117: Michael Rubinigg
IAO_0000118: lateral structure
IAO_0000118: seitliche Struktur @de
id: EUPH:8007

pupal case
type: Class
subclass of: acellular anatomical structure
IAO_0000117: Michael Rubinigg
IAO_0000118: Puppenhülle @de
IAO_0000118: pupal case
id: EUPH:3383

arthropod tagma
type: Class
subclass of: subdivision of organism along main body axis
IAO_0000117: Michael Rubinigg
IAO_0000118: arthropod tagma
id: EUPH:2197

insect thoracic segment
type: Class
subclass of: organismal segment
IAO_0000117: Michael Rubinigg
IAO_0000118: insect thoracic segment
id: EUPH:2477

insect abdominal segment
type: Class
subclass of: organismal segment
IAO_0000117: Michael Rubinigg
IAO_0000118: insect abdominal segment
id: EUPH:2194

insect adult tagma
type: Class
subclass of: arthropod tagma
IAO_0000117: Michael Rubinigg
IAO_0000118: Tagma @de
IAO_0000118: tagma
id: EUPH:7907

insect adult head
type: Class
subclass of: insect adult tagma
IAO_0000117: Michael Rubinigg
IAO_0000118: Kopf @de
IAO_0000118: head
id: EUPH:7909

insect adult thorax
type: Class
subclass of: insect adult tagma
IAO_0000117: Michael Rubinigg
IAO_0000118: Brust @de
IAO_0000118: Thorax @de
IAO_0000118: borststuk @nl
IAO_0000118: bryst @da
IAO_0000118: bröstkorg @sv
IAO_0000118: mellankropp @sv
IAO_0000118: thorax
IAO_0000118: throax @da
IAO_0000118: torace @it
IAO_0000118: tórax @es
id: EUPH:7908

insect adult thoracic segment
type: Class
subclass of: insect thoracic segment
IAO_0000117: Michael Rubinigg
IAO_0000118: Brustsegment @de
IAO_0000118: thoracic segment
id: EUPH:7944

insect adult abdomen
type: Class
subclass of: insect adult tagma
IAO_0000117: Michael Rubinigg
IAO_0000118: Abdomen @de
IAO_0000118: Hinterleib @de
IAO_0000118: abdome @pt
IAO_0000118: abdomen @da
IAO_0000118: abdómen @pt
IAO_0000118: achterlijf @nl
IAO_0000118: addome @it
IAO_0000118: bagkrop @da
IAO_0000118: bakkropp @no
id: EUPH:3293

insect adult abdominal segment
type: Class
subclass of: insect abdominal segment
IAO_0000117: Michael Rubinigg
IAO_0000118: Hinterleibsring @de
IAO_0000118: Ring @de
IAO_0000118: Segment @de
IAO_0000118: inel @ro
IAO_0000118: insect adult abdominal segment
IAO_0000118: led @da
IAO_0000118: ring @nl
IAO_0000118: segment @da
IAO_0000118: segmento @es
id: EUPH:2195

tergite
type: Class
subclass of: organ system subdivision
IAO_0000117: Michael Rubinigg
IAO_0000118: Rückenschuppe @de
IAO_0000118: Tergit @de
IAO_0000118: dorsal plate
IAO_0000118: lamina dorsale @it
IAO_0000118: placa dorsal @es
IAO_0000118: rugschild @nl
IAO_0000118: ryggplate @no
IAO_0000118: ryggplatta @sv
IAO_0000118: rygplade @da
IAO_0000118: tergiet @nl
IAO_0000118: tergit @da
IAO_0000118: tergita @es
IAO_0000118: tergite
IAO_0000118: tergito @pt
id: EUPH:885

insect clypeus
type: Class
subclass of: ectoderm-derived structure
IAO_0000117: Michael Rubinigg
IAO_0000118: Kopfschild @de
IAO_0000118: clipeo @it
IAO_0000118: clipeus @ro
IAO_0000118: clypeus @da
IAO_0000118: clípeo @es
IAO_0000118: hodeskjold @no
IAO_0000118: huvudsköld @sv
IAO_0000118: kopschild @nl
IAO_0000118: mundskjold @da
IAO_0000118: munsköld @sv
id: EUPH:690

metre
type: Class
subclass of: SI base unit
subclass of: Restriction
  on property: is unit of
  some values from: length
IAO_0000117: Michael Rubinigg
IAO_0000118: Meter @de
IAO_0000118: meter @sl
IAO_0000118: metre
IAO_0000118: mètre @fr
id: EUPH:529

kilogram
type: Class
subclass of: SI base unit
subclass of: Restriction
  on property: is unit of
  some values from: mass
IAO_0000117: Michael Rubinigg
IAO_0000118: Kilogramm @de
IAO_0000118: kilogram
id: EUPH:586

second
type: Class
subclass of: SI base unit
subclass of: Restriction
  on property: member of
  some values from: https://w3id.org/euph/838
subclass of: Restriction
  on property: is unit of
  some values from: time
IAO_0000117: Michael Rubinigg
IAO_0000118: Sekunde @de
IAO_0000118: second
IAO_0000118: sekunda @sl
id: EUPH:577

ampere
type: Class
subclass of: SI base unit
subclass of: Restriction
  on property: is unit of
  some values from: electric current
IAO_0000117: Michael Rubinigg
IAO_0000118: Ampere @de
IAO_0000118: ampere
id: EUPH:605

kelvin
type: Class
subclass of: SI base unit
subclass of: Restriction
  on property: is unit of
  some values from: thermodynamic temperature
IAO_0000117: Michael Rubinigg
IAO_0000118: Kelvin @de
id: EUPH:612

mole
type: Class
subclass of: SI base unit
subclass of: Restriction
  on property: is unit of
  some values from: amount of substance
IAO_0000117: Michael Rubinigg
IAO_0000118: Mol @de
IAO_0000118: mole
id: EUPH:610

candela
type: Class
subclass of: SI base unit
subclass of: Restriction
  on property: is unit of
  some values from: luminous intensity
IAO_0000117: Michael Rubinigg
IAO_0000118: Candela @de
IAO_0000118: candela
id: EUPH:622

degree Celsius
type: Class
subclass of: https://w3id.org/euph/8126
subclass of: Restriction
  on property: is unit of
  some values from: Celsius temperature
IAO_0000117: Michael Rubinigg
IAO_0000118: Grad Celsius @de
IAO_0000118: degree Celsius
id: EUPH:566

minute
type: Class
subclass of: https://w3id.org/euph/8129
subclass of: Restriction
  on property: member of
  some values from: https://w3id.org/euph/838
subclass of: Restriction
  on property: is unit of
  some values from: time
IAO_0000117: Michael Rubinigg
IAO_0000118: Minute @de
IAO_0000118: minuta @sl
IAO_0000118: minute
id: EUPH:576

hour
type: Class
subclass of: https://w3id.org/euph/8129
subclass of: Restriction
  on property: member of
  some values from: https://w3id.org/euph/838
subclass of: Restriction
  on property: is unit of
  some values from: time
IAO_0000117: Michael Rubinigg
IAO_0000118: Stunde @de
IAO_0000118: hour
IAO_0000118: ura @sl
id: EUPH:575

day
type: Class
subclass of: https://w3id.org/euph/8129
subclass of: Restriction
  on property: is unit of
  some values from: time
IAO_0000117: Michael Rubinigg
IAO_0000118: Tag @de
IAO_0000118: dag @nl
IAO_0000118: dan @sl
IAO_0000118: day
IAO_0000118: giorno @it
IAO_0000118: jour @fr
id: EUPH:574

litre
type: Class
subclass of: https://w3id.org/euph/8129
subclass of: Restriction
  on property: is unit of
  some values from: volume
IAO_0000117: Michael Rubinigg
IAO_0000118: Liter @de
IAO_0000118: liter @sl
IAO_0000118: litre
id: EUPH:541

pascal
type: Class
subclass of: https://w3id.org/euph/8126
subclass of: Restriction
  on property: is unit of
  some values from: pressure
IAO_0000117: Michael Rubinigg
IAO_0000118: Pascal @de
IAO_0000118: pascal
id: EUPH:615

joule
type: Class
subclass of: https://w3id.org/euph/8126
subclass of: Restriction
  on property: is unit of
  some values from: energy
IAO_0000117: Michael Rubinigg
IAO_0000118: Joule @de
IAO_0000118: džul @sl
IAO_0000118: joule
id: EUPH:563

watt
type: Class
subclass of: https://w3id.org/euph/8126
subclass of: Restriction
  on property: is unit of
  some values from: power
IAO_0000117: Michael Rubinigg
IAO_0000118: Watt @de
IAO_0000118: vat @sl
IAO_0000118: watt
id: EUPH:565

radian
type: Class
subclass of: https://w3id.org/euph/8126
subclass of: Restriction
  on property: is unit of
  some values from: plane angle
IAO_0000117: Michael Rubinigg
IAO_0000118: Radiant @de
IAO_0000118: radian
id: EUPH:603

steradian
type: Class
subclass of: https://w3id.org/euph/8126
subclass of: Restriction
  on property: is unit of
  some values from: solid angle
IAO_0000117: Michael Rubinigg
IAO_0000118: Steradiant @de
IAO_0000118: steradian
id: EUPH:604

degree
type: Class
subclass of: https://w3id.org/euph/8129
subclass of: Restriction
  on property: is unit of
  some values from: plane and phase angle
IAO_0000117: Michael Rubinigg
IAO_0000118: Grad @de
IAO_0000118: degree
id: EUPH:602

volt
type: Class
subclass of: https://w3id.org/euph/8126
subclass of: Restriction
  on property: is unit of
  some values from: electric potential difference
IAO_0000117: Michael Rubinigg
IAO_0000118: Volt @de
IAO_0000118: volt
id: EUPH:606

coulomb
type: Class
subclass of: https://w3id.org/euph/8126
subclass of: Restriction
  on property: is unit of
  some values from: electric charge
IAO_0000117: Michael Rubinigg
IAO_0000118: Coulomb @de
IAO_0000118: coulomb
id: EUPH:625

dalton
type: Class
subclass of: https://w3id.org/euph/8129
subclass of: Restriction
  on property: is unit of
  some values from: mass
IAO_0000117: Michael Rubinigg
IAO_0000118: Dalton @de
IAO_0000118: dalton
id: EUPH:658

weber
type: Class
subclass of: https://w3id.org/euph/8126
subclass of: Restriction
  on property: is unit of
  some values from: magnetic flux
IAO_0000117: Michael Rubinigg
IAO_0000118: Weber @de
IAO_0000118: weber
id: EUPH:626

tesla
type: Class
subclass of: https://w3id.org/euph/8126
subclass of: Restriction
  on property: is unit of
  some values from: magnetic flux density
IAO_0000117: Michael Rubinigg
IAO_0000118: Tesla @de
IAO_0000118: tesla
id: EUPH:627

decibel
type: Class
subclass of: https://w3id.org/euph/8129
subclass of: Restriction
  on property: is unit of
  some values from: logarithmic ratio quantities
IAO_0000117: Michael Rubinigg
IAO_0000118: Dezibel @de
IAO_0000118: decibel
id: EUPH:661

siemens
type: Class
subclass of: https://w3id.org/euph/8126
subclass of: Restriction
  on property: is unit of
  some values from: electric conductance
IAO_0000117: Michael Rubinigg
IAO_0000118: Siemens @de
IAO_0000118: siemens
id: EUPH:609

electronvolt
type: Class
subclass of: https://w3id.org/euph/8129
subclass of: Restriction
  on property: is unit of
  some values from: energy
IAO_0000117: Michael Rubinigg
IAO_0000118: Elektronenvolt @de
IAO_0000118: electronvolt
IAO_0000118: elektronvolt @sl
id: EUPH:564

hectare
type: Class
subclass of: https://w3id.org/euph/8129
subclass of: Restriction
  on property: is unit of
  some values from: area
IAO_0000117: Michael Rubinigg
IAO_0000118: Hektar @de
IAO_0000118: hectare
id: EUPH:536

access rights
type: Class
subclass of: conditional specification
subclass of: Restriction
  on property: member of
  some values from: https://w3id.org/euph/7503
subclass of: Restriction
  on property: member of
  some values from: https://w3id.org/euph/7508
IAO_0000117: Michael Rubinigg
IAO_0000118: access rights
id: EUPH:7556

bibliographic citation
type: Class
subclass of: document
subclass of: Restriction
  on property: member of
  some values from: https://w3id.org/euph/7503
subclass of: Restriction
  on property: member of
  some values from: https://w3id.org/euph/7508
IAO_0000117: Michael Rubinigg
IAO_0000118: bibliographic citation
id: EUPH:7557

license
type: Class
subclass of: conditional specification
subclass of: Restriction
  on property: member of
  some values from: https://w3id.org/euph/7503
subclass of: Restriction
  on property: member of
  some values from: https://w3id.org/euph/7508
IAO_0000117: Michael Rubinigg
IAO_0000118: license
id: EUPH:7497

date modified
type: Class
subclass of: zero-dimensional temporal region in information science
subclass of: Restriction
  on property: member of
  some values from: https://w3id.org/euph/7503
subclass of: Restriction
  on property: member of
  some values from: https://w3id.org/euph/7508
subclass of: Restriction
  on property: characteristic of
  some values from: data element
subclass of: Restriction
  on property: characteristic of
  some values from: https://w3id.org/euph/7515
subclass of: Restriction
  on property: characteristic of
  some values from: https://w3id.org/euph/872
IAO_0000117: Michael Rubinigg
IAO_0000118: date modified
id: EUPH:7554

reference
type: Class
subclass of: document
subclass of: Restriction
  on property: member of
  some values from: https://w3id.org/euph/7503
subclass of: Restriction
  on property: member of
  some values from: https://w3id.org/euph/7508
IAO_0000117: Michael Rubinigg
IAO_0000118: Literaturangabe @de
IAO_0000118: henvisning @da
IAO_0000118: hänvisning @sv
IAO_0000118: referata @es
IAO_0000118: reference
IAO_0000118: referencia @es
IAO_0000118: referinţă bibliografică @ro
IAO_0000118: referência @pt
IAO_0000118: riferimento bibliografico @it
IAO_0000118: référence @fr
IAO_0000118: verwijzing @nl
id: EUPH:7558

rights holder
type: Class
subclass of: role in information science
subclass of: Restriction
  on property: member of
  some values from: https://w3id.org/euph/7503
subclass of: Restriction
  on property: member of
  some values from: https://w3id.org/euph/7508
IAO_0000117: Michael Rubinigg
IAO_0000118: rights holder
id: EUPH:7555

information content type
type: Class
subclass of: https://w3id.org/euph/990
subclass of: Restriction
  on property: member of
  some values from: https://w3id.org/euph/7503
subclass of: Restriction
  on property: member of
  some values from: https://w3id.org/euph/7508
subclass of: Restriction
  on property: quality of
  some values from: https://w3id.org/euph/872
IAO_0000117: Michael Rubinigg
IAO_0000118: information content type
id: EUPH:7504

identification
type: Class
subclass of: information content entity in biology
subclass of: Restriction
  on property: member of
  some values from: https://w3id.org/euph/7507
IAO_0000117: Michael Rubinigg
IAO_0000118: Betimmung @de
IAO_0000118: Identifizierung @de
IAO_0000118: bestemmelse @da
IAO_0000118: bestämning @sv
IAO_0000118: determinare @ro
IAO_0000118: herkenning @nl
IAO_0000118: identificación @es
IAO_0000118: identificare @ro
IAO_0000118: identificatie @nl
IAO_0000118: identification
IAO_0000118: identificazione @it
IAO_0000118: identificação @pt
IAO_0000118: identificering @da
IAO_0000118: identifiering @sv
IAO_0000118: identifikasjon @no
id: EUPH:7463

material sample
type: Class
subclass of: object in information science
subclass of: Restriction
  on property: has quality
  some values from: https://w3id.org/euph/7552
subclass of: Restriction
  on property: member of
  some values from: https://w3id.org/euph/7507
IAO_0000117: Michael Rubinigg
IAO_0000118: Muster @de
IAO_0000118: Probe @de
IAO_0000118: amostra @pt
IAO_0000118: campione @it
IAO_0000118: material sample
IAO_0000118: monster @nl
IAO_0000118: mostră @ro
IAO_0000118: muestra @es
IAO_0000118: probă @ro
IAO_0000118: prov @sv
IAO_0000118: prøve @da
IAO_0000118: sample
IAO_0000118: échantillon @fr
id: EUPH:7551

occurrence
type: Class
subclass of: information content entity in biology
subclass of: Restriction
  on property: has quality
  some values from: occurrence ID
subclass of: Restriction
  on property: has quality
  some values from: recorded by ID
subclass of: Restriction
  on property: member of
  some values from: https://w3id.org/euph/7507
IAO_0000117: Michael Rubinigg
IAO_0000118: occurrence
id: EUPH:7469

organism
type: Class
subclass of: https://w3id.org/euph/7836
subclass of: Restriction
  on property: member of
  some values from: https://w3id.org/euph/7507
IAO_0000117: Michael Rubinigg
IAO_0000118: organism
id: EUPH:7468

associated occurrence
type: Class
subclass of: relational quality of information content entities in biology
subclass of: Restriction
  on property: towards
  some values from: occurrence
subclass of: Restriction
  on property: member of
  some values from: https://w3id.org/euph/7639
subclass of: Restriction
  on property: quality of
  some values from: occurrence
IAO_0000117: Michael Rubinigg
IAO_0000118: associated occurrence
id: EUPH:7621

associated reference
type: Class
subclass of: relational quality of information content entities in biology
subclass of: Restriction
  on property: towards
  some values from: reference
subclass of: Restriction
  on property: member of
  some values from: https://w3id.org/euph/7639
subclass of: Restriction
  on property: quality of
  some values from: occurrence
IAO_0000117: Michael Rubinigg
IAO_0000118: associated reference
id: EUPH:7620

associated taxon
type: Class
subclass of: relational quality of information content entities in biology
subclass of: Restriction
  on property: towards
  some values from: occurrence
subclass of: Restriction
  on property: member of
  some values from: https://w3id.org/euph/7639
subclass of: Restriction
  on property: quality of
  some values from: taxon
IAO_0000117: Michael Rubinigg
IAO_0000118: associated taxon
id: EUPH:7619

catalog number
type: Class
subclass of: identifier of biological entities
subclass of: Restriction
  on property: member of
  some values from: https://w3id.org/euph/7639
subclass of: Restriction
  on property: quality of
  some values from: occurrence
IAO_0000117: Michael Rubinigg
IAO_0000118: Katalognummer @de
IAO_0000118: catalog number
id: EUPH:7625

individual count
type: Class
subclass of: unit of measure in biology
subclass of: Restriction
  on property: member of
  some values from: https://w3id.org/euph/7639
IAO_0000117: Michael Rubinigg
IAO_0000118: individual count
id: EUPH:7623

measurement determined date
type: Class
subclass of: zero-dimensional temporal region in information science
subclass of: Restriction
  on property: member of
  some values from: https://w3id.org/euph/7639
IAO_0000117: Michael Rubinigg
IAO_0000118: measurement determined date
id: EUPH:7703

measurement ID
type: Class
subclass of: identifier of information resources
subclass of: Restriction
  on property: member of
  some values from: https://w3id.org/euph/7639
subclass of: Restriction
  on property: quality of
  some values from: data item
IAO_0000117: Michael Rubinigg
IAO_0000118: measurement ID
IAO_0000118: measurement identifier
id: EUPH:7705

occurrence ID
type: Class
subclass of: identifier of information resources
subclass of: Restriction
  on property: member of
  some values from: https://w3id.org/euph/7639
subclass of: Restriction
  on property: quality of
  some values from: occurrence
IAO_0000117: Michael Rubinigg
IAO_0000118: occurrence ID
IAO_0000118: occurrence identifier
id: EUPH:7498

recorded by ID
type: Class
subclass of: https://w3id.org/euph/7577
subclass of: Restriction
  on property: member of
  some values from: https://w3id.org/euph/7639
IAO_0000117: Michael Rubinigg
IAO_0000118: recorded by ID
IAO_0000118: recorded by identifier
id: EUPH:7624

process quality
type: Class
subclass of: https://w3id.org/euph/977
IAO_0000117: Michael Rubinigg
IAO_0000118: process specification
id: EUPH:1787

geopolitical region
type: Class
subclass of: fiat object part in geography
IAO_0000117: Michael Rubinigg
IAO_0000118: geopolitical region
IAO_0000118: geopolitische Region @de
id: EUPH:7948

chemical identifier
type: Class
subclass of: information content entity in chemistry
IAO_0000117: Michael Rubinigg
IAO_0000118: chemical identifier
id: EUPH:2731

annotation on information resource
type: Class
subclass of: https://w3id.org/euph/872
IAO_0000117: Michael Rubinigg
IAO_0000118: annotation on information resources
id: EUPH:7392

single nucleotide polymorphism (SNP)
type: Class
subclass of: submolecular entity
subclass of: Restriction
  on property: part of
  some values from: deoxyribonucleic acid (DNA)
IAO_0000117: Michael Rubinigg
IAO_0000118: Einzelnukleotid-Polymorphismus @de
IAO_0000118: SNP
IAO_0000118: enkel-nucleotide-polymorfie @nl
IAO_0000118: polimorfismo a singolo nucleotide @it
IAO_0000118: polymorphisme nucléotidique @fr
IAO_0000118: single nucleotide polymorphism
id: EUPH:7429

metadata
type: Class
subclass of: data item
IAO_0000117: Michael Rubinigg
IAO_0000118: metadata
id: EUPH:7721

submolecular entity
type: Class
subclass of: fiat object part in biology
IAO_0000117: Michael Rubinigg
IAO_0000118: submolecular entity
id: EUPH:2057

virus
type: Class
subclass of: object in veterinary medicine
IAO_0000117: Michael Rubinigg
IAO_0000118: Virus @de
IAO_0000118: virus @da
id: EUPH:98

obsolete class
type: Class
IAO_0000117: Michael Rubinigg
IAO_0000118: obsolete class
IAO_0000118: veraltete Klasse @de
id: EUPH:3281

EU directive 2001-110
type: Class
subclass of: EU directive
IAO_0000117: Michael Rubinigg
IAO_0000118: A tanács 2001/110/EK Irányelve (2001. december 20.) a mézről @hu
IAO_0000118: Council Directive 2001/110/EC of 20 December 2001 relating to honey
IAO_0000118: Directiva 2001/110/CE a consiliului din 20 decembrie 2001 privind mierea @ro
IAO_0000118: Directiva 2001/110/CE del Consejo, de 20 de diciembre de 2001, relativa a la miel @es
IAO_0000118: Directiva 2001/110/CE do Conselho de 20 de Dezembro de 2001 relativa ao mel @pt
IAO_0000118: Directive 2001/110/CE du Conseil du 20 décembre 2001 relative au miel @fr
IAO_0000118: Direktiva Sveta 2001/110/ES z dne 20. decembra 2001 o medu @sl
IAO_0000118: Direktiva vijeća 2001/110/EZ od 20. prosinca 2001. o medu @hr
IAO_0000118: Direttiva 2001/110/CE del Consiglio del 20 dicembre 2001 concernente il miele @it
IAO_0000118: Dyrektywa Rady 2001/110/WE z dnia 20 grudnia 2001 r. odnosząca się do miodu @pl
IAO_0000118: Id-Direttiva tal-Kunsill 2001/110/KE ta' l-20 ta' Diċembru 2001 li tirrigwarda l-għasel @mt
IAO_0000118: Neuvoston direktiivi 2001/110/EY, annettu 20 päivänä joulukuuta 2001, hunajasta @fi
IAO_0000118: Nõukogu direktiiv 2001/110/EÜ, 20. detsember 2001, mee kohta @et
IAO_0000118: Padomes Direktīva 2001/110/EK (2001. gada 20. decembris), kas attiecas uz medu @lv
IAO_0000118: Richtlijn 2001/110/EG van de Raad van 20 december 2001 inzake honing @nl
IAO_0000118: Richtlinie 2001/110/EG des Rates vom 20. Dezember 2001 über Honig @de
IAO_0000118: Rådets direktiv 2001/110/EF af 20. december 2001 om honning @da
IAO_0000118: Rådets direktiv 2001/110/EG av den 20 december 2001 om honung @sv
IAO_0000118: Smernica Rady 2001/110/ES z 20. decembra 2001 o mede @sk
IAO_0000118: Směrnice Rady 2001/110/ES ze dne 20. prosince 2001 o medu @cs
IAO_0000118: Tarybos direktyva 2001/110/EB 2001 m. gruodžio 20 d. dėl medaus @lt
IAO_0000118: Οδηγία 2001/110/ΕΚ του Συμβουλίου της 20ής Δεκεμβρίου 2001 για το μέλι @el
IAO_0000118: Директива 2001/110/ЕО на Съвета от 20 декември 2001 година относно меда @bg
id: EUPH:3884

EU regulation 2017-269
type: Class
subclass of: EU regulation
subclass of: Restriction
  on property: functionally related to
  some values from: https://w3id.org/euph/7824
subclass of: Restriction
  on property: has member
  some values from: plant protection product
IAO_0000117: Michael Rubinigg
IAO_0000118: Regolamento (UE) 2017/269 @it
IAO_0000118: Regulation (EU) 2017/269
IAO_0000118: Règlement (UE) 2017/269 @fr
IAO_0000118: Verordening (EU) 2017/269 @nl
IAO_0000118: Verordnung (EU) 2017/269 @de
id: EUPH:7885

EU regulation 2018-1091
type: Class
subclass of: EU regulation
subclass of: Restriction
  on property: functionally related to
  some values from: https://w3id.org/euph/7824
IAO_0000117: Michael Rubinigg
IAO_0000118: Regulation (EU) 2018/1091
id: EUPH:7883

sampling event
type: Class
subclass of: process in information science
subclass of: Restriction
  on property: has quality
  some values from: https://w3id.org/euph/7553
subclass of: Restriction
  on property: has quality
  some values from: https://w3id.org/euph/7638
subclass of: Restriction
  on property: member of
  some values from: https://w3id.org/euph/7507
IAO_0000117: Michael Rubinigg
IAO_0000118: Probennahme @de
IAO_0000118: campionamento @it
IAO_0000118: event
IAO_0000118: monstername @nl
IAO_0000118: sampling event
IAO_0000118: échantillonnage @fr
id: EUPH:7474

taxon
type: Class
subclass of: object aggregate in biology
subclass of: Restriction
  on property: member of
  some values from: https://w3id.org/euph/7507
IAO_0000117: Michael Rubinigg
IAO_0000118: Taxon @de
IAO_0000118: taxon
IAO_0000118: unità tassonomica @it
id: EUPH:7451

glucose oxidase
type: Class
subclass of: enzyme
subclass of: Restriction
  on property: produced by
  some values from: hypopharyngeal gland
IAO_0000117: Michael Rubinigg
IAO_0000118: Glucoseoxidase @de
IAO_0000118: glucose oxidase
id: EUPH:6245

acetylcholinesterase
type: Class
subclass of: enzyme
IAO_0000117: Michael Rubinigg
IAO_0000118: Acetylcholinesterase @de
IAO_0000118: acetylcholinesterase
id: EUPH:8189

protein-serine/threonine phosphatase
type: Class
subclass of: enzyme
IAO_0000117: Michael Rubinigg
IAO_0000118: Cyfluthrin-beta
id: EUPH:6244

alpha-amylase
type: Class
subclass of: amylase
subclass of: Restriction
  on property: produced by
  some values from: hypopharyngeal gland
IAO_0000117: Michael Rubinigg
IAO_0000118: alpha-Amylase @de
IAO_0000118: alpha-amylase
id: EUPH:6235

alpha-glucosidase
type: Class
subclass of: enzyme
subclass of: Restriction
  on property: produced by
  some values from: hypopharyngeal gland
IAO_0000117: Michael Rubinigg
IAO_0000118: Invertase @de
IAO_0000118: alpha-Glucosidase @de
IAO_0000118: alpha-glucosidase
IAO_0000118: invertase
IAO_0000118: maltase
id: EUPH:4105

honey chamber
type: Class
subclass of: https://w3id.org/euph/8163
subclass of: Restriction
  on property: involved in
  some values from: putting on
subclass of: Restriction
  on property: part of
  some values from: https://w3id.org/euph/8
IAO_0000115: A honey chamber is the part of a movable frame beehive in which honey bees generally store honey.
IAO_0000117: Michael Rubinigg
IAO_0000118: Honigraum @de
IAO_0000118: almacén @es
IAO_0000118: alza @es
IAO_0000118: alça @pt
IAO_0000118: cat @ro
IAO_0000118: corp de racoltă @ro
IAO_0000118: hausse @fr
IAO_0000118: honey chamber
IAO_0000118: honingbak @nl
IAO_0000118: honingkamer @nl
IAO_0000118: honingzolder @nl
IAO_0000118: magasin @da
IAO_0000118: magasin à miel @fr
IAO_0000118: magazin @ro
IAO_0000118: melario @it
IAO_0000118: melgueira @pt
IAO_0000118: opzetbak @nl
IAO_0000118: skattekasse @no
IAO_0000118: skattlåda @sv
IAO_0000118: super
id: EUPH:10

Chronic Bee Paralysis Virus (CBPV)
type: Class
subclass of: single-stranded RNA virus
IAO_0000115: The Chronic Bee Paralysis Virus (CBPV) is a pathogen of the Western Honey Bee (Apis mellifera).
IAO_0000117: Michael Rubinigg
IAO_0000118: CBPV
IAO_0000118: Chronic Bee Paralysis Virus
IAO_0000118: Chronisches Bienenparalysevirus @de
IAO_0000118: virus della paralisi cronica @it
id: EUPH:100

Axiom
annotated source: Chronic Bee Paralysis Virus (CBPV)
annotated property: IAO_0000115
annotated target: The Chronic Bee Paralysis Virus (CBPV) is a pathogen of the Western Honey Bee (Apis mellifera).
has db xref: ISBN:978-88-470-5649-7

temporal region in information science
type: Class
subclass of: occurrent in information science
IAO_0000115: A temporal region in information science is an occurrent in the information science domain that is a projection of the universal spatiotemporal region.
IAO_0000117: Michael Rubinigg
IAO_0000118: temporal region in information science
id: EUPH:1000

Axiom
annotated source: temporal region in information science
annotated property: IAO_0000115
annotated target: A temporal region in information science is an occurrent in the information science domain that is a projection of the universal spatiotemporal region.
source: http://purl.obolibrary.org/obo/BFO_0000008

identifier of information resources
type: Class
subclass of: https://w3id.org/euph/977
IAO_0000115: An identifier of information resources is an identifier that is specific for an information resource.
IAO_0000117: Michael Rubinigg
IAO_0000118: identifier of information resources
id: EUPH:1001

literal calendar month
type: Class
subclass of: time scale unit
IAO_0000115: A literal calendar month is the actual, full name of one of the twelve months in the Gregorian calendar.
IAO_0000117: Michael Rubinigg
IAO_0000118: literal month
id: EUPH:1003

multiple of number of unspecified items
type: Class
subclass of: https://w3id.org/euph/967
IAO_0000115: A multiple of a number of unspecified items is a quantity that is an integer number of times larger or smaller than its base unit.
IAO_0000117: Michael Rubinigg
IAO_0000118: multiple of number of unspecified items
id: EUPH:1005

multiple of unit
type: Class
subclass of: https://w3id.org/euph/977
subclass of: Restriction
  on property: quality of
  some values from: measurement unit
IAO_0000115: A multiple of a unit is a quantity that is an integer number of times larger or smaller than its base unit.
IAO_0000117: Michael Rubinigg
IAO_0000118: multiple of unit
id: EUPH:1006

multiple of currency
type: Class
subclass of: https://w3id.org/euph/967
IAO_0000115: A multiple of a currency is a quantity that is an integer number of times larger or smaller than its base currency.
IAO_0000117: Michael Rubinigg
IAO_0000118: multiple of currency
id: EUPH:1007

Kashmir Bee Virus (KBV)
type: Class
subclass of: single-stranded RNA virus
IAO_0000115: The Kashmir Bee Virus (KBV) is a pathogen of the Western Honey Bee (Apis mellifera).
IAO_0000117: Michael Rubinigg
IAO_0000118: KBV
IAO_0000118: Kaschmir-Bienen-Virus @de
IAO_0000118: Kashmir Bee Virus
IAO_0000118: Kashmir Bee virus @it
id: EUPH:101

Axiom
annotated source: Kashmir Bee Virus (KBV)
annotated property: IAO_0000115
annotated target: The Kashmir Bee Virus (KBV) is a pathogen of the Western Honey Bee (Apis mellifera).
has db xref: ISBN:978-88-470-5649-7

material entity in meteorology
type: Class
subclass of: independent continuant in meteorology
IAO_0000115: A material entity in meteorology is an independent continuant in the meteorology domain that always has some portion of matter as a continuant part.
IAO_0000117: Michael Rubinigg
IAO_0000118: material entity in meteorology
id: EUPH:1010

Axiom
annotated source: material entity in meteorology
annotated property: IAO_0000115
annotated target: A material entity in meteorology is an independent continuant in the meteorology domain that always has some portion of matter as a continuant part.
source: http://purl.obolibrary.org/obo/BFO_0000040

multiple of International Dollar
type: Class
subclass of: multiple of currency
IAO_0000115: A multiple of Euro is a multiple of the currency Euro.
IAO_0000117: Michael Rubinigg
IAO_0000118: multiple of International Dollar
id: EUPH:1015

multiple of Euro
type: Class
subclass of: multiple of currency
IAO_0000115: A multiple of Euro is a multiple of the currency Euro.
IAO_0000117: Michael Rubinigg
IAO_0000118: multiple of Euro
id: EUPH:1016

Israeli Acute Paralysis Virus (IAPV)
type: Class
subclass of: single-stranded RNA virus
IAO_0000115: Israeli Acute Paralysis Virus (IAPV) is a pathogen of the Western Honey Bee (Apis mellifera).
IAO_0000117: Michael Rubinigg
IAO_0000118: IAPV
IAO_0000118: Israeli Acute Paralysis Virus
IAO_0000118: Israelisches Akute-Paralyse-Virus @de
IAO_0000118: virus israeliano della paralisi acuta @it
id: EUPH:102

Axiom
annotated source: Israeli Acute Paralysis Virus (IAPV)
annotated property: IAO_0000115
annotated target: Israeli Acute Paralysis Virus (IAPV) is a pathogen of the Western Honey Bee (Apis mellifera).
has db xref: ISBN:978-88-470-5649-7

FAOSTAT domain label
type: Class
subclass of: FAOSTAT domain
IAO_0000115: Domain for which FAOSTAT provides data, summarised in the "Element", "Item" or "Item Group" list on the web page "Definitions and standards used in FAOSTAT" of the FAOSTAT website.
IAO_0000117: Michael Rubinigg
IAO_0000118: FAOSTAT Bereich @de
IAO_0000118: FAOSTAT Domain
id: EUPH:1020

Axiom
annotated source: FAOSTAT domain label
annotated property: IAO_0000115
annotated target: Domain for which FAOSTAT provides data, summarised in the "Element", "Item" or "Item Group" list on the web page "Definitions and standards used in FAOSTAT" of the FAOSTAT website.
source: https://www.fao.org/faostat/en/#definitions

breeder queen
type: Class
subclass of: intrinsic role in beekeeping
IAO_0000115: A breeder queen is a genetically superior queen from a colony that has been selected in a breeding program to produce offspring with desirable traits.
IAO_0000117: Michael Rubinigg
IAO_0000118: Zuchtkönigin @de
IAO_0000118: avelsdrottning @sv
IAO_0000118: avlsdronning @da
IAO_0000118: breeder queen
IAO_0000118: breeding queen
IAO_0000118: matcă de reproducere @ro
IAO_0000118: matcă-mamă @ro
IAO_0000118: rainha seleccionada @pt
IAO_0000118: regina da riproduzione @it
IAO_0000118: regina riproduttrice @it
IAO_0000118: reina de cría @es
IAO_0000118: reine d'élevage @fr
IAO_0000118: reine éleveuse @fr
IAO_0000118: teeltkoningin @nl
id: EUPH:1021

forage scout bee
type: Class
subclass of: behavioural role
subclass of: Restriction
  on property: role of
  some values from: adult worker bee
subclass of: Restriction
  on property: involved in
  some values from: collecting
IAO_0000115: A forage scout bee is a worker bee that searches for pollen, nectar, water and propolis.
IAO_0000117: Michael Rubinigg
IAO_0000118: Suchbiene @de
IAO_0000118: abelha exploradora @pt
IAO_0000118: abelha forrageira @pt
IAO_0000118: albină cercetașă @ro
IAO_0000118: albină cercetașă la cules @ro
IAO_0000118: cercetașă @ro
IAO_0000118: esploratrice @it
IAO_0000118: exploradora @es
IAO_0000118: forage scout bee
IAO_0000118: scout bee
IAO_0000118: searcher bee
IAO_0000118: speiderbi @no
IAO_0000118: spejarbi @sv
IAO_0000118: spejderbi @da
IAO_0000118: zoekbij @nl
IAO_0000118: éclaireuse @fr
id: EUPH:1022

Axiom
annotated source: forage scout bee
annotated property: IAO_0000115
annotated target: A forage scout bee is a worker bee that searches for pollen, nectar, water and propolis.
has db xref: ISBN:1-878075-65-4

FAOSTAT item
type: Class
subclass of: FAOSTAT
IAO_0000115: A FAOSTAT item is a specific commodity or product tracked within the FAOSTAT database.
IAO_0000117: Michael Rubinigg
IAO_0000118: FAOSTAT item
IAO_0000118: Item
id: EUPH:1024

Axiom
annotated source: FAOSTAT item
annotated property: IAO_0000115
annotated target: A FAOSTAT item is a specific commodity or product tracked within the FAOSTAT database.
source: https://www.fao.org/faostat/en/#definitions

HS07 code
type: Class
subclass of: identifier of economical entities
subclass of: Restriction
  on property: quality of
  some values from: HS nomenclature 2007
IAO_0000115: A HS07 code is a code assigned to traded products in the HS nomenclature 2007.
IAO_0000117: Michael Rubinigg
IAO_0000118: HS07 code
id: EUPH:1025

Axiom
annotated source: HS07 code
annotated property: IAO_0000115
annotated target: A HS07 code is a code assigned to traded products in the HS nomenclature 2007.
source: https://www.wcoomd.org/en/topics/nomenclature/instrument-and-tools/hs_nomenclature_previous_editions/hs_nomenclature_table_2007.aspx

starvation
type: Class
subclass of: process in biology
IAO_0000115: Starvation is a biological process that occurs when an organism is deprived of sufficient energy and nutrients over time, leading to metabolic adaptations, progressive impairment of physiological functions and eventually to death.
IAO_0000117: Michael Rubinigg
IAO_0000118: a mori de inaniție @ro
IAO_0000118: a muri de foame @ro
IAO_0000118: at sulte @da
IAO_0000118: att svälta @sv
IAO_0000118: morir de hambre @es
IAO_0000118: morire di fame @it
IAO_0000118: morrer de fome @pt
IAO_0000118: mourir de faim @fr
IAO_0000118: starvation
IAO_0000118: to starve
IAO_0000118: verhongeren @nl
IAO_0000118: verhungern @de
IAO_0000118: å sulte @no
id: EUPH:1026

starter strip
type: Class
subclass of: frame component
IAO_0000115: A starter strip is a frame component that consists of a short strip of wax foundation attached to the top bar of a frame or to a bar frame to encourage honey bees to continue building a honeycomb along this starter strip.
IAO_0000117: Michael Rubinigg
IAO_0000118: Anfangsstreifen @de
IAO_0000118: Lehrwachs @de
IAO_0000118: Leitwachs @de
IAO_0000118: amorce de cire @fr
IAO_0000118: amorsă @ro
IAO_0000118: byggeanvisning @no
IAO_0000118: cebo de cera @es
IAO_0000118: faixa de cera @pt
IAO_0000118: fîșie de fagure @ro
IAO_0000118: isco de cera @pt
IAO_0000118: kakremsa @sv
IAO_0000118: ledarvax @sv
IAO_0000118: leder @da
IAO_0000118: starter @ro
IAO_0000118: starter strip
IAO_0000118: striscia di avviamento @it
IAO_0000118: traccia di avviamento @it
IAO_0000118: vaxledare @sv
IAO_0000118: voorbouw @nl
IAO_0000118: voorbouwreep @nl
id: EUPH:1027

Black Queen Cell Virus (BQCV)
type: Class
subclass of: single-stranded RNA virus
IAO_0000115: The Black Queen Cell Virus (BQCV) is a pathogen of the Western Honey Bee (Apis mellifera).
IAO_0000117: Michael Rubinigg
IAO_0000118: BQCV @de
IAO_0000118: Black Queen Cell Virus
IAO_0000118: Schwarzes Königinnenzellvirus @de
IAO_0000118: virus della cella reale nera @it
id: EUPH:103

Axiom
annotated source: Black Queen Cell Virus (BQCV)
annotated property: IAO_0000115
annotated target: The Black Queen Cell Virus (BQCV) is a pathogen of the Western Honey Bee (Apis mellifera).
has db xref: ISBN:978-88-470-5649-7

hive product part
type: Class
subclass of: fiat object part in beekeeping
IAO_0000115: A hive product part is a fiat object part of a hive product.
IAO_0000117: Michael Rubinigg
IAO_0000118: hive product part
id: EUPH:1035

fiat object part in geology
type: Class
subclass of: material entity in geology
IAO_0000115: A fiat object part in geology is a material entity in the geology domain that is not a collection of disjoint self-standing single objects, but a proper part of an object.
IAO_0000117: Michael Rubinigg
IAO_0000118: fiat object part in geology
id: EUPH:1037

Axiom
annotated source: fiat object part in geology
annotated property: IAO_0000115
annotated target: A fiat object part in geology is a material entity in the geology domain that is not a collection of disjoint self-standing single objects, but a proper part of an object.
source: http://purl.obolibrary.org/obo/BFO_0000024

unit of measure in biology
type: Class
subclass of: information content entity in biology
IAO_0000115: A unit of measure or classification in biology is a label that is part of a measurement datum, which is specific to the biology domain.
IAO_0000117: Michael Rubinigg
IAO_0000118: unit of measure in biology
id: EUPH:1039

Deformed Wing Virus (DWV)
type: Class
subclass of: single-stranded RNA virus
IAO_0000115: Deformed wing virus (DWV) is an RNA virus, one of 22 known viruses affecting honey bees. While most commonly infecting the honey bee, Apis mellifera, it has also been documented in other bee species, like Bombus terrestris,[...] thus, indicating it may have a wider host specificity than previously anticipated. The virus was first isolated from a sample of symptomatic honeybees from Japan in the early 1980s and is currently distributed worldwide. It is found also in pollen baskets and commercially reared bumblebees.[...] Its main vector in A. mellifera is the Varroa mite.[...] It is named after what is usually the most obvious deformity it induces in the development of a honeybee pupa, which is shrunken and deformed wings, but other developmental deformities are often present.
IAO_0000117: Michael Rubinigg
IAO_0000118: DWV
IAO_0000118: Deformed Wing Virus
IAO_0000118: Deforméierte Flilleck Virus @lb
IAO_0000118: Flügeldeformationsvirus @de
IAO_0000118: Virusul aripilor deformate @ro
IAO_0000118: virus delle ali deformi @it
IAO_0000118: Вирус на деформираните крила @bg
id: EUPH:104

Axiom
annotated source: Deformed Wing Virus (DWV)
annotated property: IAO_0000115
annotated target: Deformed wing virus (DWV) is an RNA virus, one of 22 known viruses affecting honey bees. While most commonly infecting the honey bee, Apis mellifera, it has also been documented in other bee species, like Bombus terrestris,[...] thus, indicating it may have a wider host specificity than previously anticipated. The virus was first isolated from a sample of symptomatic honeybees from Japan in the early 1980s and is currently distributed worldwide. It is found also in pollen baskets and commercially reared bumblebees.[...] Its main vector in A. mellifera is the Varroa mite.[...] It is named after what is usually the most obvious deformity it induces in the development of a honeybee pupa, which is shrunken and deformed wings, but other developmental deformities are often present.
source: https://en.wikipedia.org/wiki/Deformed_wing_virus

data about organisms
type: Class
subclass of: data item in biology
IAO_0000115: Data about organisms is a truthful statement about an organism (e.g. an occurrence) and is constructed/acquired by a method which reliably tends to produce (approximately) truthful statements.
IAO_0000117: Michael Rubinigg
IAO_0000118: data about organisms
id: EUPH:1040

realisable entity in pharmacology
type: Class
subclass of: specifically dependent continuant in pharmacology
IAO_0000115: A realisable entity in pharmacology is a specifically dependent continuant im the pharmacology domain that requires some further process to be realised.
IAO_0000117: Michael Rubinigg
IAO_0000118: realisable entity in pharmacology
id: EUPH:1041

Axiom
annotated source: realisable entity in pharmacology
annotated property: IAO_0000115
annotated target: A realisable entity in pharmacology is a specifically dependent continuant im the pharmacology domain that requires some further process to be realised.
source: http://purl.obolibrary.org/obo/BFO_0000017

plan specification in geography
type: Class
subclass of: directive information entity in geography
IAO_0000115: A plan specification in geography is a directive information entity in the geography domain with action specifications and objective specifications as parts, and that may be concretised as a realisable entity that, if realised, is realized in a process in which the bearer tries to achieve the objectives by taking the actions specified.
IAO_0000117: Michael Rubinigg
IAO_0000118: plan specification in geography
id: EUPH:1042

Axiom
annotated source: plan specification in geography
annotated property: IAO_0000115
annotated target: A plan specification in geography is a directive information entity in the geography domain with action specifications and objective specifications as parts, and that may be concretised as a realisable entity that, if realised, is realized in a process in which the bearer tries to achieve the objectives by taking the actions specified.
source: plan specification

annotation on geographical entities
type: Class
subclass of: information content entity in geography
IAO_0000115: An annotation on geographical entities is a written explanatory or critical description, or other in-context information that has been associated with data or other types of information in the geography domain.
IAO_0000117: Michael Rubinigg
IAO_0000118: annotation on geographical entities
id: EUPH:1043

Axiom
annotated source: annotation on geographical entities
annotated property: IAO_0000115
annotated target: An annotation on geographical entities is a written explanatory or critical description, or other in-context information that has been associated with data or other types of information in the geography domain.
has db xref: 10.1186/2041-1480-5-14

information content entity in economics
type: Class
subclass of: generically dependent continuant in economics
IAO_0000115: An information content entity in economics is a generically dependent continuant im the economics domain that is about some thing.
IAO_0000117: Michael Rubinigg
IAO_0000118: information content entity in economics
id: EUPH:1044

Axiom
annotated source: information content entity in economics
annotated property: IAO_0000115
annotated target: An information content entity in economics is a generically dependent continuant im the economics domain that is about some thing.
source: http://purl.obolibrary.org/obo/IAO_0000030

identifier of economical entities
type: Class
subclass of: quality in economics
IAO_0000115: An identifier of economical entities is an identifier that is specific for the economics domain.
IAO_0000117: Michael Rubinigg
IAO_0000118: identifier of economical entities
id: EUPH:1045

economical quantity
type: Class
subclass of: quality in economics
IAO_0000115: A quantity of an economical entity that exists through action of continuants at the economic level in relation to other entities.
IAO_0000117: Michael Rubinigg
IAO_0000118: economical quantity
id: EUPH:1046

directive information entity in beekeeping
type: Class
subclass of: information content entity in beekeeping
IAO_0000115: A directive information entity in beekeeping is an an information content entity in the beekeeping domain whose concretizations indicate to their bearer how to realize them in a process.
IAO_0000117: Michael Rubinigg
IAO_0000118: directive information entity in beekeeping
id: EUPH:1047

Axiom
annotated source: directive information entity in beekeeping
annotated property: IAO_0000115
annotated target: A directive information entity in beekeeping is an an information content entity in the beekeeping domain whose concretizations indicate to their bearer how to realize them in a process.
source: directive information entity

Sackbrood Virus (SBV)
type: Class
subclass of: single-stranded RNA virus
IAO_0000115: The Sackbrood Virus (SBV) is a pathogen of the Western Honey Bee (Apis mellifera).
IAO_0000117: Michael Rubinigg
IAO_0000118: SBV
IAO_0000118: Sackbrutvirus @de
IAO_0000118: sackbrood virus
IAO_0000118: virus della covata a sacco @it
id: EUPH:105

Axiom
annotated source: Sackbrood Virus (SBV)
annotated property: IAO_0000115
annotated target: The Sackbrood Virus (SBV) is a pathogen of the Western Honey Bee (Apis mellifera).
has db xref: ISBN:978-88-470-5649-7

immature insect
type: Class
subclass of: multicellular organism
IAO_0000115: An immature insect is an insect that is in a stage of its life cycle before it has developed into an imago.
IAO_0000117: Michael Rubinigg
IAO_0000118: immature insect
id: EUPH:1056

immature honey bee
type: Class
subclass of: member of honey bee colony
IAO_0000115: An immature honey bee is a member of a honey bee colony that is an immature insect.
IAO_0000117: Michael Rubinigg
IAO_0000118: immature honey bee
id: EUPH:1057

immature queen bee
type: Class
subclass of: immature honey bee
IAO_0000115: An immature queen bee is an immature honey bee that is going to develop into an adult queen bee.
IAO_0000117: Michael Rubinigg
IAO_0000118: immature queen
id: EUPH:1058

stratigraphic horizon
type: Class
subclass of: fiat object part in geology
IAO_0000115: [...] either a bedding surface where there is marked change in the lithology within a sequence of sedimentary or volcanic rocks, or a distinctive layer or thin bed with a characteristic lithology or fossil content within a sequence.
IAO_0000117: Michael Rubinigg
IAO_0000118: stratigraphic horizon
id: EUPH:1060

Axiom
annotated source: stratigraphic horizon
annotated property: IAO_0000115
annotated target: [...] either a bedding surface where there is marked change in the lithology within a sequence of sedimentary or volcanic rocks, or a distinctive layer or thin bed with a characteristic lithology or fossil content within a sequence.
source: https://en.wikipedia.org/w/index.php

disease caused or transmitted by arthropods
type: Class
subclass of: disease
IAO_0000115: A disease caused or transmitted by arthropods ia a disease caused or transmitted by an organism belonging to the taxonomic phylum Arthropoda.
IAO_0000117: Michael Rubinigg
IAO_0000118: disease caused or transmitted by arthropods
id: EUPH:107

FAOSTAT element label
type: Class
subclass of: FAOSTAT element
IAO_0000115: Element for which FAOSTAT provides data, summarised in the "Element", "Item" or "Item Group" list on the web page "Definitions and standards used in FAOSTAT" of the FAOSTAT website.
IAO_0000117: Michael Rubinigg
IAO_0000118: FAOSTAT Element @de
id: EUPH:1086

Axiom
annotated source: FAOSTAT element label
annotated property: IAO_0000115
annotated target: Element for which FAOSTAT provides data, summarised in the "Element", "Item" or "Item Group" list on the web page "Definitions and standards used in FAOSTAT" of the FAOSTAT website.
source: https://www.fao.org/faostat/en/#definitions

entity in plant production
type: Class
subclass of: agriculture
IAO_0000115: An entity in plant production is an entity in agriculture and is defined as the science of breeding and cultivating plants.
IAO_0000117: Michael Rubinigg
IAO_0000118: Pflanzenproduktion @de
IAO_0000118: plant production
IAO_0000118: plantenproductie @nl
IAO_0000118: production végétale @fr
IAO_0000118: produzione vegetale @it
id: EUPH:1087

Axiom
annotated source: entity in plant production
annotated property: IAO_0000115
annotated target: An entity in plant production is an entity in agriculture and is defined as the science of breeding and cultivating plants.
source: http://purl.obolibrary.org/obo/BFO_0000001

FAOSTAT item label
type: Class
subclass of: FAOSTAT item
IAO_0000115: Item for which FAOSTAT provides data, summarised in the "Item" list on the web page "Definitions and standards used in FAOSTAT" of the FAOSTAT website.
IAO_0000117: Michael Rubinigg
IAO_0000118: FAOSTAT Gegenstand @de
IAO_0000118: FAOSTAT item
id: EUPH:1088

Axiom
annotated source: FAOSTAT item label
annotated property: IAO_0000115
annotated target: Item for which FAOSTAT provides data, summarised in the "Item" list on the web page "Definitions and standards used in FAOSTAT" of the FAOSTAT website.
source: https://www.fao.org/faostat/en/#definitions

symptom on brood
type: Class
subclass of: symptom
subclass of: Restriction
  on property: quality of
  some values from: brood
IAO_0000115: Symptoms occurring on brood of honey bees (Apis mellifera).
IAO_0000117: Michael Rubinigg
IAO_0000118: Syptom auf Brut @de
IAO_0000118: symptom on brood
id: EUPH:1090

symptom on adult bees
type: Class
subclass of: symptom
subclass of: Restriction
  on property: quality of
  some values from: adult honey bee
IAO_0000115: Symptoms pbserved on adult honey bees (Apis mellifera).
IAO_0000117: Michael Rubinigg
IAO_0000118: Syptom am erwachsenen Tier @de
IAO_0000118: symptom on adult bees
id: EUPH:1091

symptom on colonies
type: Class
subclass of: symptom
subclass of: Restriction
  on property: quality of
  some values from: honey bee colony
IAO_0000115: Symptoms observed in colonies of honey bees (Apis mellifera).
IAO_0000117: Michael Rubinigg
IAO_0000118: Symptom am Volk @de
IAO_0000118: symptom on colonies
id: EUPH:1092

punctured and sunken cappings
type: Class
subclass of: symptom on brood
IAO_0000115: Punctured and sunken wax cappings of brood cells on combs of the honey bee (Apis mellifera).
IAO_0000117: Michael Rubinigg
IAO_0000118: löchrige und eingefallene Zelldeckel @de
IAO_0000118: punctured and sunken cappings
id: EUPH:1093

abnormal trembling motion
type: Class
subclass of: symptom on adult bees
IAO_0000115: Abnormal trembling motion of adult honey bees (Apis mellifera).
IAO_0000117: Michael Rubinigg
IAO_0000118: abnormal trembling motion
IAO_0000118: abnormale zitternde Bewegung @de
id: EUPH:1094

bloated abdomen
type: Class
subclass of: symptom on adult bees
IAO_0000115: Bloated (swollen) abdomen of adult honey bees (Apis mellifera).
IAO_0000117: Michael Rubinigg
IAO_0000118: aufgeblähtes Abdomen @de
IAO_0000118: bloated abdomen
id: EUPH:1095

deformed wings
type: Class
subclass of: symptom on adult bees
IAO_0000115: Deformed wings (wings missing or not expanded or partially exanded and crumples) of adult honey bees (Apis mellifera).
IAO_0000117: Michael Rubinigg
IAO_0000118: deformed wings
IAO_0000118: verkrüppelte Flügel @de
id: EUPH:1096

collapsed colony
type: Class
subclass of: symptom on colonies
IAO_0000115: A colony of honey bees (Apis sp.), in which a large number of workers have died, so that the colony has ceased to exist.
IAO_0000117: Michael Rubinigg
IAO_0000118: collapsed colony
IAO_0000118: zusammengebrochenes Volk @de
id: EUPH:1097

ropiness of larval remains
type: Class
subclass of: symptom on brood
IAO_0000115: The length and consistency of the fine thread adhering to a small, dry stick, when it is inserted into a cell of a diseased larva of the honey bee (Apis mellifera), rotated and removed slowly, straight up.
IAO_0000117: Michael Rubinigg
IAO_0000118: fadenziehende Masse @de
IAO_0000118: ropiness of larval remains
id: EUPH:1098

Axiom
annotated source: ropiness of larval remains
annotated property: IAO_0000115
annotated target: The length and consistency of the fine thread adhering to a small, dry stick, when it is inserted into a cell of a diseased larva of the honey bee (Apis mellifera), rotated and removed slowly, straight up.
has db xref: ISBN:0-936028-10-6

mummified larvae
type: Class
subclass of: symptom on brood
IAO_0000115: Larvae of the honey bee (Apis mellifera), dried to a chalklike lump, which may be white or gray to black, typical for chalkbrood disease.
IAO_0000117: Michael Rubinigg
IAO_0000118: Kalkbrutmumie @de
IAO_0000118: mumifizierte Larve @de
IAO_0000118: mummified larvae
id: EUPH:1099

Axiom
annotated source: mummified larvae
annotated property: IAO_0000115
annotated target: Larvae of the honey bee (Apis mellifera), dried to a chalklike lump, which may be white or gray to black, typical for chalkbrood disease.
has db xref: ISBN:0-936028-10-6

queen excluder
type: Class
subclass of: https://w3id.org/euph/8163
subclass of: Restriction
  on property: part of
  some values from: https://w3id.org/euph/8
IAO_0000115: A queen excluder is a grid of metal wire, or a perforated sheet of plastic or of any other material, that is placed between the box containing the brood nest and the box containing the honey super. It prevents the queen from entering the honey super.
IAO_0000117: Michael Rubinigg
IAO_0000118: Absperrgitter @de
IAO_0000118: dronninggitter @da
IAO_0000118: drottninggaller @sv
IAO_0000118: escludi-regina @it
IAO_0000118: excluidor de reinas @es
IAO_0000118: excluidor de reinhas @pt
IAO_0000118: gratie de matcă @ro
IAO_0000118: gratie separatoare @ro
IAO_0000118: grille @fr
IAO_0000118: grille à reine @fr
IAO_0000118: koniginnerooster @nl
IAO_0000118: queen excluder
IAO_0000118: tela excluidora de rainhas @pt
id: EUPH:11

protozoan disease
type: Class
subclass of: disease
subclass of: Restriction
  on property: disease has infectious agent
  some values from: https://w3id.org/euph/86
IAO_0000115: A protozoan disease is a disease caused or transmitted by an organism belonging to the taxonomic kingdom Protozoa.
IAO_0000117: Michael Rubinigg
IAO_0000118: durch Protozoen verursachte Krankheit @de
IAO_0000118: protozoan disease
id: EUPH:110

dried scale
type: Class
subclass of: symptom on brood
IAO_0000115: Dead larvae of the honey bee (Apis mellifera), that dry out and adhere tightly to the cell wall of the comb.
IAO_0000117: Michael Rubinigg
IAO_0000118: Faulbrutschorf @de
IAO_0000118: Schorf @de
IAO_0000118: broedpestschilfer @nl
IAO_0000118: dried scale
IAO_0000118: escama @es
IAO_0000118: fjäll @sv
IAO_0000118: scaglia @it
IAO_0000118: scale
IAO_0000118: skorpa @sv
IAO_0000118: skorpe @da
IAO_0000118: solz @ro
IAO_0000118: écaille @fr
id: EUPH:1100

Axiom
annotated source: dried scale
annotated property: IAO_0000115
annotated target: Dead larvae of the honey bee (Apis mellifera), that dry out and adhere tightly to the cell wall of the comb.
has db xref: ISBN:0-936028-10-6

brittle scale
type: Class
subclass of: dried scale
IAO_0000115: Remains of dead larvae of the honey bee (Apis mellifera), referred to as dried scales, of brittle consistency, typical for American foulbrood disease.
IAO_0000117: Michael Rubinigg
IAO_0000118: brittle scale
IAO_0000118: trockener Schorf @de
id: EUPH:1101

rubbery scale
type: Class
subclass of: dried scale
IAO_0000115: Remains of dead larvae of the honey bee (Apis mellifera), referred to as dried scales, of rubbery consistency, typical for European foulbrood disease.
IAO_0000117: Michael Rubinigg
IAO_0000118: rubbery scale
id: EUPH:1102

white coloured mummified larvae
type: Class
subclass of: mummified larvae
IAO_0000115: Larvae of the honey bee (Apis mellifera), dried to a white coloured, chalklike lump, typical for chalkbrood disease when no fruiting bodies were formed.
IAO_0000117: Michael Rubinigg
IAO_0000118: weiße Kalkbrutlarve @de
IAO_0000118: weiße mumifizierte Larve @de
IAO_0000118: white coloured mummified larvae
id: EUPH:1103

Axiom
annotated source: white coloured mummified larvae
annotated property: IAO_0000115
annotated target: Larvae of the honey bee (Apis mellifera), dried to a white coloured, chalklike lump, typical for chalkbrood disease when no fruiting bodies were formed.
has db xref: ISBN:0-936028-10-6

grey to black coloured mummified larvae
type: Class
subclass of: mummified larvae
IAO_0000115: Larvae of the honey bee (Apis mellifera), dried to a grey to black coloured, chalklike lump, typical for chalkbrood disease when fruiting bodies were formed.
IAO_0000117: Michael Rubinigg
IAO_0000118: grey to black coloured mummified larvae
id: EUPH:1104

Axiom
annotated source: grey to black coloured mummified larvae
annotated property: IAO_0000115
annotated target: Larvae of the honey bee (Apis mellifera), dried to a grey to black coloured, chalklike lump, typical for chalkbrood disease when fruiting bodies were formed.
has db xref: ISBN:0-936028-10-6

predator
type: Class
subclass of: role of organisms in veterinary medicine
subclass of: Restriction
  on property: role of
  some values from: organism
IAO_0000115: An organism that preys on other organisms.
IAO_0000117: Michael Rubinigg
IAO_0000118: Prädator @de
IAO_0000118: Räuber @de
IAO_0000118: predator
id: EUPH:1105

Axiom
annotated source: predator
annotated property: IAO_0000115
annotated target: An organism that preys on other organisms.
source: https://www.biologyonline.com/dictionary

uncapping
type: Class
subclass of: honey harvesting
subclass of: Restriction
  on property: preceded by
  some values from: honey harvesting
subclass of: Restriction
  on property: has input
  some values from: https://w3id.org/euph/802
subclass of: Restriction
  on property: has output
  some values from: uncapped honey comb
IAO_0000115: Uncapping is a honey harvesting process in which the wax caps are removed from a honeycomb.
IAO_0000117: Michael Rubinigg
IAO_0000118: a descăpăci @ro
IAO_0000118: abdeckeln @de
IAO_0000118: at skrælle @da
IAO_0000118: att avtäcka @sv
IAO_0000118: desopercular @es
IAO_0000118: disopercolare @it
IAO_0000118: désoperculer @fr
IAO_0000118: entdeckeln @de
IAO_0000118: ontzegelen @nl
IAO_0000118: to uncap
IAO_0000118: å skrelle @no
id: EUPH:1106

disease caused or transmitted by insects
type: Class
subclass of: disease caused or transmitted by arthropods
IAO_0000115: A disease caused or transmitted by insects is a disease caused or transmitted by an organism belonging to the taxonomic class Insecta.
IAO_0000117: Michael Rubinigg
IAO_0000118: disease caused or transmitted by insects
IAO_0000118: von Insekten verursachte oder übertragene Krankheit @de
id: EUPH:111

animal health management
type: Class
subclass of: process in veterinary medicine
IAO_0000115: Animal health management means a system designed to optimise the physical and behavioural health and welfare of animals. It includes the prevention, treatment and control of diseases and conditions affecting the individual animal and herd or flock, including the recording of illness, injuries, mortalities and medical treatments where appropriate.
IAO_0000117: Michael Rubinigg
IAO_0000118: Tiergesundheitsmanagement @de
IAO_0000118: animal health management
id: EUPH:1112

Axiom
annotated source: animal health management
annotated property: IAO_0000115
annotated target: Animal health management means a system designed to optimise the physical and behavioural health and welfare of animals. It includes the prevention, treatment and control of diseases and conditions affecting the individual animal and herd or flock, including the recording of illness, injuries, mortalities and medical treatments where appropriate.
has db xref: ISBN:978-92-95115-40-8

animal health status
type: Class
subclass of: relational quality in veterinary medicine
subclass of: Restriction
  on property: towards
  some values from: disease
subclass of: Restriction
  on property: quality of
  some values from: geopolitical region
IAO_0000115: Animal health status means the status of a country, zone or compartment with respect to an animal disease [...].
IAO_0000117: Michael Rubinigg
IAO_0000118: animal health status
id: EUPH:1113

Axiom
annotated source: animal health status
annotated property: IAO_0000115
annotated target: Animal health status means the status of a country, zone or compartment with respect to an animal disease [...].
has db xref: ISBN:978-92-95115-40-8

animal identification
type: Class
subclass of: animal traceability
IAO_0000115: Animal identification is a procedure for tracing animals, which has been defined as [...] the combination of the identification and registration of an animal individually, with a unique identifier, or collectively by its epidemiological unit or group, with a unique group identifier.
IAO_0000117: Michael Rubinigg
IAO_0000118: Tierkennzeichnung @de
IAO_0000118: animal identification
id: EUPH:1114

Axiom
annotated source: animal identification
annotated property: IAO_0000115
annotated target: Animal identification is a procedure for tracing animals, which has been defined as [...] the combination of the identification and registration of an animal individually, with a unique identifier, or collectively by its epidemiological unit or group, with a unique group identifier.
has db xref: ISBN:978-92-95115-40-8

animal identification system
type: Class
subclass of: plan specification in veterinary medicine
subclass of: Restriction
  on property: generically depends on
  some values from: https://www.gbif.org/species/1
IAO_0000115: Animal identification system means the inclusion and linking of components such as identification of establishments or owners, the persons responsible for the animals, movements and other records with animal identification.
IAO_0000117: Michael Rubinigg
IAO_0000118: animal identification system
id: EUPH:1115

Axiom
annotated source: animal identification system
annotated property: IAO_0000115
annotated target: Animal identification system means the inclusion and linking of components such as identification of establishments or owners, the persons responsible for the animals, movements and other records with animal identification.
has db xref: ISBN:978-92-95115-40-8

animal traceability
type: Class
subclass of: animal health management
IAO_0000115: Animal traceability is a set of management and physical measures in the field of animal health management that enables the ability to follow an animal or group of animals during all stages of its life.
IAO_0000117: Michael Rubinigg
IAO_0000118: animal traceability
id: EUPH:1116

Axiom
annotated source: animal traceability
annotated property: IAO_0000115
annotated target: Animal traceability is a set of management and physical measures in the field of animal health management that enables the ability to follow an animal or group of animals during all stages of its life.
has db xref: ISBN:978-92-95115-40-8

animal welfare
type: Class
subclass of: relational quality in veterinary medicine
subclass of: Restriction
  on property: towards
  some values from: housing condition
subclass of: Restriction
  on property: quality of
  some values from: health status
IAO_0000115: Animal welfare means the physical and mental state of an animal in relation to the conditions in which it lives and dies.
IAO_0000117: Michael Rubinigg
IAO_0000118: Tierschutz @de
IAO_0000118: animal welfare
id: EUPH:1117

Axiom
annotated source: animal welfare
annotated property: IAO_0000115
annotated target: Animal welfare means the physical and mental state of an animal in relation to the conditions in which it lives and dies.
has db xref: ISBN:978-92-95115-40-8

biosecurity
type: Class
subclass of: animal health management
IAO_0000115: Biosecurity is a set of management and physical measures in the field of animal health management that has been [...] designed to reduce the risk of introduction, establishment and spread of animal diseases, infections or infestations to, from and within an animal population.
IAO_0000117: Michael Rubinigg
IAO_0000118: biosecurity
id: EUPH:1118

Axiom
annotated source: biosecurity
annotated property: IAO_0000115
annotated target: Biosecurity is a set of management and physical measures in the field of animal health management that has been [...] designed to reduce the risk of introduction, establishment and spread of animal diseases, infections or infestations to, from and within an animal population.
has db xref: ISBN:978-92-95115-40-8

biosecurity plan
type: Class
subclass of: plan specification in veterinary medicine
IAO_0000115: Biosecurity plan means a plan that identifies potential pathways for the introduction and spread of disease in a zone or compartment, and describes the measures which are being or will be applied to mitigate the disease risks, if applicable, in accordance with the recommendations in the Terrestrial Code.
IAO_0000117: Michael Rubinigg
IAO_0000118: biosecurity plan
id: EUPH:1119

Axiom
annotated source: biosecurity plan
annotated property: IAO_0000115
annotated target: Biosecurity plan means a plan that identifies potential pathways for the introduction and spread of disease in a zone or compartment, and describes the measures which are being or will be applied to mitigate the disease risks, if applicable, in accordance with the recommendations in the Terrestrial Code.
has db xref: ISBN:978-92-95115-40-8

disease caused or transmitted by acari
type: Class
subclass of: disease caused or transmitted by arthropods
IAO_0000115: A disease caused or transmitted by acari is a disease caused or transmitted by an organism belonging to belonging to the polyphyletic group of the Acari.
IAO_0000117: Michael Rubinigg
IAO_0000118: disease caused or transmitted by acari
IAO_0000118: von Milben verursachte oder übertragene Krankheit @de
id: EUPH:112

case
type: Class
subclass of: role of organisms in veterinary medicine
subclass of: Restriction
  on property: role of
  some values from: https://www.gbif.org/species/1
IAO_0000115: Case means an individual animal infected by a pathogenic agent, with or without clinical signs.
IAO_0000117: Michael Rubinigg
IAO_0000118: case
id: EUPH:1120

Axiom
annotated source: case
annotated property: IAO_0000115
annotated target: Case means an individual animal infected by a pathogenic agent, with or without clinical signs.
has db xref: ISBN:978-92-95115-40-8

containment zone
type: Class
subclass of: veterinary zone
IAO_0000115: Containment zone means an infected zone defined within a previously free country or zone, which includes all suspected or confirmed cases that are epidemiologically linked and where movement control, biosecurity and sanitary measures are applied to prevent the spread of, and to eradicate, the infection or infestation.
IAO_0000117: Michael Rubinigg
IAO_0000118: containment zone
id: EUPH:1121

Axiom
annotated source: containment zone
annotated property: IAO_0000115
annotated target: Containment zone means an infected zone defined within a previously free country or zone, which includes all suspected or confirmed cases that are epidemiologically linked and where movement control, biosecurity and sanitary measures are applied to prevent the spread of, and to eradicate, the infection or infestation.
has db xref: ISBN:978-92-95115-40-8

disinfection
type: Class
subclass of: disease control
IAO_0000115: Disinfection means the application, after thorough cleansing, of procedures intended to destroy the infectious or parasitic agents of animal diseases, including zoonoses; this applies to premises, vehicles and different objects which may have been directly or indirectly contaminated.
IAO_0000117: Michael Rubinigg
IAO_0000118: Desinfektion @de
IAO_0000118: disinfection
IAO_0000118: disinfezione @it
IAO_0000118: désinfection @fr
IAO_0000118: ontsmetting @nl
id: EUPH:1122

Axiom
annotated source: disinfection
annotated property: IAO_0000115
annotated target: Disinfection means the application, after thorough cleansing, of procedures intended to destroy the infectious or parasitic agents of animal diseases, including zoonoses; this applies to premises, vehicles and different objects which may have been directly or indirectly contaminated.
has db xref: ISBN:978-92-95115-40-8

disinfestation
type: Class
subclass of: disease control
IAO_0000115: Disinfestation means the application of procedures intended to eliminate infestation.
IAO_0000117: Michael Rubinigg
IAO_0000118: Desinfektion @de
IAO_0000118: disinfestation
id: EUPH:1123

Axiom
annotated source: disinfestation
annotated property: IAO_0000115
annotated target: Disinfestation means the application of procedures intended to eliminate infestation.
has db xref: ISBN:978-92-95115-40-8

early warning system
type: Class
subclass of: disease control
IAO_0000115: Early warning system means a system for the timely detection, reporting and communication of occurrence, incursion or emergence of diseases, infections or infestations in a country, zone or compartment.
IAO_0000117: Michael Rubinigg
IAO_0000118: Frühwarnsystem @de
IAO_0000118: early warning system
id: EUPH:1124

Axiom
annotated source: early warning system
annotated property: IAO_0000115
annotated target: Early warning system means a system for the timely detection, reporting and communication of occurrence, incursion or emergence of diseases, infections or infestations in a country, zone or compartment.
has db xref: ISBN:978-92-95115-40-8

emerging disease
type: Class
subclass of: quality in veterinary medicine
subclass of: Restriction
  on property: quality of
  some values from: disease
IAO_0000115: Emerging disease means a new occurrence in an animal of a disease, infection or infestation, causing a significant impact on animal or public health resulting from: (a.) a change of a known pathogenic agent or its spread to a new geographic area or species; or (b.) a previously unrecognised pathogenic agent or disease diagnosed for the first time.
IAO_0000117: Michael Rubinigg
IAO_0000118: emerging disease
id: EUPH:1125

Axiom
annotated source: emerging disease
annotated property: IAO_0000115
annotated target: Emerging disease means a new occurrence in an animal of a disease, infection or infestation, causing a significant impact on animal or public health resulting from: (a.) a change of a known pathogenic agent or its spread to a new geographic area or species; or (b.) a previously unrecognised pathogenic agent or disease diagnosed for the first time.
has db xref: ISBN:978-92-95115-40-8

epidemiological unit
type: Class
subclass of: generically dependent continuant in veterinary medicine
IAO_0000115: Epidemiological unit means a group of animals with the same likelihood of exposure to a pathogenic agent. In certain circumstances, the epidemiological unit may be a single animal.
IAO_0000117: Michael Rubinigg
IAO_0000118: epidemiological unit
id: EUPH:1126

Axiom
annotated source: epidemiological unit
annotated property: IAO_0000115
annotated target: Epidemiological unit means a group of animals with the same likelihood of exposure to a pathogenic agent. In certain circumstances, the epidemiological unit may be a single animal.
has db xref: ISBN:978-92-95115-40-8

eradication
type: Class
subclass of: disease control
IAO_0000115: Eradication means the elimination of a pathogenic agent from a country or zone.
IAO_0000117: Michael Rubinigg
IAO_0000118: eradication
id: EUPH:1127

Axiom
annotated source: eradication
annotated property: IAO_0000115
annotated target: Eradication means the elimination of a pathogenic agent from a country or zone.
has db xref: ISBN:978-92-95115-40-8

hive management
type: Class
subclass of: colony management
IAO_0000115: Hive management is a colony management process specifically carried out on beehives.
IAO_0000117: Michael Rubinigg
IAO_0000118: Behandlung @de
IAO_0000118: Betriebsweise @de
IAO_0000118: Umgang @de
IAO_0000118: bedrijfswijze @nl
IAO_0000118: behandeling @nl
IAO_0000118: behandlingsmetod @sv
IAO_0000118: behandlingsmåde @da
IAO_0000118: conducta del colmenar @es
IAO_0000118: conduite du rucher @fr
IAO_0000118: conduzione dell'apiario @it
IAO_0000118: condução @pt
IAO_0000118: cure all'apiario @it
IAO_0000118: driftsform @da
IAO_0000118: driftsmåte @no
IAO_0000118: hive management
IAO_0000118: manejo @pt
IAO_0000118: manejo de las colmenas @es
IAO_0000118: manipulção das colmeias @pt
IAO_0000118: method of management
IAO_0000118: metodă de întreținere @ro
IAO_0000118: system of management
IAO_0000118: tehnică de întreținere @ro
id: EUPH:1128

acarapisosis of honey bees
type: Class
subclass of: disease caused or transmitted by acari
subclass of: Restriction
  on property: disposition of
  some values from: adult honey bee
subclass of: Restriction
  on property: disease has infectious agent
  some values from: https://www.gbif.org/species/4542910
IAO_0000115: For the purposes of the Terrestrial Code, acarapisosis, also known as acarine disease or tracheal mite infestation, is an infestation of adult honey bees (species of the genus Apis), primarily Apis mellifera L. with the mite Acarapis woodi, an internal obligate parasite of the respiratory system which spreads by direct contact from adult honey bee to adult honey bee.
IAO_0000117: Michael Rubinigg
IAO_0000118: Isle of Wight disease
IAO_0000118: Milbenkrankheit @de
IAO_0000118: Milbenseuche @de
IAO_0000118: acariasis @es
IAO_0000118: acarine disease
IAO_0000118: acariose @fr
IAO_0000118: acariosi @it
IAO_0000118: acariosis @es
IAO_0000118: acarioză @ro
IAO_0000118: acarisziekte @nl
IAO_0000118: acaríase @pt
IAO_0000118: krabbelziekte @nl
IAO_0000118: kvalstersjuka @sv
IAO_0000118: middesjuke @no
IAO_0000118: midesyge @da
IAO_0000118: mijtziekte @nl
id: EUPH:113

Axiom
annotated source: acarapisosis of honey bees
annotated property: IAO_0000115
annotated target: For the purposes of the Terrestrial Code, acarapisosis, also known as acarine disease or tracheal mite infestation, is an infestation of adult honey bees (species of the genus Apis), primarily Apis mellifera L. with the mite Acarapis woodi, an internal obligate parasite of the respiratory system which spreads by direct contact from adult honey bee to adult honey bee.
has db xref: ISBN:978-92-95115-40-8

honey bee feed
type: Class
subclass of: object in beekeeping
IAO_0000115: Honey bee feed means any material (single or multiple), whether processed, semi-processed or raw, which is intended to be fed directly to honey bees by the beekeeper
IAO_0000117: Michael Rubinigg
IAO_0000118: Futter @de
IAO_0000118: feed
id: EUPH:1130

caste
type: Class
subclass of: physiological role
subclass of: Restriction
  on property: role of
  some values from: https://www.gbif.org/species/1
subclass of: Restriction
  on property: member of
  some values from: occurrence
subclass of: Restriction
  on property: member of
  some values from: https://w3id.org/euph/7509
IAO_0000115: Caste may be defined as the subdivision of a colony of social insects into groups characterized by a shared morphogenetic pathway that has diverged irreversibly from that of other such groups in the colony.
IAO_0000117: Michael Rubinigg
IAO_0000118: Kaste @de
IAO_0000118: casta @es
IAO_0000118: caste
IAO_0000118: castă @ro
IAO_0000118: kast @sv
IAO_0000118: kaste @da
id: EUPH:1132

Axiom
annotated source: caste
annotated property: IAO_0000115
annotated target: Caste may be defined as the subdivision of a colony of social insects into groups characterized by a shared morphogenetic pathway that has diverged irreversibly from that of other such groups in the colony.
has db xref: 10.1080/08927014.1992.9523134
has db xref: 10.1371/journal.pone.0029715

feral animal
type: Class
subclass of: role of organisms in veterinary medicine
subclass of: Restriction
  on property: role of
  some values from: https://www.gbif.org/species/1
IAO_0000115: Feral animal means an animal of a domesticated species that lives without requiring human supervision or control.
IAO_0000117: Michael Rubinigg
IAO_0000118: feral animal
id: EUPH:1133

Axiom
annotated source: feral animal
annotated property: IAO_0000115
annotated target: Feral animal means an animal of a domesticated species that lives without requiring human supervision or control.
has db xref: ISBN:978-92-95115-40-8

free zone
type: Class
subclass of: veterinary zone
IAO_0000115: Free zone means a zone in which the absence of a specific infection or infestation in an animal population has been demonstrated in accordance with the relevant requirements of the Terrestrial Code.
IAO_0000117: Michael Rubinigg
IAO_0000118: free zone
id: EUPH:1134

Axiom
annotated source: free zone
annotated property: IAO_0000115
annotated target: Free zone means a zone in which the absence of a specific infection or infestation in an animal population has been demonstrated in accordance with the relevant requirements of the Terrestrial Code.
has db xref: ISBN:978-92-95115-40-8

incidence
type: Class
subclass of: unit of measure in veterinary medicine
IAO_0000115: Incidence means the number of new cases or outbreaks of a disease that occur in a population at risk in a particular geographical area within a defined time interval.
IAO_0000117: Michael Rubinigg
IAO_0000118: incidence
id: EUPH:1135

Axiom
annotated source: incidence
annotated property: IAO_0000115
annotated target: Incidence means the number of new cases or outbreaks of a disease that occur in a population at risk in a particular geographical area within a defined time interval.
has db xref: ISBN:978-92-95115-40-8

infected zone
type: Class
subclass of: veterinary zone
IAO_0000115: Infected zone means a zone either in which an infection or infestation has been confirmed, or one that is defined as such in the relevant chapters of the Terrestrial Code.
IAO_0000117: Michael Rubinigg
IAO_0000118: infected zone
id: EUPH:1136

Axiom
annotated source: infected zone
annotated property: IAO_0000115
annotated target: Infected zone means a zone either in which an infection or infestation has been confirmed, or one that is defined as such in the relevant chapters of the Terrestrial Code.
has db xref: ISBN:978-92-95115-40-8

infection
type: Class
subclass of: process in veterinary medicine
IAO_0000115: Infection means the entry and development or multiplication of a pathogenic agent in the body of humans or animals.
IAO_0000117: Michael Rubinigg
IAO_0000118: Seuche @de
IAO_0000118: besmetting @nl
IAO_0000118: infección @es
IAO_0000118: infection
IAO_0000118: infecção @pt
IAO_0000118: infecţie @ro
IAO_0000118: infeksjon @no
IAO_0000118: infektion @da
IAO_0000118: infezione @it
IAO_0000118: smitta @sv
IAO_0000118: smitte @no
id: EUPH:1137

Axiom
annotated source: infection
annotated property: IAO_0000115
annotated target: Infection means the entry and development or multiplication of a pathogenic agent in the body of humans or animals.
has db xref: ISBN:978-92-95115-40-8

infective period
type: Class
subclass of: one-dimensional temporal region in veterinary medicine
IAO_0000115: Infective period means the longest period during which an affected animal can be a source of infection.
IAO_0000117: Michael Rubinigg
IAO_0000118: infective period
id: EUPH:1138

Axiom
annotated source: infective period
annotated property: IAO_0000115
annotated target: Infective period means the longest period during which an affected animal can be a source of infection.
has db xref: ISBN:978-92-95115-40-8

incubation period
type: Class
subclass of: one-dimensional temporal region in veterinary medicine
IAO_0000115: Incubation period means the longest period that elapses between the introduction of the pathogenic agent into the animal and the occurrence of the first clinical signs of the disease.
IAO_0000117: Michael Rubinigg
IAO_0000118: incubation period
id: EUPH:1139

Axiom
annotated source: incubation period
annotated property: IAO_0000115
annotated target: Incubation period means the longest period that elapses between the introduction of the pathogenic agent into the animal and the occurrence of the first clinical signs of the disease.
has db xref: ISBN:978-92-95115-40-8

varroosis of honey bees
type: Class
subclass of: disease caused or transmitted by acari
subclass of: Restriction
  on property: disposition of
  some values from: adult honey bee
subclass of: Restriction
  on property: disposition of
  some values from: brood
subclass of: Restriction
  on property: disease has infectious agent
  some values from: Deformed Wing Virus (DWV)
subclass of: Restriction
  on property: disease has infectious agent
  some values from: https://www.gbif.org/species/2188249
subclass of: Restriction
  on property: disease has feature
  some values from: deformed wings
IAO_0000115: For the purposes of the Terrestrial Code, varroosis is a disease of honey bees (species of the genus Apis) caused by mites in the genus Varroa, primarily Varroa destructor. The mite is an ectoparasite of adults and brood of honey bees and spreads by direct contact from adult honey bee to adult honey bee, and by the movement of infested honey bees, bee brood, bee products and used apicultural equipment.
IAO_0000117: Michael Rubinigg
IAO_0000118: Varroose @de
IAO_0000118: varroosis
id: EUPH:114

Axiom
annotated source: varroosis of honey bees
annotated property: IAO_0000115
annotated target: For the purposes of the Terrestrial Code, varroosis is a disease of honey bees (species of the genus Apis) caused by mites in the genus Varroa, primarily Varroa destructor. The mite is an ectoparasite of adults and brood of honey bees and spreads by direct contact from adult honey bee to adult honey bee, and by the movement of infested honey bees, bee brood, bee products and used apicultural equipment.
has db xref: ISBN:978-92-95115-40-8

infestation
type: Class
subclass of: process in veterinary medicine
IAO_0000115: Infestation means the external invasion or colonisation of animals or their immediate surroundings by arthropods, which may cause clinical signs or are potential vectors of pathogenic agents.
IAO_0000117: Michael Rubinigg
IAO_0000118: infestation
id: EUPH:1140

Axiom
annotated source: infestation
annotated property: IAO_0000115
annotated target: Infestation means the external invasion or colonisation of animals or their immediate surroundings by arthropods, which may cause clinical signs or are potential vectors of pathogenic agents.
has db xref: ISBN:0-936028-10-6

listed disease
type: Class
subclass of: quality in veterinary medicine
subclass of: Restriction
  on property: quality of
  some values from: disease
IAO_0000115: Listed disease means a disease, infection or infestation listed in Chapter 1.3. [of the Terrestrial Animal Health Code] after adoption by the World Assembly of OIE Delegates.
IAO_0000117: Michael Rubinigg
IAO_0000118: listed disease
id: EUPH:1141

Axiom
annotated source: listed disease
annotated property: IAO_0000115
annotated target: Listed disease means a disease, infection or infestation listed in Chapter 1.3. [of the Terrestrial Animal Health Code] after adoption by the World Assembly of OIE Delegates.
has db xref: ISBN:978-92-95115-40-8

monitoring
type: Class
subclass of: disease control
IAO_0000115: Monitoring means the intermittent performance and analysis of routine measurements and observations, aimed at detecting changes in the environment or health status of a population.
IAO_0000117: Michael Rubinigg
IAO_0000118: monitoring
id: EUPH:1142

Axiom
annotated source: monitoring
annotated property: IAO_0000115
annotated target: Monitoring means the intermittent performance and analysis of routine measurements and observations, aimed at detecting changes in the environment or health status of a population.
has db xref: ISBN:978-92-95115-40-8

notifiable disease
type: Class
subclass of: conditional specification in veterinary medicine
IAO_0000115: Notifiable disease means a disease listed by the Veterinary Authority, and that, as soon as detected or suspected, should be brought to the attention of this Authority, in accordance with national regulations.
IAO_0000117: Michael Rubinigg
IAO_0000118: anzeigepflichtige Krankheit @de
IAO_0000118: notifiable disease
id: EUPH:1143

Axiom
annotated source: notifiable disease
annotated property: IAO_0000115
annotated target: Notifiable disease means a disease listed by the Veterinary Authority, and that, as soon as detected or suspected, should be brought to the attention of this Authority, in accordance with national regulations.
has db xref: ISBN:978-92-95115-40-8

official veterinarian
type: Class
subclass of: role of organisms in veterinary medicine
subclass of: Restriction
  on property: role of
  some values from: https://www.gbif.org/species/2436436
IAO_0000115: Official veterinarian means a veterinarian authorised by the Veterinary Authority of the country to perform certain designated official tasks associated with animal health or public health and inspections of commodities [...].
IAO_0000117: Michael Rubinigg
IAO_0000118: Amtsveterinär @de
IAO_0000118: official veterinarian
id: EUPH:1144

Axiom
annotated source: official veterinarian
annotated property: IAO_0000115
annotated target: Official veterinarian means a veterinarian authorised by the Veterinary Authority of the country to perform certain designated official tasks associated with animal health or public health and inspections of commodities [...].
has db xref: ISBN:978-92-95115-40-8

outbreak
type: Class
subclass of: unit of measure in veterinary medicine
IAO_0000115: Outbreak means the occurrence of one or more cases in an epidemiological unit.
IAO_0000117: Michael Rubinigg
IAO_0000118: Ausbruch @de
IAO_0000118: outbreak
id: EUPH:1145

Axiom
annotated source: outbreak
annotated property: IAO_0000115
annotated target: Outbreak means the occurrence of one or more cases in an epidemiological unit.
has db xref: ISBN:978-92-95115-40-8

prevalence
type: Class
subclass of: veterinary medicine quantity
subclass of: Restriction
  on property: quality of
  some values from: outbreak
IAO_0000115: Prevalence means the total number of cases or outbreaks of a disease that are present in a population at risk, in a particular geographical area, at one specified time or during a given period.
IAO_0000117: Michael Rubinigg
IAO_0000118: prevalence
id: EUPH:1146

Axiom
annotated source: prevalence
annotated property: IAO_0000115
annotated target: Prevalence means the total number of cases or outbreaks of a disease that are present in a population at risk, in a particular geographical area, at one specified time or during a given period.
has db xref: ISBN:978-92-95115-40-8

protection zone
type: Class
subclass of: veterinary zone
IAO_0000115: protection zone means a zone where specific biosecurity and sanitary measures are implemented to prevent the entry of a pathogenic agent into a free country or zone from a neighbouring country or zone of a different animal health status.
IAO_0000117: Michael Rubinigg
IAO_0000118: protection zone
id: EUPH:1147

Axiom
annotated source: protection zone
annotated property: IAO_0000115
annotated target: protection zone means a zone where specific biosecurity and sanitary measures are implemented to prevent the entry of a pathogenic agent into a free country or zone from a neighbouring country or zone of a different animal health status.
has db xref: ISBN:978-92-95115-40-8

qualitative risk assessment
type: Class
subclass of: risk assessment
IAO_0000115: Qualitative risk assessment is a risk assessment process that has been defined as [...] an assessment where the outputs on the likelihood of the outcome or the magnitude of the consequences are expressed in qualitative terms such as ’high’, ’medium’, ’low’ or ’negligible’.
IAO_0000117: Michael Rubinigg
IAO_0000118: qualitative risk assessment
id: EUPH:1148

Axiom
annotated source: qualitative risk assessment
annotated property: IAO_0000115
annotated target: Qualitative risk assessment is a risk assessment process that has been defined as [...] an assessment where the outputs on the likelihood of the outcome or the magnitude of the consequences are expressed in qualitative terms such as ’high’, ’medium’, ’low’ or ’negligible’.
has db xref: ISBN:978-92-95115-40-8

quantitative risk assessment
type: Class
subclass of: risk assessment
IAO_0000115: Quantitative risk assessment is a risk assessment process that has been defined as [...] an assessment where the outputs of the risk assessment are expressed numerically.
IAO_0000117: Michael Rubinigg
IAO_0000118: quantitative risk assessment
id: EUPH:1149

Axiom
annotated source: quantitative risk assessment
annotated property: IAO_0000115
annotated target: Quantitative risk assessment is a risk assessment process that has been defined as [...] an assessment where the outputs of the risk assessment are expressed numerically.
has db xref: ISBN:978-92-95115-40-8

Tropilaelaps infestation of honey bees
type: Class
subclass of: disease caused or transmitted by acari
subclass of: Restriction
  on property: disposition of
  some values from: adult honey bee
subclass of: Restriction
  on property: disposition of
  some values from: brood
subclass of: Restriction
  on property: disease has infectious agent
  some values from: https://www.gbif.org/species/4655026
IAO_0000115: For the purposes of the Terrestrial Code, Tropilaelaps infestation of honey bees (species of the genus Apis) is caused by different species of Tropilaelaps mites (including the mites Tropilaelaps clareae, T. koenigerum, T. thaii and T. mercedesae). The mite is an ectoparasite of brood of honey bees, and cannot survive for periods of more than 21 days away from bee brood.
IAO_0000117: Michael Rubinigg
IAO_0000118: Tropilaelaps infestation of honey bees
id: EUPH:115

Axiom
annotated source: Tropilaelaps infestation of honey bees
annotated property: IAO_0000115
annotated target: For the purposes of the Terrestrial Code, Tropilaelaps infestation of honey bees (species of the genus Apis) is caused by different species of Tropilaelaps mites (including the mites Tropilaelaps clareae, T. koenigerum, T. thaii and T. mercedesae). The mite is an ectoparasite of brood of honey bees, and cannot survive for periods of more than 21 days away from bee brood.
has db xref: ISBN:978-92-95115-40-8

biosecurity risk
type: Class
subclass of: information content entity in veterinary medicine
IAO_0000115: Risk means the likelihood of the occurrence and the likely magnitude of the biological and economic consequences of an adverse event or effect to animal or human health.
IAO_0000117: Michael Rubinigg
IAO_0000118: Risiko @de
IAO_0000118: risk
id: EUPH:1150

Axiom
annotated source: biosecurity risk
annotated property: IAO_0000115
annotated target: Risk means the likelihood of the occurrence and the likely magnitude of the biological and economic consequences of an adverse event or effect to animal or human health.
has db xref: ISBN:978-92-95115-40-8

risk analysis
type: Class
subclass of: animal health management
IAO_0000115: Risk analysis is a animal health management process that has been defined as [...] the process composed of hazard identification, risk assessment, risk management and risk communication.
IAO_0000117: Michael Rubinigg
IAO_0000118: Risikoanalyse @de
IAO_0000118: risk analysis
id: EUPH:1151

Axiom
annotated source: risk analysis
annotated property: IAO_0000115
annotated target: Risk analysis is a animal health management process that has been defined as [...] the process composed of hazard identification, risk assessment, risk management and risk communication.
has db xref: ISBN:978-92-95115-40-8

risk assessment
type: Class
subclass of: risk analysis
IAO_0000115: Risk assessment is a risk analysis process that has been defined as [...] evaluation of the likelihood and the biological and economic consequences of entry, establishment and spread of a hazard.
IAO_0000117: Michael Rubinigg
IAO_0000118: Risikobewertung @de
IAO_0000118: risk assessment
id: EUPH:1152

Axiom
annotated source: risk assessment
annotated property: IAO_0000115
annotated target: Risk assessment is a risk analysis process that has been defined as [...] evaluation of the likelihood and the biological and economic consequences of entry, establishment and spread of a hazard.
has db xref: ISBN:978-92-95115-40-8

surveillance
type: Class
subclass of: monitoring
IAO_0000115: Surveillance means the systematic ongoing collection, collation, and analysis of information related to animal health and the timely dissemination of information so that action can be taken.
IAO_0000117: Michael Rubinigg
IAO_0000118: surveillance
id: EUPH:1153

Axiom
annotated source: surveillance
annotated property: IAO_0000115
annotated target: Surveillance means the systematic ongoing collection, collation, and analysis of information related to animal health and the timely dissemination of information so that action can be taken.
has db xref: ISBN:978-92-95115-40-8

veterinary zone
type: Class
subclass of: role in veterinary medicine
subclass of: Restriction
  on property: role of
  some values from: area in country
IAO_0000115: Zone means a part of a country defined by the veterinary authority, containing an animal population or subpopulation with a specific animal health status with respect to an infection or infestation for the purposes of international trade or disease prevention or control.
IAO_0000117: Michael Rubinigg
IAO_0000118: zone
id: EUPH:1154

Axiom
annotated source: veterinary zone
annotated property: IAO_0000115
annotated target: Zone means a part of a country defined by the veterinary authority, containing an animal population or subpopulation with a specific animal health status with respect to an infection or infestation for the purposes of international trade or disease prevention or control.
has db xref: ISBN:978-92-95115-40-8

veterinary authority
type: Class
subclass of: object aggregate in veterinary medicine
IAO_0000115: Veterinary Authority means the Governmental Authority of a Member Country having the primary responsibility in the whole territory for coordinating the implementation of the standards of the Terrestrial Code.
IAO_0000117: Michael Rubinigg
IAO_0000118: Veterinärbehörde @de
IAO_0000118: veterinary authority
id: EUPH:1155

Axiom
annotated source: veterinary authority
annotated property: IAO_0000115
annotated target: Veterinary Authority means the Governmental Authority of a Member Country having the primary responsibility in the whole territory for coordinating the implementation of the standards of the Terrestrial Code.
has db xref: ISBN:978-92-95115-40-8

veterinary medicinal product (VMP)
type: Class
subclass of: object aggregate in veterinary medicine
IAO_0000115: Veterinary medicinal product means any product with approved claims to having a prophylactic, therapeutic or diagnostic effect or to alter physiological functions when administered or applied to an animal.
IAO_0000117: Michael Rubinigg
IAO_0000118: TAM @de
IAO_0000118: Tierarzneimittel @de
IAO_0000118: VMP
IAO_0000118: veterinary medicinal product
id: EUPH:1156

Axiom
annotated source: veterinary medicinal product (VMP)
annotated property: IAO_0000115
annotated target: Veterinary medicinal product means any product with approved claims to having a prophylactic, therapeutic or diagnostic effect or to alter physiological functions when administered or applied to an animal.
has db xref: ISBN:978-92-95115-40-8

veterinary legislation
type: Class
subclass of: https://w3id.org/euph/8186
IAO_0000115: Veterinary legislation means laws, regulations and all associated legal instruments that pertain to the veterinary domain.
IAO_0000117: Michael Rubinigg
IAO_0000118: veterinary legislation
id: EUPH:1157

Axiom
annotated source: veterinary legislation
annotated property: IAO_0000115
annotated target: Veterinary legislation means laws, regulations and all associated legal instruments that pertain to the veterinary domain.
has db xref: ISBN:978-92-95115-40-8

specific surveillance
type: Class
subclass of: surveillance
IAO_0000115: Specific surveillance means the surveillance targeted to a specific disease or infection.
IAO_0000117: Michael Rubinigg
IAO_0000118: specific surveillance
id: EUPH:1158

Axiom
annotated source: specific surveillance
annotated property: IAO_0000115
annotated target: Specific surveillance means the surveillance targeted to a specific disease or infection.
has db xref: ISBN:978-92-95115-40-8

beeswax
type: Class
subclass of: primary hive product
subclass of: Restriction
  on property: derives from
  some values from: wax scale
IAO_0000115: Beeswax is a primary hive product and has been defined as Natural animal wax composed of esters of fatty acids and various long-chain alcohols. Secreted from 4 paired glands on underside of abdomen of adult bees of genus Apis; molded to form honeycomb or cap pupal/honey filled cells It is described by the following attributes or identifiers: FAOSTAT Item Code: 1183 FAOSTAT Label: Beeswax CPC code: 02960.01 HS07 code: 152190 HS12 code: 152190
IAO_0000117: Michael Rubinigg
IAO_0000118: Bienenwachs @de
IAO_0000118: beeswax
IAO_0000118: bijenwas @nl
IAO_0000118: bivax @sv
IAO_0000118: bivoks @da
IAO_0000118: ceară de albine @ro
IAO_0000118: cera d'api @it
IAO_0000118: cera de abejas @es
IAO_0000118: cera de abelhas @pt
IAO_0000118: cire d'abeilles @fr
id: EUPH:1159

Axiom
annotated source: beeswax
annotated property: IAO_0000115
annotated target: Beeswax is a primary hive product and has been defined as Natural animal wax composed of esters of fatty acids and various long-chain alcohols. Secreted from 4 paired glands on underside of abdomen of adult bees of genus Apis; molded to form honeycomb or cap pupal/honey filled cells It is described by the following attributes or identifiers: FAOSTAT Item Code: 1183 FAOSTAT Label: Beeswax CPC code: 02960.01 HS07 code: 152190 HS12 code: 152190
has db xref: ISBN:1-878075-65-4
source: https://www.fao.org/faostat/en/#definitions

small hive beetle infestation
type: Class
subclass of: disease caused or transmitted by insects
subclass of: Restriction
  on property: disposition of
  some values from: honey bee colony
subclass of: Restriction
  on property: disease has infectious agent
  some values from: https://www.gbif.org/species/8254044
IAO_0000115: For the purposes of the Terrestrial Code, infestation with Aethina tumida (also known as small hive beetle) is an infestation of bee colonies (species of the genera Apis and Bombus and also stingless bees) by the beetle A. tumida, which is a free-living predator and scavenger affecting bee populations.
IAO_0000117: Michael Rubinigg
IAO_0000118: Befall mit dem Kleinen Bienenstockkäfer @de
IAO_0000118: Small hive beetle (Aethina tumida) infestation
id: EUPH:116

Axiom
annotated source: small hive beetle infestation
annotated property: IAO_0000115
annotated target: For the purposes of the Terrestrial Code, infestation with Aethina tumida (also known as small hive beetle) is an infestation of bee colonies (species of the genera Apis and Bombus and also stingless bees) by the beetle A. tumida, which is a free-living predator and scavenger affecting bee populations.
has db xref: ISBN:978-92-95115-40-8

bee venom
type: Class
subclass of: primary hive product
subclass of: Restriction
  on property: produced by
  some values from: venom gland
IAO_0000115: apitoxin: Honey bee venom; main component is mellitin (52%)
IAO_0000117: Michael Rubinigg
IAO_0000118: Bienengift @de
IAO_0000118: bee venom
id: EUPH:1160

Axiom
annotated source: bee venom
annotated property: IAO_0000115
annotated target: apitoxin: Honey bee venom; main component is mellitin (52%)
has db xref: ISBN:1-878075-65-4

propolis
type: Class
subclass of: primary hive product
subclass of: Restriction
  on property: involved in
  some values from: propolising
IAO_0000115: Resins collected from trees/plants; used to seal holes and surfaces in the hive; have anti-microbial properties for bees in humans
IAO_0000117: Michael Rubinigg
IAO_0000118: Kittharz @de
IAO_0000118: Kittwachs @de
IAO_0000118: Propolis @de
IAO_0000118: biharts @sv
IAO_0000118: bikitt @no
IAO_0000118: kittvax @sv
IAO_0000118: klæbevoks @da
IAO_0000118: propoli @it
IAO_0000118: propolis @da
IAO_0000118: propóleos @es
IAO_0000118: própolis @pt
IAO_0000118: voorwas @nl
id: EUPH:1162

Axiom
annotated source: propolis
annotated property: IAO_0000115
annotated target: Resins collected from trees/plants; used to seal holes and surfaces in the hive; have anti-microbial properties for bees in humans
has db xref: ISBN:1-878075-65-4

pollen pellet
type: Class
subclass of: primary hive product
subclass of: Restriction
  on property: produced by
  some values from: https://w3id.org/euph/8197
subclass of: Restriction
  on property: has part
  some values from: pollen grain
subclass of: Restriction
  on property: connected to
  some values from: corbicula
IAO_0000115: A pollen pellet is a primary hive product. It is a clump of pollen grains collected by worker bees while foraging for pollen and is removed with a pollen trap at colony entrance.
IAO_0000117: Michael Rubinigg
IAO_0000118: Pollenhöschen @de
IAO_0000118: carga de polen @es
IAO_0000118: carga de pólen @pt
IAO_0000118: carico di polline @it
IAO_0000118: ghemotoc de polen @ro
IAO_0000118: massa de pólen @pt
IAO_0000118: massa pólinica @pt
IAO_0000118: pallottola di polline @it
IAO_0000118: pelota de polen @es
IAO_0000118: pelota de pólen @pt
IAO_0000118: pelote de pollen @fr
IAO_0000118: pollen load
IAO_0000118: pollen pellet
IAO_0000118: pollenkorn @da
IAO_0000118: stuifmeelbroekje @nl
IAO_0000118: stuifmeelklompje @nl
IAO_0000118: încărcătură de polen @ro
id: EUPH:1163

Axiom
annotated source: pollen pellet
annotated property: IAO_0000115
annotated target: A pollen pellet is a primary hive product. It is a clump of pollen grains collected by worker bees while foraging for pollen and is removed with a pollen trap at colony entrance.
has db xref: ISBN:1-878075-65-4

unifloral honey
type: Class
subclass of: blossom honey
IAO_0000115: Nectar honey coming from predominantly one floral source.
IAO_0000117: Michael Rubinigg
IAO_0000118: Sortenhonig @de
IAO_0000118: unifloral honey
id: EUPH:1165

multifloral honey
type: Class
subclass of: blossom honey
IAO_0000115: Nectar honey coming from more than one floral source.
IAO_0000117: Michael Rubinigg
IAO_0000118: Blütenhonig @de
IAO_0000118: multifloral honey
id: EUPH:1166

afterswarm
type: Class
subclass of: swarm
subclass of: Restriction
  on property: output of
  some values from: swarming
subclass of: Restriction
  on property: has part
  some values from: adult worker bee
subclass of: Restriction
  on property: has part
  some values from: unmated queen
IAO_0000115: An afterswarm is a swarm emerging from a colony after the primary swarm. Afterswarms contain one or more virgin queens.
IAO_0000117: Michael Rubinigg
IAO_0000118: Afterschwarm @de
IAO_0000118: Nachschwarm @de
IAO_0000118: afterswarm
IAO_0000118: andrasvärm @sv
IAO_0000118: cast
IAO_0000118: eftersverm @no
IAO_0000118: eftersvärm @sv
IAO_0000118: eftersværm @da
IAO_0000118: endeling @nl
IAO_0000118: enjambre secundario @es
IAO_0000118: enxame secundário @pt
IAO_0000118: essaim secondaire @fr
IAO_0000118: jabardo @es
IAO_0000118: nazwerm @nl
IAO_0000118: rejeton @fr
IAO_0000118: roi secundar @ro
IAO_0000118: sciame secondario @it
id: EUPH:1167

Axiom
annotated source: afterswarm
annotated property: IAO_0000115
annotated target: An afterswarm is a swarm emerging from a colony after the primary swarm. Afterswarms contain one or more virgin queens.
has db xref: ISBN:1-878075-65-4

swarm control
type: Class
subclass of: hive management
IAO_0000115: Management to keep colonies with developing queen cells from succesful swarming. Numerous techniques are used that start with destroying the developing queens, then providing additional brood rearing süace, removing brood, removing queen or other major management to keep the colony from re-starting new queens.
IAO_0000117: Michael Rubinigg
IAO_0000118: Schwarmverhinderung @de
IAO_0000118: control de la emjambrazón @es
IAO_0000118: controle de enxameagem @pt
IAO_0000118: controle de enxameação @pt
IAO_0000118: controllo della sciamatura @it
IAO_0000118: contrôle de l'essaimage @fr
IAO_0000118: domínio da enxameação @pt
IAO_0000118: prevenirea roirii @ro
IAO_0000118: svermkontroll @no
IAO_0000118: svärmförhindring @sv
IAO_0000118: sværmforhindring @da
IAO_0000118: swarm control
IAO_0000118: zwermverhindering @nl
id: EUPH:1168

Axiom
annotated source: swarm control
annotated property: IAO_0000115
annotated target: Management to keep colonies with developing queen cells from succesful swarming. Numerous techniques are used that start with destroying the developing queens, then providing additional brood rearing süace, removing brood, removing queen or other major management to keep the colony from re-starting new queens.
has db xref: ISBN:1-878075-65-4

swarm prevention
type: Class
subclass of: hive management
IAO_0000115: Management of avoiding the development of queen cells in spring colonies; providing young aged queens, proper ventilation, and adequate brood space for developming spring colonies are most effective prevention techniques.
IAO_0000117: Michael Rubinigg
IAO_0000118: Schwarmverhinderung @de
IAO_0000118: swarm prevention
id: EUPH:1169

Axiom
annotated source: swarm prevention
annotated property: IAO_0000115
annotated target: Management of avoiding the development of queen cells in spring colonies; providing young aged queens, proper ventilation, and adequate brood space for developming spring colonies are most effective prevention techniques.
has db xref: ISBN:1-878075-65-4

American foulbrood of honey bees (AFB)
type: Class
subclass of: bacterial disease
subclass of: Restriction
  on property: disposition of
  some values from: brood
subclass of: Restriction
  on property: disease has infectious agent
  some values from: https://www.gbif.org/species/8373079
subclass of: Restriction
  on property: disease has feature
  some values from: punctured and sunken cappings
subclass of: Restriction
  on property: disease has feature
  some values from: ropiness of larval remains
subclass of: Restriction
  on property: disease has feature
  some values from: brittle scale
subclass of: Restriction
  on property: disease has feature
  some values from: scattered brood
IAO_0000115: For the purposes of the Terrestrial Code, American foulbrood is a disease of the larval and pupal stages of honey bees (species of the genus Apis) caused by Paenibacillus larvae (P. larvae), which is widely distributed. P. larvae is a bacterium that can produce over one billion spores in each infected larva. The spores are very long-living and extremely resistant to heat and chemical agents, and only the spores are capable of inducing the disease.
IAO_0000117: Michael Rubinigg
IAO_0000118: Amerikanische Faulbrut @de
IAO_0000118: Bösartige Faulbrut @de
IAO_0000118: american foulbrood
IAO_0000118: amerikaans vuilbroed @nl
IAO_0000118: amerikansk bipest @da
IAO_0000118: amerikansk yngelråte @no
IAO_0000118: amerikansk yngelröta @sv
IAO_0000118: cria pútrida americana @pt
IAO_0000118: elakartad yngelröta @sv
IAO_0000118: kwaadaardig vuilbroed @nl
IAO_0000118: locă americană @ro
IAO_0000118: loque americana @es
IAO_0000118: loque américaine @fr
IAO_0000118: lukket yngelråte @no
IAO_0000118: nymfpest @sv
IAO_0000118: ondartet bipest @da
IAO_0000118: peste americana @it
id: EUPH:117

Axiom
annotated source: American foulbrood of honey bees (AFB)
annotated property: IAO_0000115
annotated target: For the purposes of the Terrestrial Code, American foulbrood is a disease of the larval and pupal stages of honey bees (species of the genus Apis) caused by Paenibacillus larvae (P. larvae), which is widely distributed. P. larvae is a bacterium that can produce over one billion spores in each infected larva. The spores are very long-living and extremely resistant to heat and chemical agents, and only the spores are capable of inducing the disease.
has db xref: ISBN:978-92-95115-40-8

beekeeping equipment
type: Class
subclass of: object in beekeeping
IAO_0000115: Beekeeping equipment is whatever a person, group, or thing is equipped with. All special things needed for some purpose (supplies, furnishings, apparatus, etc.) applied to beekeeping.
IAO_0000117: Michael Rubinigg
IAO_0000118: Bienengeräte @de
IAO_0000118: Imkereigeräte @de
IAO_0000118: attrezzo apistici @it
IAO_0000118: beekeeping appliances
IAO_0000118: beekeeping equipment
IAO_0000118: biavlsmateriel @da
IAO_0000118: bijengereedschap @nl
IAO_0000118: biodlingsredskap @sv
IAO_0000118: biredskap @no
IAO_0000118: birøkterartikler @no
IAO_0000118: equipamento apícola @pt
IAO_0000118: equipo apícola @es
IAO_0000118: inventar apicol @ro
IAO_0000118: material apícola @es
IAO_0000118: materiale apistico @it
IAO_0000118: matériel apicole @fr
IAO_0000118: utensilio apícola @pt
IAO_0000118: utilaj apicol @ro
id: EUPH:1170

honey bottling machine
type: Class
subclass of: honey processing equipment
subclass of: Restriction
  on property: involved in
  some values from: honey processing
IAO_0000115: A machine used to pump, measure, and dispense honey or creamed honey into jars.
IAO_0000117: Michael Rubinigg
IAO_0000118: Honigabfüllmaschine @de
IAO_0000118: honey bottling machine
id: EUPH:1171

honey bottling tank
type: Class
subclass of: honey processing equipment
subclass of: Restriction
  on property: involved in
  some values from: honey processing
IAO_0000115: Any vessel used for bottling of honey.
IAO_0000117: Michael Rubinigg
IAO_0000118: Abfülltopf @de
IAO_0000118: honey bottling tank
id: EUPH:1172

material quality
type: Class
subclass of: quality in engineering
IAO_0000115: A relation between a material entity c and a portion of matter c1 such that c1 constitutes the matter of c.
IAO_0000117: Michael Rubinigg
IAO_0000118: Rohmaterial @de
IAO_0000118: raw material
id: EUPH:1173

lid
type: Class
subclass of: fiat object part in engineering
subclass of: Restriction
  on property: part of
  some values from: honey bottling tank
IAO_0000115: a movable cover, hinged or unattaachhed, as for a box, trunk, pot, etc.; top
IAO_0000117: Michael Rubinigg
IAO_0000118: Deckel @de
IAO_0000118: lid
id: EUPH:1174

lid secured with locking-lever ring clamp
type: Class
subclass of: lid
IAO_0000115: A lid secured with a belt-like fastening device, holding it tightly on a tank.
IAO_0000117: Michael Rubinigg
IAO_0000118: Deckel mit Spannring @de
IAO_0000118: lid secured with locking-lever ring clamp
id: EUPH:1175

lid secured with clasps
type: Class
subclass of: lid
IAO_0000115: A lid secured with a fastening device attached to the tank, holding the lid tightly on the tank.
IAO_0000117: Michael Rubinigg
IAO_0000118: Deckel mit Spannverschluss @de
IAO_0000118: lid secured with clasps
id: EUPH:1176

stainless steel
type: Class
subclass of: metal
IAO_0000115: Made of steel that is immune to rust and corrosion.
IAO_0000117: Michael Rubinigg
IAO_0000118: Edelstahl @de
IAO_0000118: stainless steel
id: EUPH:1177

outlet valve
type: Class
subclass of: fiat object part in engineering
subclass of: Restriction
  on property: part of
  some values from: honey bottling tank
IAO_0000115: A device used to regulate the outward flow of a fluid by opening, closing, or partially obstructing the passageway.
IAO_0000117: Michael Rubinigg
IAO_0000118: Hahn @de
IAO_0000118: outlet valve
id: EUPH:1178

plastic
type: Class
subclass of: material quality
IAO_0000115: Made of or consisting of any of various synthetically produced compounds made by polymerization.
IAO_0000117: Michael Rubinigg
IAO_0000118: Kunststoff @de
IAO_0000118: plastic
id: EUPH:1179

European foulbrood of honey bees (EFB)
type: Class
subclass of: bacterial disease
subclass of: Restriction
  on property: disposition of
  some values from: brood
subclass of: Restriction
  on property: disease has infectious agent
  some values from: https://www.gbif.org/species/8110633
subclass of: Restriction
  on property: disease has feature
  some values from: rubbery scale
IAO_0000115: For the purposes of the Terrestrial Code, European foulbrood is a disease of the larval and pupal stages of honey bees (species of the genus Apis), caused by Melissococcus plutonius (M. plutonius), a non-sporulating bacterium, which is widely distributed. Subclinical infections are common and require laboratory diagnosis. Infection remains enzootic because of mechanical contamination of the honeycombs. Recurrences of disease can therefore be expected in subsequent years.
IAO_0000117: Michael Rubinigg
IAO_0000118: European foulbrood
IAO_0000118: Europees vuilbroed @nl
IAO_0000118: Europäische Faulbrut @de
IAO_0000118: Sauerbrut @de
IAO_0000118: cria pútrida europeia @pt
IAO_0000118: europeisk yngelrate @no
IAO_0000118: europeisk yngelröta @sv
IAO_0000118: europæiske bipest @da
IAO_0000118: gutartige Faulbrut @de
IAO_0000118: larvpest @sv
IAO_0000118: locă europeană @ro
IAO_0000118: loque europea @es
IAO_0000118: loque europeia @pt
IAO_0000118: loque européenne @fr
IAO_0000118: peste europea @it
IAO_0000118: peste europeia @pt
IAO_0000118: zuurbroed @nl
IAO_0000118: åben bipest @da
IAO_0000118: åpen yngelråte @no
id: EUPH:118

Axiom
annotated source: European foulbrood of honey bees (EFB)
annotated property: IAO_0000115
annotated target: For the purposes of the Terrestrial Code, European foulbrood is a disease of the larval and pupal stages of honey bees (species of the genus Apis), caused by Melissococcus plutonius (M. plutonius), a non-sporulating bacterium, which is widely distributed. Subclinical infections are common and require laboratory diagnosis. Infection remains enzootic because of mechanical contamination of the honeycombs. Recurrences of disease can therefore be expected in subsequent years.
has db xref: ISBN:978-92-95115-40-8

additional
type: Class
subclass of: https://w3id.org/euph/8149
IAO_0000115: added; more; extra
IAO_0000117: Michael Rubinigg
IAO_0000118: additional
IAO_0000118: zusätzlich @de
id: EUPH:1180

Axiom
annotated source: additional
annotated property: IAO_0000115
annotated target: added; more; extra
has db xref: ISBN:0-13-947169-3

honey bottling tank with sloping floor
type: Class
subclass of: honey bottling tank
IAO_0000115: A honey bottling tank with a sloping floor enabling the tank to be completely emptied without tilting it.
IAO_0000117: Michael Rubinigg
IAO_0000118: Abfülltopf mit Schrägboden @de
IAO_0000118: honey bottling tank with sloping floor
id: EUPH:1181

loose lid
type: Class
subclass of: lid
IAO_0000115: A lid not secured with any device that would hold it tightly on the tank.
IAO_0000117: Michael Rubinigg
IAO_0000118: Auflagedeckel @de
IAO_0000118: loose lid
id: EUPH:1182

sieve
type: Class
subclass of: general hive product processing equipment
IAO_0000115: A utensil having many small meshed or perforated openings, used to strain solids from liquids, to separate fine particles of loose matter from coarser ones, etc; sifter; strainer
IAO_0000117: Michael Rubinigg
IAO_0000118: Sieb @de
IAO_0000118: sieve
id: EUPH:1183

Axiom
annotated source: sieve
annotated property: IAO_0000115
annotated target: A utensil having many small meshed or perforated openings, used to strain solids from liquids, to separate fine particles of loose matter from coarser ones, etc; sifter; strainer
has db xref: ISBN:0-13-947169-3

double sieve
type: Class
subclass of: honey processing equipment
subclass of: Restriction
  on property: involved in
  some values from: honey processing
IAO_0000115: Two sieves that are inserted into each other, the upper sieve being coarse and the lower sieve fine. It is used to remove organic and inorganic foreign materials from honey.
IAO_0000117: Michael Rubinigg
IAO_0000118: Doppelsieb @de
IAO_0000118: double sieve
id: EUPH:1184

cooling chamber
type: Class
subclass of: general beekeeping equipment
IAO_0000115: A room in which the temperature is kept below ambient temperature, typically below 12°C.
IAO_0000117: Michael Rubinigg
IAO_0000118: Kühlraum @de
IAO_0000118: cooling chamber
id: EUPH:1185

hive management equipment
type: Class
subclass of: beekeeping equipment
IAO_0000115: Hive management equipment is any beekeeping equipment used for hive management.
IAO_0000117: Michael Rubinigg
IAO_0000118: Geräte für die Arbeit am Bienenstock @de
IAO_0000118: hive management equipment
id: EUPH:1186

automatic bee sweeper
type: Class
subclass of: hive management equipment
subclass of: Restriction
  on property: involved in
  some values from: hive management
IAO_0000115: A machine used to remove bees from frames with the help of rotating bristles into container placed below the bristles. Used for creating nucs or package bees.
IAO_0000117: Michael Rubinigg
IAO_0000118: Abkehrmaschine @de
IAO_0000118: automatic bee sweeper
id: EUPH:1187

metal
type: Class
subclass of: material quality
IAO_0000115: Made of metal.
IAO_0000117: Michael Rubinigg
IAO_0000118: Metall @de
IAO_0000118: metaal @nl
IAO_0000118: metal
IAO_0000118: metallo @it
IAO_0000118: métal @fr
id: EUPH:1188

beekeeping vehicle
type: Class
subclass of: general beekeeping equipment
IAO_0000115: Any kind of motor powered or unpowered vehicle used for transporting beekeeping equipment or beehives.
IAO_0000117: Michael Rubinigg
IAO_0000118: Imkereifahrzeug @de
IAO_0000118: beekeeping vehicle
id: EUPH:1189

sacbrood disease of honey bees
type: Class
subclass of: viral disease
subclass of: Restriction
  on property: disposition of
  some values from: brood
subclass of: Restriction
  on property: disease has infectious agent
  some values from: Sackbrood Virus (SBV)
IAO_0000115: Sacbrood disease of honey bees is a disease of the larval stages of honey bees (Apis mellifera) caused by the Sackbrood Virus (SBV).
IAO_0000117: Michael Rubinigg
IAO_0000118: Sackbrut @de
IAO_0000118: couvain sacciforme @fr
IAO_0000118: covata a sacco @it
IAO_0000118: cria ensacada @pt
IAO_0000118: criação saciforme @pt
IAO_0000118: cría sacciforme @es
IAO_0000118: pickled brood
IAO_0000118: pollo en saco @es
IAO_0000118: pollo sacciforme @es
IAO_0000118: puiet în sac @ro
IAO_0000118: sac brood
IAO_0000118: sekkyngel @no
IAO_0000118: säckyngel @sv
IAO_0000118: sækyngel @da
IAO_0000118: zakbroed @nl
id: EUPH:119

Axiom
annotated source: sacbrood disease of honey bees
annotated property: IAO_0000115
annotated target: Sacbrood disease of honey bees is a disease of the larval stages of honey bees (Apis mellifera) caused by the Sackbrood Virus (SBV).
has db xref: ISBN:0-936028-10-6

trailer
type: Class
subclass of: beekeeping vehicle component
subclass of: Restriction
  on property: connected to
  some values from: commercial vehicle
IAO_0000115: An unpowered vehicle towed by a powered vehicle, which is commonly used for the transport of goods and materials, in particular beehives.
IAO_0000117: Michael Rubinigg
IAO_0000118: Anhänger @de
IAO_0000118: trailer
id: EUPH:1190

migratory beekeeping
type: Class
subclass of: apiary management
IAO_0000115: Migratory beekeeping is a hive management practice which involves the transport of honey bee colonies for the purpose of effectively exploiting nectar or honeydew sources or for pollination.
IAO_0000117: Michael Rubinigg
IAO_0000118: Wanderbienenzucht @de
IAO_0000118: Wanderimkerei @de
IAO_0000118: apicoltura nomade @it
IAO_0000118: apicultura ambulante @es
IAO_0000118: apicultura pastoral @es
IAO_0000118: apiculture pastorale @fr
IAO_0000118: migratory beekeeping
IAO_0000118: reizen net bijen @nl
IAO_0000118: transhumance @fr
IAO_0000118: transhumancia @es
IAO_0000118: vandrebiavl @da
IAO_0000118: vandrebirøkt @no
IAO_0000118: vandringsbiskötsel @sv
id: EUPH:1191

processed hive product
type: Class
subclass of: hive product
IAO_0000115: A processed hive product is a hive product that has been processed by beekeepers or by the food industry.
IAO_0000117: Michael Rubinigg
IAO_0000118: processed hive product
IAO_0000118: verarbeitetes Bienenprodukt @de
id: EUPH:1192

primary hive product
type: Class
subclass of: hive product
IAO_0000115: A primary hive product is a hive product that has been harvested by beekeepers but not undergone substantial further processing by beekeepers or by the food industry.
IAO_0000117: Michael Rubinigg
IAO_0000118: primary hive product
IAO_0000118: primäres Bienenprodukt @de
id: EUPH:1194

mead processing equipment
type: Class
subclass of: hive product processing equipment
IAO_0000115: Any equipment necessary for the production of mead.
IAO_0000117: Michael Rubinigg
IAO_0000118: Metproduktionsgerät @de
IAO_0000118: mead production equipment
id: EUPH:1195

fermentation tank
type: Class
subclass of: mead processing equipment
subclass of: Restriction
  on property: involved in
  some values from: mead processing
IAO_0000115: A vessel of any size, usually made of stainless steel, used to produce alcohol from honey diluted with water with the aid of microorganisma, mainkly yeasts.
IAO_0000117: Michael Rubinigg
IAO_0000118: Gärtank @de
IAO_0000118: fermentation tank
id: EUPH:1196

filtration equipment
type: Class
subclass of: mead processing equipment
subclass of: Restriction
  on property: involved in
  some values from: mead processing
IAO_0000115: Any equipment used to remove particles from fermentated mead in order to achieve the desired texture, taste, consistency and stability of the beverage.
IAO_0000117: Michael Rubinigg
IAO_0000118: Filteranlage @de
IAO_0000118: filtration equipment
id: EUPH:1197

pump
type: Class
subclass of: general hive product processing equipment
IAO_0000115: Any device that moves fluids by mechanical action.
IAO_0000117: Michael Rubinigg
IAO_0000118: Pumpe @de
IAO_0000118: pomp @nl
IAO_0000118: pompa @it
IAO_0000118: pompe @fr
IAO_0000118: pump
id: EUPH:1198

bee blower
type: Class
subclass of: honey harvesting equipment
subclass of: Restriction
  on property: involved in
  some values from: honey harvesting
IAO_0000115: A machine used to remove bees from honey supers with the help of a motor-driven fan. Used for honey harvest.
IAO_0000117: Michael Rubinigg
IAO_0000118: Abblasgerät @de
IAO_0000118: Bee Blower @de
IAO_0000118: bee blower
id: EUPH:1199

foundation
type: Class
subclass of: frame component
subclass of: Restriction
  on property: target participant in
  some values from: https://w3id.org/euph/8157
IAO_0000115: A foundation is a thin rectangular sheets of beeswax or other material imprinted with a hexagonal cell pattern, which serves as a basis on which honey bees build their comb.
IAO_0000117: Michael Rubinigg
IAO_0000118: Kunstwabe @de
IAO_0000118: Mittelwand @de
IAO_0000118: byggevokstavle @no
IAO_0000118: cera alveolada @pt
IAO_0000118: cera estampada @es
IAO_0000118: cera moldada @pt
IAO_0000118: cire gaufrée @fr
IAO_0000118: comb foundation
IAO_0000118: fagure artificial @ro
IAO_0000118: feuille de cire gaufrée @fr
IAO_0000118: foaie de fagure @ro
IAO_0000118: foglio cereo @it
IAO_0000118: foundation
IAO_0000118: hoja de cera estampada @es
IAO_0000118: kakmellanvägg @sv
IAO_0000118: kunstraat @nl
IAO_0000118: kunsttavle @da
id: EUPH:12

chronic bee paralysis disease of honey bees
type: Class
subclass of: viral disease
subclass of: Restriction
  on property: disposition of
  some values from: adult honey bee
subclass of: Restriction
  on property: disease has infectious agent
  some values from: Chronic Bee Paralysis Virus (CBPV)
IAO_0000115: Chronic bee paralysis disease of honey bees is a disease of adult honey bees (Apis mellifera) caused by the Chronic Bee Paralysis Virus (CBPV).
IAO_0000117: Michael Rubinigg
IAO_0000118: Chronic bee paralysis disease of honey bees
id: EUPH:120

Axiom
annotated source: chronic bee paralysis disease of honey bees
annotated property: IAO_0000115
annotated target: Chronic bee paralysis disease of honey bees is a disease of adult honey bees (Apis mellifera) caused by the Chronic Bee Paralysis Virus (CBPV).
has db xref: ISBN:0-936028-10-6

queen breeding and rearing equipment
type: Class
subclass of: beekeeping equipment
subclass of: Restriction
  on property: involved in
  some values from: mating
subclass of: Restriction
  on property: involved in
  some values from: https://w3id.org/euph/7927
subclass of: Restriction
  on property: involved in
  some values from: https://w3id.org/euph/839
IAO_0000115: Queen breeding and rearing equipment is any beekeeping equipment used for the artificial selection and reproduction of honey bee queens.
IAO_0000117: Michael Rubinigg
IAO_0000118: Gerät für die Zucht und Aufzucht von Königinnen @de
IAO_0000118: queen breeding and rearing equipment
id: EUPH:1200

queen insemination apparatus
type: Class
subclass of: queen breeding and rearing equipment
subclass of: Restriction
  on property: functionally related to
  some values from: https://w3id.org/euph/7927
IAO_0000115: Any aparatus used to collect semen from drones and to inject this semen into the vagina of honey bee queens.
IAO_0000117: Michael Rubinigg
IAO_0000118: Besamungsgerät @de
IAO_0000118: queen insemination apparatus
id: EUPH:1201

queen cell incubator
type: Class
subclass of: queen breeding and rearing equipment
IAO_0000115: Any device used to store capped queen cells at approximately 34.5 °C and 70% relative humidity until adult queens hatch from the cell.
IAO_0000117: Michael Rubinigg
IAO_0000118: Brutapparat @de
IAO_0000118: Brutschrank @de
IAO_0000118: broedstoof @nl
IAO_0000118: incubadora @es
IAO_0000118: incubator
IAO_0000118: incubatore @it
IAO_0000118: incubatrice @it
IAO_0000118: klekkeskap @no
IAO_0000118: kläckningsapparat @sv
IAO_0000118: kläckningsskåp @sv
IAO_0000118: klækkeskab @da
IAO_0000118: queen cell incubator
IAO_0000118: rugemaskin @no
IAO_0000118: étuve @fr
id: EUPH:1202

gravity clarifier
type: Class
subclass of: honey processing equipment
subclass of: Restriction
  on property: involved in
  some values from: honey processing
IAO_0000115: A device that pre-filters honey by slowing down the flow rate and allowing organic and inorganic foreign matter to settle or rise through the placement of multiple baffles at different heights.
IAO_0000117: Michael Rubinigg
IAO_0000118: Honigsumpf @de
IAO_0000118: gravity clarifier
id: EUPH:1203

beekeeping building
type: Class
subclass of: fiat object part in beekeeping
subclass of: Restriction
  on property: part of
  some values from: beekeeping establishment
IAO_0000115: A beekeeping building is any edifice used for the purpose of beekeeping, for example keeping beehives, storing beekeeping equipment or processing hive products.
IAO_0000117: Michael Rubinigg
IAO_0000118: beekeeping building
IAO_0000118: imkerliches Wirtschaftsgebäude @de
id: EUPH:1204

honey house
type: Class
subclass of: beekeeping building
IAO_0000115: A honey house is a beekeeping building to extract and process honey and other hive products.
IAO_0000117: Michael Rubinigg
IAO_0000118: Schleuderraum @de
IAO_0000118: arbeidsrom i bigården @no
IAO_0000118: casa de extracção de mel @pt
IAO_0000118: centrala fermei apicole @ro
IAO_0000118: clădire anexă a stupinei @ro
IAO_0000118: honey house
IAO_0000118: honinghuisje @nl
IAO_0000118: laboratorio per la smelatura @it
IAO_0000118: melaria @pt
IAO_0000118: mielería @es
IAO_0000118: miellerie @fr
IAO_0000118: obrador @es
IAO_0000118: slingerruimte @nl
IAO_0000118: slungningsrum @sv
IAO_0000118: slyngerom @no
IAO_0000118: slyngerum @da
id: EUPH:1205

Axiom
annotated source: honey house
annotated property: IAO_0000115
annotated target: A honey house is a beekeeping building to extract and process honey and other hive products.
has db xref: ISBN:1-878075-65-4

hive product processing equipment
type: Class
subclass of: beekeeping equipment
IAO_0000115: Hive product processing equipment is any beekeeping equipment used to process hive products by beekeepers or the food processing industry.
IAO_0000117: Michael Rubinigg
IAO_0000118: Gerät für die Verarbeitung von Bienenprodukten @de
IAO_0000118: hive product processing equipment
id: EUPH:1206

beverage filling machine
type: Class
subclass of: mead processing equipment
subclass of: Restriction
  on property: involved in
  some values from: mead processing
IAO_0000115: Any machine used to fill beverages into botles.
IAO_0000117: Michael Rubinigg
IAO_0000118: Getränkeabfüllanlage @de
IAO_0000118: beverage filling machine
id: EUPH:1207

hive product processing furniture
type: Class
subclass of: general hive product processing equipment
IAO_0000115: Any furniture used for processing hive products in accordance with the legal requirements for food processing.
IAO_0000117: Michael Rubinigg
IAO_0000118: Mobiliar für die Verarbeitung von Bienenprodukten @de
IAO_0000118: hive product processing furniture
id: EUPH:1208

calibratable scale
type: Class
subclass of: general hive product processing equipment
IAO_0000115: A weighing balance whose accuracy may be adjusted to a legally recognised level by an authorised institution.
IAO_0000117: Michael Rubinigg
IAO_0000118: calibratable scale
IAO_0000118: eichfähige Waage @de
id: EUPH:1209

chalkbrood disease of honey bees
type: Class
subclass of: fungal disease
subclass of: Restriction
  on property: disposition of
  some values from: brood
subclass of: Restriction
  on property: disease has infectious agent
  some values from: https://www.gbif.org/species/2595786
subclass of: Restriction
  on property: disease has feature
  some values from: white coloured mummified larvae
subclass of: Restriction
  on property: disease has feature
  some values from: grey to black coloured mummified larvae
IAO_0000115: Chalkbrood disease of honey bees is a disease of the larval and pupal stages of honey bees (Apis mellifera) caused by Ascosphaera apis.
IAO_0000117: Michael Rubinigg
IAO_0000118: Kalkbrut @de
IAO_0000118: chalk brood
IAO_0000118: couvain calcifié @fr
IAO_0000118: couvain plâtré @fr
IAO_0000118: covata calcificata @it
IAO_0000118: cria calcificada @pt
IAO_0000118: cria-giz @pt
IAO_0000118: criação calcificada @pt
IAO_0000118: criação engessada @pt
IAO_0000118: cría calcificada @es
IAO_0000118: cría yesificada @es
IAO_0000118: kalkbroed @nl
IAO_0000118: kalkyngel @da
IAO_0000118: pollo calcificado @es
IAO_0000118: pollo yesificado @es
id: EUPH:121

Axiom
annotated source: chalkbrood disease of honey bees
annotated property: IAO_0000115
annotated target: Chalkbrood disease of honey bees is a disease of the larval and pupal stages of honey bees (Apis mellifera) caused by Ascosphaera apis.
has db xref: ISBN:0-936028-10-6

hive remote sensing system
type: Class
subclass of: hive management equipment
subclass of: Restriction
  on property: involved in
  some values from: hive management
IAO_0000115: Any equipment used for the acquisition of information about a beehive at a distance, without phsically opening the hive.
IAO_0000117: Michael Rubinigg
IAO_0000118: elektronisches System zur Trachtbeobachtung @de
IAO_0000118: hive remote sensing system
id: EUPH:1210

hive scale
type: Class
subclass of: hive management equipment
subclass of: Restriction
  on property: involved in
  some values from: hive management
IAO_0000115: A weighing balance used to measure the mass of a beehive.
IAO_0000117: Michael Rubinigg
IAO_0000118: Stockwaage @de
IAO_0000118: hive scale
id: EUPH:1211

remote hive scale
type: Class
subclass of: hive remote sensing system
IAO_0000115: A hive scale used to measure the mass from a distance without physically visiting the apiary.
IAO_0000117: Michael Rubinigg
IAO_0000118: Bienenstockwaage @de
IAO_0000118: Funk-Stockwaage @de
IAO_0000118: balance connectée pour ruche @fr
IAO_0000118: bilancia per arnia wireless @it
IAO_0000118: remote hive scale
id: EUPH:1212

auxiliary hive scale
type: Class
subclass of: remote hive scale
IAO_0000115: A hive scale that does not send the data directly but transmits it to a scale placed at the same apiary with a sending unit.
IAO_0000117: Michael Rubinigg
IAO_0000118: Nebenwaage @de
IAO_0000118: auxiliary hive scale
id: EUPH:1213

honey bee adult abdominal segment
type: Class
subclass of: insect adult abdominal segment
IAO_0000115: A honey bee adult abdominal segment is an abdominal segment in adult honey bees.
IAO_0000117: Michael Rubinigg
IAO_0000118: Abdominalsegment einer erwachsenen Honigbiene @de
IAO_0000118: honey bee adult abdominal segment
id: EUPH:1218

stonebrood disease of honey bees
type: Class
subclass of: fungal disease
subclass of: Restriction
  on property: disposition of
  some values from: brood
subclass of: Restriction
  on property: disease has infectious agent
  some values from: https://www.gbif.org/species/5259820
IAO_0000115: Stonebrood disease of honey bees is a disease of the larval and pupal stages of honey bees (Apis mellifera) caused by Aspergillus flavus.
IAO_0000117: Michael Rubinigg
IAO_0000118: Steinbrut @de
IAO_0000118: couvain pétrifié @fr
IAO_0000118: covata pietrificata @it
IAO_0000118: cria dura @pt
IAO_0000118: cria petrificada @pt
IAO_0000118: cria-pedra @pt
IAO_0000118: criação petrificada @pt
IAO_0000118: cría petrificada @es
IAO_0000118: pollo petrificado @es
IAO_0000118: puiet pietrificat @ro
IAO_0000118: steenbroed @nl
IAO_0000118: steinyngel @no
IAO_0000118: stenyngel @da
IAO_0000118: stonebrood
id: EUPH:122

Axiom
annotated source: stonebrood disease of honey bees
annotated property: IAO_0000115
annotated target: Stonebrood disease of honey bees is a disease of the larval and pupal stages of honey bees (Apis mellifera) caused by Aspergillus flavus.
has db xref: ISBN:0-936028-10-6

secretory function
type: Class
subclass of: physiological function
subclass of: Restriction
  on property: function of
  some values from: gland
IAO_0000115: The controlled release of a substance by a cell or a tissue.
IAO_0000117: Michael Rubinigg
IAO_0000118: Absonderung @de
IAO_0000118: Ausscheidung @de
IAO_0000118: afscheiding @nl
IAO_0000118: at secernere @da
IAO_0000118: avsöndring @sv
IAO_0000118: secreción @es
IAO_0000118: secretion
IAO_0000118: secretory function
IAO_0000118: secrezione @it
IAO_0000118: secreção @pt
IAO_0000118: secreție @ro
IAO_0000118: sekresjon @no
IAO_0000118: sekretion @da
IAO_0000118: sécrétion @fr
IAO_0000118: utskillelse @no
IAO_0000118: utsöndring @sv
id: EUPH:1220

Axiom
annotated source: secretory function
annotated property: IAO_0000115
annotated target: The controlled release of a substance by a cell or a tissue.
has db xref: 10.1093/nar/gkaa1113

secretion
type: Class
subclass of: organism substance
subclass of: Restriction
  on property: output of
  some values from: secrete
IAO_0000115: A portion of organism substance.
IAO_0000117: Michael Rubinigg
IAO_0000118: Ausscheidung @de
IAO_0000118: Sekret @de
IAO_0000118: afscheidingsproduct @nl
IAO_0000118: avsöndring @sv
IAO_0000118: produs de secreție @ro
IAO_0000118: secreción @es
IAO_0000118: secretion
IAO_0000118: secreto @it
IAO_0000118: secreção @pt
IAO_0000118: secreție @ro
IAO_0000118: sekret @da
IAO_0000118: sécrétion @fr
IAO_0000118: utsöndring @sv
id: EUPH:1222

nosemosis of honey bees
type: Class
subclass of: protozoan disease
subclass of: Restriction
  on property: member of
  some values from: honey bee disease
subclass of: Restriction
  on property: disease has feature
  some values from: symptom on colonies
IAO_0000115: Nosemosis of honey bees is a disease of adult honey bees (Apis mellifera) caused by different species of the genus Nosema (Nosema apis and Nosema ceranae).
IAO_0000117: Michael Rubinigg
IAO_0000118: Nosema disease
IAO_0000118: Nosemaseuche @de
IAO_0000118: Nosemose @de
IAO_0000118: nosemasjuka @sv
IAO_0000118: nosemasjuke @no
IAO_0000118: nosemasyge @da
IAO_0000118: nosemaziekte @nl
IAO_0000118: nosemiasi @it
IAO_0000118: nosemiasis @es
IAO_0000118: nosemiosis @es
IAO_0000118: nosemose @pt
IAO_0000118: nosemosis of honey bees
IAO_0000118: nosemoză @ro
IAO_0000118: nosemíase @pt
IAO_0000118: nosémose @fr
id: EUPH:123

Axiom
annotated source: nosemosis of honey bees
annotated property: IAO_0000115
annotated target: Nosemosis of honey bees is a disease of adult honey bees (Apis mellifera) caused by different species of the genus Nosema (Nosema apis and Nosema ceranae).
has db xref: ISBN:978-88-470-5649-7

veterinary medicine quantity
type: Class
subclass of: quality in veterinary medicine
IAO_0000115: A quantity of a veterinary entity that exists through action of continuants in the veterinary medicine domain in relation to other entities.
IAO_0000117: Michael Rubinigg
IAO_0000118: veterinary medicine quantity
id: EUPH:1231

unit of measure in veterinary medicine
type: Class
subclass of: information content entity in veterinary medicine
IAO_0000115: A unit of measure in veterinary medicine is a a label that is part of a measurement datum and denotes a unit of measure that is specific to the veterinary medicine domain.
IAO_0000117: Michael Rubinigg
IAO_0000118: unit of measure in veterinary medicine
id: EUPH:1232

information content entity in chemistry
type: Class
subclass of: generically dependent continuant in chemistry
IAO_0000115: An information content entity in chemistry is a generically dependent continuant in the chemistry domain that is about some thing.
IAO_0000117: Michael Rubinigg
IAO_0000118: information content entity in chemistry
id: EUPH:1234

Axiom
annotated source: information content entity in chemistry
annotated property: IAO_0000115
annotated target: An information content entity in chemistry is a generically dependent continuant in the chemistry domain that is about some thing.
source: http://purl.obolibrary.org/obo/IAO_0000030

biological quantity
type: Class
subclass of: quality in biology
IAO_0000115: A quantity of a biological entity that exists through action of continuants in the biology domain in relation to other entities.
IAO_0000117: Michael Rubinigg
IAO_0000118: biological quantity
id: EUPH:1235

information content entity in pharmacology
type: Class
subclass of: generically dependent continuant in pharmacology
IAO_0000115: An information content entity in pharmacology is a generically dependent continuant in the pharmacology domain that is about some thing.
IAO_0000117: Michael Rubinigg
IAO_0000118: information content entity in pharmacology
id: EUPH:1236

Axiom
annotated source: information content entity in pharmacology
annotated property: IAO_0000115
annotated target: An information content entity in pharmacology is a generically dependent continuant in the pharmacology domain that is about some thing.
source: http://purl.obolibrary.org/obo/IAO_0000030

identifier of veterinary entities
type: Class
subclass of: quality in veterinary medicine
IAO_0000115: An identifier of veterinary entities is an identifier that is specific for an entity in the veterinary medicine domain.
IAO_0000117: Michael Rubinigg
IAO_0000118: identifier of veterinary entities
id: EUPH:1237

unit of measure in beekeeping
type: Class
subclass of: information content entity in beekeeping
IAO_0000115: A unit of measure or classification in beekeeping is a label that is part of a measurement datum, which is specific to the beekeeping domain.
IAO_0000117: Michael Rubinigg
IAO_0000118: unit of measure in beekeeping
id: EUPH:1238

nutrient for animals
type: Class
subclass of: nutrient
IAO_0000115: A nutrient for animals is a nutrient used by animals
IAO_0000117: Michael Rubinigg
IAO_0000118: nutrient for animals
id: EUPH:1239

amoeba disease of honey bees
type: Class
subclass of: protozoan disease
subclass of: Restriction
  on property: disposition of
  some values from: adult honey bee
subclass of: Restriction
  on property: disease has infectious agent
  some values from: https://www.gbif.org/species/206120742
IAO_0000115: Amoeba disease of honey bees is a disease of adult honey bees (Apis mellifera) caused by Malpighamoeba mellificae.
IAO_0000117: Michael Rubinigg
IAO_0000118: Amöbenkrankheit @de
IAO_0000118: Amöbenseuche @de
IAO_0000118: amebiasis @es
IAO_0000118: amebíase @pt
IAO_0000118: amibiase @it
IAO_0000118: amibiază @ro
IAO_0000118: amoeba disease
IAO_0000118: amoebenziekte @nl
IAO_0000118: amöbasjuka @sv
IAO_0000118: amøbesjuke @no
IAO_0000118: amøbesygde @da
id: EUPH:124

Axiom
annotated source: amoeba disease of honey bees
annotated property: IAO_0000115
annotated target: Amoeba disease of honey bees is a disease of adult honey bees (Apis mellifera) caused by Malpighamoeba mellificae.
has db xref: ISBN:0-936028-10-6

taxon-typical population process
type: Class
subclass of: population process
IAO_0000115: A taxon-typical population process is a population process that occurs in a similar fashion in many members of a taxon.
IAO_0000117: Michael Rubinigg
IAO_0000118: taxon-typical population process
id: EUPH:1244

Varroa population growth
type: Class
subclass of: taxon-typical population process
IAO_0000115: Varroa population growth is a process that leads to a change in the number of Varroa mites in a honey bee colony.
IAO_0000117: Michael Rubinigg
IAO_0000118: Varroa population growth
id: EUPH:1245

taxon concept
type: Class
subclass of: data about taxonomy
IAO_0000115: A taxon concept, also referred to as circumscription, is the delimitation of which subordinate taxa are parts of that taxon.
IAO_0000117: Michael Rubinigg
IAO_0000118: circumscription
IAO_0000118: taxon content
id: EUPH:1247

Axiom
annotated source: taxon concept
annotated property: IAO_0000115
annotated target: A taxon concept, also referred to as circumscription, is the delimitation of which subordinate taxa are parts of that taxon.
source: https://en.wikipedia.org/w/index.php

entity in veterinary medicine
type: Class
subclass of: medical sciences
IAO_0000115: An entity in veterinary medicine is an entity in the medical sciences domain that contains all classes related to aspects of pollinators and pollination studied in veterinary medicine, i.e. the [...] prevention and treatment of diseases and injuriess in animals, esp. domestic animals.
IAO_0000117: Michael Rubinigg
IAO_0000118: Veterinärmedizin @de
IAO_0000118: diergeneeskunde @nl
IAO_0000118: medicina veterinaria @it
IAO_0000118: médecine vétérinaire @fr
IAO_0000118: veterinary medicine
id: EUPH:125

Axiom
annotated source: entity in veterinary medicine
annotated property: IAO_0000115
annotated target: An entity in veterinary medicine is an entity in the medical sciences domain that contains all classes related to aspects of pollinators and pollination studied in veterinary medicine, i.e. the [...] prevention and treatment of diseases and injuriess in animals, esp. domestic animals.
source: http://purl.obolibrary.org/obo/BFO_0000001
source: https://ncit.nci.nih.gov/ncitbrowser/pages/home.jsf

publication year
type: Class
subclass of: https://w3id.org/euph/7577
subclass of: Restriction
  on property: towards
  some values from: calendar year
subclass of: Restriction
  on property: quality of
  some values from: document
IAO_0000115: A publication year is the calendar year in which some information content entity has been published.
IAO_0000117: Michael Rubinigg
IAO_0000118: Veröffentlichungsjahr @de
IAO_0000118: publication year
id: EUPH:1251

Axiom
annotated source: publication year
annotated property: IAO_0000115
annotated target: A publication year is the calendar year in which some information content entity has been published.
source: https://www.fao.org/faostat/en/#definitions

nomenclatural detail
type: Class
subclass of: scientific name part
IAO_0000115: A nomenclatural detail of a scientific name is a scientific name part includes formal rules of a scientific name rather than the biological classification.
IAO_0000117: Michael Rubinigg
IAO_0000118: nomenclatural detail
id: EUPH:1252

global biodiversity information facility (GBIF)
type: Class
subclass of: code set of biological entities
IAO_0000115: GBIF—the Global Biodiversity Information Facility—is an international network and data infrastructure funded by the world's governments and aimed at providing anyone, anywhere, open access to data about all types of life on Earth.
IAO_0000117: Michael Rubinigg
IAO_0000118: GBIF
IAO_0000118: Global Biodiversity Information Facility
id: EUPH:1253

Axiom
annotated source: global biodiversity information facility (GBIF)
annotated property: IAO_0000115
annotated target: GBIF—the Global Biodiversity Information Facility—is an international network and data infrastructure funded by the world's governments and aimed at providing anyone, anywhere, open access to data about all types of life on Earth.
source: https://www.gbif.org/

housing condition
type: Class
subclass of: quality in veterinary medicine
IAO_0000115: Housing conditions refer to the physical environment where animals are kept, reared, or housed for production, research, or breeding purposes.
IAO_0000117: Michael Rubinigg
IAO_0000118: animal housing condition
id: EUPH:1256

status of animal
type: Class
subclass of: quality in veterinary medicine
IAO_0000115: A state of an animal is its condition at a particular time.
IAO_0000117: Michael Rubinigg
IAO_0000118: state of animal
id: EUPH:1257

entity in beekeeping
type: Class
subclass of: animal production
subclass of: Restriction
  on property: present in taxon
  some values from: https://www.gbif.org/species/1341976
subclass of: Restriction
  on property: present in taxon
  some values from: https://www.gbif.org/species/1341979
IAO_0000115: An entity in beekeeping is an entity in the animal production domain that has been defined as: the intentional tending of insects of the genus Apis (in particular Apis mellifera and Apis cerana) in artificial nests by humans (Homo sapiens).
IAO_0000117: Michael Rubinigg
IAO_0000118: Bienenzucht @de
IAO_0000118: Imkerei @de
IAO_0000118: albinărit @ro
IAO_0000118: apicoltura @it
IAO_0000118: apicultura @es
IAO_0000118: apiculture
IAO_0000118: apicultură @ro
IAO_0000118: beekeeping
IAO_0000118: biavl @da
IAO_0000118: bijenteelt @nl
IAO_0000118: biodling @sv
IAO_0000118: birøkt @no
IAO_0000118: biskötsel @sv
IAO_0000118: creșterea albinelor @ro
IAO_0000118: imkerij @nl
IAO_0000118: stupărit @ro
id: EUPH:126

Axiom
annotated source: entity in beekeeping
annotated property: IAO_0000115
annotated target: An entity in beekeeping is an entity in the animal production domain that has been defined as: the intentional tending of insects of the genus Apis (in particular Apis mellifera and Apis cerana) in artificial nests by humans (Homo sapiens).
source: http://purl.obolibrary.org/obo/BFO_0000001

honey bee housing condition
type: Class
subclass of: housing condition
subclass of: Restriction
  on property: quality of
  some values from: apiary
subclass of: Restriction
  on property: quality of
  some values from: https://w3id.org/euph/8
IAO_0000115: Honey bee housing condition is a housing condition of a honey bee colony.
IAO_0000117: Michael Rubinigg
IAO_0000118: honey bee housing condition
id: EUPH:1267

ecological function
type: Class
subclass of: function in biology
IAO_0000115: An ecological function is a function in the biology domain that exist by evolution to realise an interaction with the biotic or abiotic environment.
IAO_0000117: Michael Rubinigg
IAO_0000118: ecological function
id: EUPH:1268

physiological function
type: Class
subclass of: function in biology
IAO_0000115: A physiological function is a function in the biology domain that exist by evolution to realise specific processes of living organisms and their parts.
IAO_0000117: Michael Rubinigg
IAO_0000118: physiological function
id: EUPH:1269

ecological role
type: Class
subclass of: role in biology
IAO_0000115: An ecological role is a role in the biology domain that refers to interactions of living organisms with their biotic or abiotic environment.
IAO_0000117: Michael Rubinigg
IAO_0000118: ecological role
id: EUPH:1270

physiological role
type: Class
subclass of: role in biology
IAO_0000115: A physiological role is a role in the biology domain that refers to processes of living organisms and their parts.
IAO_0000117: Michael Rubinigg
IAO_0000118: Implied emission factor for CH4 (Enteric)
id: EUPH:1271

imago
type: Class
subclass of: multicellular organism
IAO_0000115: An imago is an insect in the final stage of its life cycle, in which all organs (typical for the respective species or the respective castes of these species or the respective functionally specialised individuals of these castes) have fully developed and the animal (with the exception of certain castes in certain species) is capable of reproduction.
IAO_0000117: Michael Rubinigg
IAO_0000118: Imago @de
IAO_0000118: Vollkerf @de
IAO_0000118: adult
IAO_0000118: erwachsenes Insekt @de
IAO_0000118: fuldtudviklet insekt @da
IAO_0000118: färdig insekt @sv
IAO_0000118: imago @da
IAO_0000118: immagine @it
IAO_0000118: insecte parfait @fr
IAO_0000118: insecto maturo @pt
IAO_0000118: insecto perfecto @es
IAO_0000118: insecto perfeito @pt
IAO_0000118: insectă perfectă @ro
IAO_0000118: insetto perfetto @it
IAO_0000118: mature insect
IAO_0000118: voksent insekt @no
IAO_0000118: volwassen insect @nl
id: EUPH:1272

temporal polyethism
type: Class
subclass of: one-dimensional temporal region in biology
IAO_0000115: Temporal polyethism is a mechanism of task allocation, and is ubiquitous among eusocial insect colonies.
IAO_0000117: Michael Rubinigg
IAO_0000118: temporal polyethism
id: EUPH:1273

Axiom
annotated source: temporal polyethism
annotated property: IAO_0000115
annotated target: Temporal polyethism is a mechanism of task allocation, and is ubiquitous among eusocial insect colonies.
source: https://en.wikipedia.org/w/index.php#Temporal_polyethism

adult honey bee
type: Class
subclass of: member of honey bee colony
IAO_0000115: An adult honey bee is a member of a honey bee colony that is an adult.
IAO_0000117: Michael Rubinigg
IAO_0000118: adult honey bee
id: EUPH:1275

conditional specification in veterinary medicine
type: Class
subclass of: directive information entity in veterinary medicine
IAO_0000115: A conditional specification in veterinary medicine is a directive information entity in the veterinary medicine domain that specifies what should happen if the trigger condition is fulfilled.
IAO_0000117: Michael Rubinigg
IAO_0000118: conditional specification in veterinary medicine
id: EUPH:1276

Axiom
annotated source: conditional specification in veterinary medicine
annotated property: IAO_0000115
annotated target: A conditional specification in veterinary medicine is a directive information entity in the veterinary medicine domain that specifies what should happen if the trigger condition is fulfilled.
source: conditional specification

independent continuant in geology
type: Class
subclass of: continuant in geology
IAO_0000115: An independent continuant in geology is a continuant in the geology domain that never depends on another entity in any domain for its existence.
IAO_0000117: Michael Rubinigg
IAO_0000118: independent continuant in geology
id: EUPH:1277

Axiom
annotated source: independent continuant in geology
annotated property: IAO_0000115
annotated target: An independent continuant in geology is a continuant in the geology domain that never depends on another entity in any domain for its existence.
source: http://purl.obolibrary.org/obo/BFO_0000004

material entity in geology
type: Class
subclass of: independent continuant in geology
IAO_0000115: A material entity in geology is an independent continuant in the geology domain that always has some portion of matter as a continuant part.
IAO_0000117: Michael Rubinigg
IAO_0000118: material entity in geology
id: EUPH:1278

Axiom
annotated source: material entity in geology
annotated property: IAO_0000115
annotated target: A material entity in geology is an independent continuant in the geology domain that always has some portion of matter as a continuant part.
source: http://purl.obolibrary.org/obo/BFO_0000040

swarming scout bee
type: Class
subclass of: behavioural role
subclass of: Restriction
  on property: role of
  some values from: adult worker bee
subclass of: Restriction
  on property: involved in
  some values from: swarming
IAO_0000115: A swarming scout bee is a worker bee that searches for suitable nesting sites during swarming
IAO_0000117: Michael Rubinigg
IAO_0000118: Kundschafterin @de
IAO_0000118: Quartiermacherin @de
IAO_0000118: Spurbiene @de
IAO_0000118: abelha escoteira @pt
IAO_0000118: abelha exploradora @pt
IAO_0000118: albină cercetașă @ro
IAO_0000118: albină cercetașă în preajma roirii @ro
IAO_0000118: cercetașă @ro
IAO_0000118: esploratrice @it
IAO_0000118: exploradora @es
IAO_0000118: scout bee
IAO_0000118: searcher bee
IAO_0000118: speiderbi @no
IAO_0000118: speurbij @nl
IAO_0000118: sporbi @da
IAO_0000118: spårbi @sv
IAO_0000118: swarming scout bee
IAO_0000118: éclaireuse @fr
id: EUPH:1279

Axiom
annotated source: swarming scout bee
annotated property: IAO_0000115
annotated target: A swarming scout bee is a worker bee that searches for suitable nesting sites during swarming
has db xref: ISBN:1-878075-65-4

HS12 code
type: Class
subclass of: identifier of economical entities
subclass of: Restriction
  on property: quality of
  some values from: HS nomenclature 2012
IAO_0000115: A HS12 code is a code assigned to traded products in the HS nomenclature 2012.
IAO_0000117: Michael Rubinigg
IAO_0000118: HS12 code
id: EUPH:1282

Axiom
annotated source: HS12 code
annotated property: IAO_0000115
annotated target: A HS12 code is a code assigned to traded products in the HS nomenclature 2012.
source: https://www.wcoomd.org/en/topics/nomenclature/instrument-and-tools/hs_nomenclature_previous_editions/hs_nomenclature_table_2007.aspx

spring management
type: Class
subclass of: hive management
IAO_0000115: Spring management is the sum of all activities carried out on a honey bee colony during the first hive inspection after wintering of the colonies.
IAO_0000117: Michael Rubinigg
IAO_0000118: Auswinterung @de
IAO_0000118: Frühjahrsbehandlung @de
IAO_0000118: cure primaverili @it
IAO_0000118: forårsbehandeling @da
IAO_0000118: lucrări de primăvară @ro
IAO_0000118: manipulación de primavera @es
IAO_0000118: manipulation de printemps @fr
IAO_0000118: spring management
IAO_0000118: trabalhos da primavera @pt
IAO_0000118: utvintring @no
IAO_0000118: voorjaarsbehandeling @nl
IAO_0000118: vårbehandling @no
id: EUPH:1287

wintering
type: Class
subclass of: hive management
subclass of: Restriction
  on property: ends with
  some values from: winter loss
subclass of: Restriction
  on property: precedes
  some values from: spring management
IAO_0000115: Wintering is the sum of all activities carried out on a honey bee colony to enable or facilitate their survival during winter.
IAO_0000117: Michael Rubinigg
IAO_0000118: a ierna @ro
IAO_0000118: at overvintre @da
IAO_0000118: att övervintra @sv
IAO_0000118: hibernar @pt
IAO_0000118: hiverner @fr
IAO_0000118: invernar @es
IAO_0000118: overwinteren @nl
IAO_0000118: svernare @it
IAO_0000118: to winter
IAO_0000118: wintering
IAO_0000118: å overvintre @no
IAO_0000118: überwintern @de
id: EUPH:1288

winter loss
type: Class
subclass of: process boundary in beekeeping
IAO_0000115: Winter loss is the death of a honey bee colony during the winter.
IAO_0000117: Michael Rubinigg
IAO_0000118: Winterverlust @de
IAO_0000118: perda invernal @pt
IAO_0000118: perdite invernali @it
IAO_0000118: perte hibernale @fr
IAO_0000118: pierderi în timpul iernării @ro
IAO_0000118: pérdida invernal @es
IAO_0000118: vinterförlust @sv
IAO_0000118: vintertab @da
IAO_0000118: vintertap @no
IAO_0000118: winter loss
IAO_0000118: wintersterfte @nl
IAO_0000118: winterverlies @nl
id: EUPH:1289

process boundary in beekeeping
type: Class
subclass of: occurrent in beekeeping
IAO_0000115: A process boundary in veterinary beekeeping is an occurrent entity in the beekeeping domain that inhabits the universal spatiotemporal region, but has no proper temporal part.
IAO_0000117: Michael Rubinigg
IAO_0000118: process boundary in beekeeping
id: EUPH:1290

Axiom
annotated source: process boundary in beekeeping
annotated property: IAO_0000115
annotated target: A process boundary in veterinary beekeeping is an occurrent entity in the beekeeping domain that inhabits the universal spatiotemporal region, but has no proper temporal part.
source: http://purl.obolibrary.org/obo/BFO_0000035

temporal region in biology
type: Class
subclass of: occurrent in biology
IAO_0000115: A temporal region in biology is an occurrent in the biology domain that is a projection of the universal spatiotemporal region.
IAO_0000117: Michael Rubinigg
IAO_0000118: temporal region in biology
id: EUPH:1291

Axiom
annotated source: temporal region in biology
annotated property: IAO_0000115
annotated target: A temporal region in biology is an occurrent in the biology domain that is a projection of the universal spatiotemporal region.
source: http://purl.obolibrary.org/obo/BFO_0000008

zero-dimensional temporal region in biology
type: Class
subclass of: temporal region in biology
IAO_0000115: A zero-dimensional temporal region in biology is a temporal region in the biology domain that no dimension.
IAO_0000117: Michael Rubinigg
IAO_0000118: zero-dimensional temporal region in biology
id: EUPH:1292

Axiom
annotated source: zero-dimensional temporal region in biology
annotated property: IAO_0000115
annotated target: A zero-dimensional temporal region in biology is a temporal region in the biology domain that no dimension.
source: http://purl.obolibrary.org/obo/BFO_0000148

geographical quantity
type: Class
subclass of: quality in geography
IAO_0000115: A quantity of a geographical entity that exists through action of continuants in the geography domain in relation to other entities.
IAO_0000117: Michael Rubinigg
IAO_0000118: geographical quantity
id: EUPH:1294

data about taxonomy
type: Class
subclass of: data item in biology
IAO_0000115: Data about taxonomy is a truthful statement about taxonomic data (e.g. a scientific name, a taxon, or an identification) and is constructed/acquired by a method which reliably tends to produce (approximately) truthful statements.
IAO_0000117: Michael Rubinigg
IAO_0000118: data about taxonomy
id: EUPH:1295

role in pharmacology
type: Class
subclass of: realisable entity in pharmacology
IAO_0000115: A role in pharmacology is a realisable entity in the pharmacology domain that exist because the bearer is in a specific situation.
IAO_0000117: Michael Rubinigg
IAO_0000118: role in pharmacology
id: EUPH:1296

Axiom
annotated source: role in pharmacology
annotated property: IAO_0000115
annotated target: A role in pharmacology is a realisable entity in the pharmacology domain that exist because the bearer is in a specific situation.
source: http://purl.obolibrary.org/obo/BFO_0000023

data item in geography
type: Class
subclass of: information content entity in geography
IAO_0000115: A data item in geography is an information content entity that is intended to be a truthful statement about something in the geography domain and is constructed/acquired by a method which reliably tends to produce (approximately) truthful statements.
IAO_0000117: Michael Rubinigg
IAO_0000118: data item in geography
id: EUPH:1297

Axiom
annotated source: data item in geography
annotated property: IAO_0000115
annotated target: A data item in geography is an information content entity that is intended to be a truthful statement about something in the geography domain and is constructed/acquired by a method which reliably tends to produce (approximately) truthful statements.
source: data item

queen cell moulding tool
type: Class
subclass of: queen breeding and rearing equipment
IAO_0000115: A queen-cell moulding stick is a stick that has the inner shape of a queen cup and serves as a negative mould for making queen cups out of wax.
IAO_0000117: Michael Rubinigg
IAO_0000118: Formholz @de
IAO_0000118: Formstab @de
IAO_0000118: bastoncino per modellare i cupolini @it
IAO_0000118: bastonete moldador de células reais @pt
IAO_0000118: bastonete para células reais @pt
IAO_0000118: bâtonnet pour le moulage des cellules @fr
IAO_0000118: calapod pentru botci @ro
IAO_0000118: calibrador @es
IAO_0000118: celleformer @no
IAO_0000118: cellepind @da
IAO_0000118: cellepinne @no
IAO_0000118: ensanchador @es
IAO_0000118: formstav @sv
IAO_0000118: molde @es
IAO_0000118: queen cell moulding tool
IAO_0000118: voormhoutje @nl
id: EUPH:1298

emergency queen cell
type: Class
subclass of: queen cell
subclass of: Restriction
  on property: location of
  some values from: immature queen bee
subclass of: Restriction
  on property: part of
  some values from: https://w3id.org/euph/77
IAO_0000115: An emergency cell is a queen cell that has been built from a worker brood cell containing a larva less than 3 days old in the event of a queenless colony.
IAO_0000117: Michael Rubinigg
IAO_0000118: Nachschaffungszelle @de
IAO_0000118: botcă de salvare @ro
IAO_0000118: celda real de salvamento @es
IAO_0000118: cella reale suppletiva @it
IAO_0000118: cellule de sauveté @fr
IAO_0000118: célula real de emergência @pt
IAO_0000118: célula real de salvação @pt
IAO_0000118: emergency queen cell
IAO_0000118: noodcel @nl
IAO_0000118: nödcell @sv
IAO_0000118: nødcelle @no
IAO_0000118: nøddronningcelle @da
IAO_0000118: realeira de emergência @pt
IAO_0000118: realeira de salvação @pt
IAO_0000118: redcel @nl
id: EUPH:1299

frame of drawn comb
type: Class
subclass of: frame
IAO_0000115: A frame of drawn comb is a frame type containing drawn-out comb.
IAO_0000117: Michael Rubinigg
IAO_0000118: ausgebautes Rähmchen @de
IAO_0000118: cadre bâti @fr
IAO_0000118: frame of drawn comb
IAO_0000118: telaio costruito @it
IAO_0000118: uitgebouwd raam @nl
id: EUPH:13

realisable entitiy in engineering
type: Class
subclass of: specifically dependent continuant in engineering
IAO_0000115: A realisable entitiy in engineering is a specifically dependent continuant in the engineering domain that requires some further process to be realised.
IAO_0000117: Michael Rubinigg
IAO_0000118: realisable entitiy in engineering
id: EUPH:1310

Axiom
annotated source: realisable entitiy in engineering
annotated property: IAO_0000115
annotated target: A realisable entitiy in engineering is a specifically dependent continuant in the engineering domain that requires some further process to be realised.
source: http://purl.obolibrary.org/obo/BFO_0000017

honey processing equipment
type: Class
subclass of: hive product processing equipment
IAO_0000115: Equipment used for extraction, settling, storing, liquefying, blending, creaming and bottling of honey produced by honey bees.
IAO_0000117: Michael Rubinigg
IAO_0000118: Honigverarbeitungsgerät @de
IAO_0000118: honey processing equipment
id: EUPH:1311

shortage of stores
type: Class
subclass of: relational quality of physiological entities
subclass of: Restriction
  on property: towards
  some values from: organism
subclass of: Restriction
  on property: towards
  some values from: honey bee colony
subclass of: Restriction
  on property: quality of
  some values from: food stores
IAO_0000115: A shortage of supplies is a condition of an organism or a social group of organisms that is related to the availability of food supplies and indicates that the difference between consumption and replenishment of food compared to the amount of existing food reserves is so high that it may pose a threat to the organism or social group.
IAO_0000117: Michael Rubinigg
IAO_0000118: Futtermangel @de
IAO_0000118: deficienza di provviste @it
IAO_0000118: escasez de provisiones @es
IAO_0000118: falta de provisiones @es
IAO_0000118: falta de provisões @pt
IAO_0000118: foderbrist @sv
IAO_0000118: fodermangel @da
IAO_0000118: fórmangel @no
IAO_0000118: lipsă de provizii @ro
IAO_0000118: mancanza di provviste @it
IAO_0000118: manque de provisions @fr
IAO_0000118: shortage of stores
IAO_0000118: voedselgebrek @nl
id: EUPH:1317

phenotype of defense against diseases
type: Class
subclass of: phenotype of honey bees
subclass of: Restriction
  on property: characteristic of
  some values from: disease defense trait of honey bees
IAO_0000115: A phenotype of disease resistance is a phenotype of honey bees that characterises a disease defense trait, evaluated in honey bee breeding programmes.
IAO_0000117: Michael Rubinigg
IAO_0000118: phenotype of defense against diseases
id: EUPH:1371

material entity in animal breeding
type: Class
subclass of: independent continuant in animal breeding
IAO_0000115: A material entity in animal breeding is an independent continuant in the animal breeding domain that always has some portion of matter as a continuant part.
IAO_0000117: Michael Rubinigg
IAO_0000118: material entity in animal breeding
id: EUPH:1390

Axiom
annotated source: material entity in animal breeding
annotated property: IAO_0000115
annotated target: A material entity in animal breeding is an independent continuant in the animal breeding domain that always has some portion of matter as a continuant part.
source: http://purl.obolibrary.org/obo/BFO_0000040

honey press
type: Class
subclass of: honey extraction equipment
subclass of: Restriction
  on property: involved in
  some values from: honey extraction by pressing
IAO_0000115: A honey press is an equipment used to extract honey from honey frames by applying compression.
IAO_0000117: Michael Rubinigg
IAO_0000118: Honigpresse @de
IAO_0000118: honey press
IAO_0000118: honingpers @nl
IAO_0000118: honningpresse @da
IAO_0000118: honungspress @sv
IAO_0000118: prensa para mel @pt
IAO_0000118: prensa para miel @es
IAO_0000118: presse à miel @fr
IAO_0000118: pressoir à miel @fr
IAO_0000118: presă de miere @ro
IAO_0000118: teasc @ro
IAO_0000118: torchio da miele @it
id: EUPH:1392

frame of empty drawn comb
type: Class
subclass of: frame of drawn comb
IAO_0000115: A frame of empty drawn comb is a frame type containing empty drawn-out comb.
IAO_0000117: Michael Rubinigg
IAO_0000118: Leerwabe @de
IAO_0000118: cadre bâti vide @fr
IAO_0000118: empty frame
IAO_0000118: leeg uitgebouwd raam @nl
IAO_0000118: telaio costruito vuoto @it
id: EUPH:14

phenotype of honey bees
type: Class
subclass of: https://w3id.org/euph/976
subclass of: Restriction
  on property: characteristic of
  some values from: trait of honey bees
subclass of: Restriction
  on property: quality of
  some values from: honey bee colony
IAO_0000115: A phenotype of honey bees is a characteristic of a honey bee colony that is evaluated in honey bee breeding programmes.
IAO_0000117: Michael Rubinigg
IAO_0000118: phenotype of honey bees
id: EUPH:1426

apicultural production process
type: Class
subclass of: https://w3id.org/euph/924
IAO_0000115: An apicultural production process is a beekeeping process in which hive products are harvested and processed by humans.
IAO_0000117: Michael Rubinigg
IAO_0000118: apicultural production process
IAO_0000118: imkerlicher Produktionsprozess @de
id: EUPH:1427

apicultural propolis value chain
type: Class
subclass of: apicultural production process
IAO_0000115: A agrucultural propolis value chain is an apicultural production process, comprising all activities through which beekeepers contribute to the harvesting, processing, or marketing of propolis, regardless of whether an economic value is realised.
IAO_0000117: Michael Rubinigg
IAO_0000118: apicultural propolis value chain
IAO_0000118: imkerliche Propolis-Wertschöpfungskette @de
id: EUPH:1428

apicultural pollen value chain
type: Class
subclass of: apicultural production process
IAO_0000115: An apicultural pollen value chain is an apicultural production process, comprising all activities through which beekeepers contribute to the harvesting, processing, or marketing of pollen, regardless of whether an economic value is realised.
IAO_0000117: Michael Rubinigg
IAO_0000118: apicultural pollen value chain
IAO_0000118: imkerliche Blütenpollen-Wertschöpfungskette @de
IAO_0000118: imkerliche Pollen-Wertschöpfungskette @de
id: EUPH:1429

apicultural royal jelly value chain
type: Class
subclass of: apicultural production process
IAO_0000115: An apicultural royal jelly value chain is an apicultural production process, comprising all activities through which beekeepers contribute to the harvesting, processing, or marketing of royal jelly, regardless of whether an economic value is realised.
IAO_0000117: Michael Rubinigg
IAO_0000118: apicultural royal jelly value chain
IAO_0000118: imkerliche Wertschöpfungskette für Gelée Royale @de
id: EUPH:1430

apicultural honey value chain
type: Class
subclass of: apicultural production process
IAO_0000115: An apicultural honey value chain is a apicultural production process, comprising all activities through which beekeepers contribute to the harvesting, processing, or marketing of honey, regardless of whether an economic value is realised.
IAO_0000117: Michael Rubinigg
IAO_0000118: Honig-Wertschöpfungskette @de
IAO_0000118: apicultural honey value chain
id: EUPH:1431

apicultural bee bread value chain
type: Class
subclass of: apicultural production process
IAO_0000115: An apicultural bee bread value chain is an apicultural production process, comprising all activities through which beekeepers contribute to the harvesting, processing, or marketing of bee bread, regardless of whether an economic value is realised.
IAO_0000117: Michael Rubinigg
IAO_0000118: apicultural bee bread value chain
IAO_0000118: imkerliche Bienenbrot-Wertschöpfungskette @de
IAO_0000118: imkerliche Perga-Wertschöpfungskette @de
id: EUPH:1432

apicultural bee venom value chain
type: Class
subclass of: apicultural production process
IAO_0000115: An apicultural bee venom value chain is an apicultural production process, comprising all activities through which beekeepers contribute to the harvesting, processing, or marketing of bee venom, regardless of whether an economic value is realised.
IAO_0000117: Michael Rubinigg
IAO_0000118: apicultural bee venom value chain
IAO_0000118: imkerliche Bienengift-Wertschöpfungskette @de
id: EUPH:1433

apicultural beeswax value chain
type: Class
subclass of: apicultural production process
IAO_0000115: An apicultural beeswax value chain is an apicultural production process, comprising all activities through which beekeepers contribute to the harvesting, processing, or marketing of beeswax, regardless of whether an economic value is realised.
IAO_0000117: Michael Rubinigg
IAO_0000118: apicultural beeswax value chain
IAO_0000118: imkerliche Bienenwachs-Wertschöpfungskette @de
IAO_0000118: imkerliche Wachs-Wertschöpfungskette @de
id: EUPH:1434

apicultural mead value chain
type: Class
subclass of: apicultural production process
IAO_0000115: An apicultural mead value chain is an apicultural production process, comprising all activities through which beekeepers contribute to the harvesting, processing, or marketing of mead, regardless of whether an economic value is realised.
IAO_0000117: Michael Rubinigg
IAO_0000118: apicultural mead value chain
IAO_0000118: imkerliche Met-Wertschöpfungskette @de
id: EUPH:1435

creamed honey
type: Class
subclass of: processed hive product
IAO_0000115: Creamed honey is a processed hive product made from honey through a mechanical process that gives the honey a creamy consistency.
IAO_0000117: Michael Rubinigg
IAO_0000118: Cremehonig @de
IAO_0000118: creamed honey
id: EUPH:1436

apicultural creamed honey value chain
type: Class
subclass of: apicultural production process
IAO_0000115: Creamed honey production is a process of hive product production in which creamed honey is produced.
IAO_0000117: Michael Rubinigg
IAO_0000118: apicultural creamed honey value chain
IAO_0000118: imkerliche Cremehonig-Wertschöpfungskette @de
id: EUPH:1437

honey extraction by centrifugation
type: Class
subclass of: honey extraction
subclass of: Restriction
  on property: preceded by
  some values from: uncapping
subclass of: Restriction
  on property: has input
  some values from: uncapped honey comb
subclass of: Restriction
  on property: has output
  some values from: extracted honey
IAO_0000115: Honey extraction by centrifugation is a method for honey extraction in which honey is mechanically extracted from honeycombs by applying centrifugal force.
IAO_0000117: Michael Rubinigg
IAO_0000118: a centrifuga @ro
IAO_0000118: a extrage @ro
IAO_0000118: a face extracția @ro
IAO_0000118: at slynge @da
IAO_0000118: att slunga @sv
IAO_0000118: centrifugar @pt
IAO_0000118: extraer por centrifugación @es
IAO_0000118: extrair @pt
IAO_0000118: extraire @fr
IAO_0000118: schleudern @de
IAO_0000118: slingeren @nl
IAO_0000118: smelare @it
IAO_0000118: to extract
IAO_0000118: å slynge @no
id: EUPH:1438

commercial vehicle
type: Class
subclass of: beekeeping vehicle
IAO_0000115: A commercial vehicle is any type of motor vehicle used for transporting goods or paying passengers. Depending on laws and designations, a commercial vehicle can be any broad type of motor vehicle used commercially or for business purposes.
IAO_0000117: Michael Rubinigg
IAO_0000118: Nutzfahrzeug @de
IAO_0000118: bedrijfsvoertuig @nl
IAO_0000118: commercial vehicle
IAO_0000118: veicolo commerciale @it
IAO_0000118: véhicule utilitaire @fr
id: EUPH:1453

Axiom
annotated source: commercial vehicle
annotated property: IAO_0000115
annotated target: A commercial vehicle is any type of motor vehicle used for transporting goods or paying passengers. Depending on laws and designations, a commercial vehicle can be any broad type of motor vehicle used commercially or for business purposes.
source: https://en.wikipedia.org/w/index.php

realisable entitiy in beekeeping
type: Class
subclass of: https://w3id.org/euph/975
IAO_0000115: A realisable entitiy in beekeeping is a specifically dependent continuant in the beekeeping domain that requires some further process to be realised.
IAO_0000117: Michael Rubinigg
IAO_0000118: realisable entitiy in beekeeping
id: EUPH:1456

Axiom
annotated source: realisable entitiy in beekeeping
annotated property: IAO_0000115
annotated target: A realisable entitiy in beekeeping is a specifically dependent continuant in the beekeeping domain that requires some further process to be realised.
source: http://purl.obolibrary.org/obo/BFO_0000017

melting wax
type: Class
subclass of: beeswax processing
subclass of: Restriction
  on property: preceded by
  some values from: rendering wax
IAO_0000115: Melting wax is part of beeswax processing, in which rendered wax is liquefied by heating.
IAO_0000117: Michael Rubinigg
IAO_0000118: a topi @ro
IAO_0000118: at smelte @da
IAO_0000118: att smälta @sv
IAO_0000118: fondere @it
IAO_0000118: fondre @fr
IAO_0000118: fundir @es
IAO_0000118: liquefazer @pt
IAO_0000118: melting wax
IAO_0000118: schmelzen @de
IAO_0000118: smelten @nl
IAO_0000118: to melt
IAO_0000118: å smelte @no
id: EUPH:1457

bee bread processing
type: Class
subclass of: apicultural bee bread value chain
subclass of: Restriction
  on property: preceded by
  some values from: bee bread harvesting
subclass of: Restriction
  on property: has input
  some values from: bee bread
IAO_0000115: Bee bread processing is a process in the apicultural bee bread value chain in which bee bread collected from honey bee colonies is processed.
IAO_0000117: Michael Rubinigg
IAO_0000118: bee bread processing
id: EUPH:1469

bee bread harvesting
type: Class
subclass of: apicultural bee bread value chain
subclass of: Restriction
  on property: preceded by
  some values from: bee bread production
subclass of: Restriction
  on property: has input
  some values from: bee bread
subclass of: Restriction
  on property: has output
  some values from: bee bread
IAO_0000115: Bee bread harvesting is a process in the apicultural bee bread value chain in which bee bread is collected from honey bee colonies.
IAO_0000117: Michael Rubinigg
IAO_0000118: bee bread harvesting
id: EUPH:1470

bee venom processing
type: Class
subclass of: apicultural bee venom value chain
subclass of: Restriction
  on property: preceded by
  some values from: bee venom harvesting
subclass of: Restriction
  on property: has input
  some values from: bee venom
IAO_0000115: Bee venom processing is a process in the apicultural bee venom value chain in which bee venom collected from honey bee colonies is processed.
IAO_0000117: Michael Rubinigg
IAO_0000118: bee venom processing
id: EUPH:1471

bee venom harvesting
type: Class
subclass of: apicultural bee venom value chain
subclass of: Restriction
  on property: preceded by
  some values from: stinging
subclass of: Restriction
  on property: has input
  some values from: bee venom
subclass of: Restriction
  on property: has output
  some values from: bee venom
IAO_0000115: Bee venom harvesting is a process in the apicultural bee venom value chain in which bee venom is collected from honey bee colonies.
IAO_0000117: Michael Rubinigg
IAO_0000118: bee venom harvesting
id: EUPH:1472

beeswax processing
type: Class
subclass of: apicultural beeswax value chain
subclass of: Restriction
  on property: preceded by
  some values from: beeswax harvesting
subclass of: Restriction
  on property: has input
  some values from: beeswax
IAO_0000115: Beeswax processing is a process in the apicultural beeswax value chain in which beeswax collected from honey bee colonies is processed.
IAO_0000117: Michael Rubinigg
IAO_0000118: beeswax processing
id: EUPH:1473

beeswax harvesting
type: Class
subclass of: apicultural beeswax value chain
subclass of: Restriction
  on property: preceded by
  some values from: comb production
subclass of: Restriction
  on property: has input
  some values from: comb
subclass of: Restriction
  on property: has output
  some values from: beeswax
IAO_0000115: Beeswax harvesting is a process in the apicultural beeswax value chain in which beeswax is collected from honey bee colonies.
IAO_0000117: Michael Rubinigg
IAO_0000118: beeswax harvesting
id: EUPH:1474

creamed honey processing
type: Class
subclass of: apicultural creamed honey value chain
subclass of: Restriction
  on property: preceded by
  some values from: honey harvesting
subclass of: Restriction
  on property: has input
  some values from: honey
subclass of: Restriction
  on property: has output
  some values from: creamed honey
IAO_0000115: Creamed honey processing is a process in the apicultural creamed honey value chain in which creamed honey is processed from honey collected from honey bee colonies.
IAO_0000117: Michael Rubinigg
IAO_0000118: creamed honey processing
id: EUPH:1475

honey processing
type: Class
subclass of: apicultural honey value chain
subclass of: Restriction
  on property: preceded by
  some values from: honey harvesting
IAO_0000115: Honey processing is a process in the apicultural honey value chain in which honey collected from honey bee colonies is processed.
IAO_0000117: Michael Rubinigg
IAO_0000118: honey processing
id: EUPH:1476

honey harvesting
type: Class
subclass of: apicultural honey value chain
subclass of: Restriction
  on property: preceded by
  some values from: honey foraging
subclass of: Restriction
  on property: has input
  some values from: honey stores
subclass of: Restriction
  on property: has output
  some values from: https://w3id.org/euph/802
IAO_0000115: Honey harvesting is a process in the apicultural honey value chain in which honey is collected from honey bee colonies.
IAO_0000117: Michael Rubinigg
IAO_0000118: honey harvesting
id: EUPH:1477

mead processing
type: Class
subclass of: apicultural mead value chain
subclass of: Restriction
  on property: preceded by
  some values from: honey harvesting
subclass of: Restriction
  on property: has input
  some values from: honey
subclass of: Restriction
  on property: has output
  some values from: mead
IAO_0000115: Mead processing is a process in the apicultural mead production value chain in which mead is produced from honey and other ingredients.
IAO_0000117: Michael Rubinigg
IAO_0000118: Metverarbeitung @de
IAO_0000118: mead processing
id: EUPH:1478

pollen processing
type: Class
subclass of: apicultural pollen value chain
subclass of: Restriction
  on property: preceded by
  some values from: pollen harvesting
subclass of: Restriction
  on property: has input
  some values from: pollen pellet
IAO_0000115: Pollen processing is a process in the apicultural pollen value chain in which pollen collected from honey bee colonies is processed.
IAO_0000117: Michael Rubinigg
IAO_0000118: pollen processing
id: EUPH:1479

pollen harvesting
type: Class
subclass of: apicultural pollen value chain
subclass of: Restriction
  on property: preceded by
  some values from: pollen collection
subclass of: Restriction
  on property: has input
  some values from: pollen pellet
subclass of: Restriction
  on property: has output
  some values from: pollen pellet
IAO_0000115: Pollen harvesting is a process in the apicultural pollen value chain in which pollen is collected from honey bee colonies.
IAO_0000117: Michael Rubinigg
IAO_0000118: pollen harvesting
id: EUPH:1480

propolis processing
type: Class
subclass of: apicultural propolis value chain
subclass of: Restriction
  on property: preceded by
  some values from: propolis harvesting
subclass of: Restriction
  on property: has input
  some values from: propolis
IAO_0000115: Propolis processing is a process in the apicultural propolis value chain in which propolis collected from honey bee colonies is processed.
IAO_0000117: Michael Rubinigg
IAO_0000118: propoplis processing
id: EUPH:1481

propolis harvesting
type: Class
subclass of: apicultural propolis value chain
subclass of: Restriction
  on property: preceded by
  some values from: propolising
subclass of: Restriction
  on property: has input
  some values from: propolis
subclass of: Restriction
  on property: has output
  some values from: propolis
IAO_0000115: Propolis harvesting is a process in the apicultural propolis value chain in which propolis is harvested from honey bee colonies.
IAO_0000117: Michael Rubinigg
IAO_0000118: propolis harvesting
id: EUPH:1482

royal jelly processing
type: Class
subclass of: apicultural royal jelly value chain
subclass of: Restriction
  on property: preceded by
  some values from: royal jelly harvesting
subclass of: Restriction
  on property: has input
  some values from: royal jelly
IAO_0000115: Royal jelly processing is a process in the apicultural royal jelly value chain in which royal jelly collected from honey bee colonies is processed.
IAO_0000117: Michael Rubinigg
IAO_0000118: royal jelly processing
id: EUPH:1483

royal jelly harvesting
type: Class
subclass of: apicultural royal jelly value chain
subclass of: Restriction
  on property: preceded by
  some values from: royal jelly biosynthetic process
subclass of: Restriction
  on property: has input
  some values from: royal jelly
subclass of: Restriction
  on property: has output
  some values from: royal jelly
IAO_0000115: Royal jelly harvesting is a process in the apicultural royal jelly value chain in which royal jelly is collected from honey bee colonies.
IAO_0000117: Michael Rubinigg
IAO_0000118: royal jelly harvesting
id: EUPH:1484

hive product quality management
type: Class
subclass of: https://w3id.org/euph/924
IAO_0000115: A hive product quality management is a process in beekeeping, which aims to ensure that an organisation consistently meets desired quality standards for its products, services, and processes.
IAO_0000117: Michael Rubinigg
IAO_0000118: apicultural production quality management
id: EUPH:1485

identifier of geographical enities
type: Class
subclass of: quality in geography
IAO_0000115: An identifier of geographical enities is an identifier that is specific for an entity in the geography domain.
IAO_0000117: Michael Rubinigg
IAO_0000118: ID of geographical enities
IAO_0000118: identifier of geographical enities
id: EUPH:1487

information content entity in geography
type: Class
subclass of: generically dependent continuant in geography
IAO_0000115: An information content entity in geography is a generically dependent continuant in the geography domain that is about some thing.
IAO_0000117: Michael Rubinigg
IAO_0000118: information content entity in geography
id: EUPH:1488

Axiom
annotated source: information content entity in geography
annotated property: IAO_0000115
annotated target: An information content entity in geography is a generically dependent continuant in the geography domain that is about some thing.
source: http://purl.obolibrary.org/obo/IAO_0000030

pollen substitute
type: Class
subclass of: honey bee feed
IAO_0000115: A pollen substitue is a honey bee feed that is rich in protein, designed to replace part of a honey bee colony's usual diet when natural pollen from honey bee forage is in short supply.
IAO_0000117: Michael Rubinigg
IAO_0000118: Pollenersatz @de
IAO_0000118: pollen substitute
IAO_0000118: pollenerstatning @da
IAO_0000118: pollenersättning @sv
IAO_0000118: sostituto del polline @it
IAO_0000118: stuifmeelsurrogaat @nl
IAO_0000118: substituto del polen @es
IAO_0000118: substituto do pólen @pt
IAO_0000118: succedaneo del polline @it
IAO_0000118: surrogat de pollen @fr
IAO_0000118: surrogato del polline @it
IAO_0000118: înlocuitor de polen @ro
id: EUPH:1489

pollen supplement
type: Class
subclass of: honey bee feed
IAO_0000115: A pollen supplement is a honey bee feed that is rich in protein, designed to add proteins or specific amino acids to a honey bee colony's diet without significantly reducing the intake of pollen from honey bee forage.
IAO_0000117: Michael Rubinigg
IAO_0000118: Pollenergänzung @de
IAO_0000118: aanvullende stuifmeelgift @nl
IAO_0000118: complemento del polline @it
IAO_0000118: pollen supplement
IAO_0000118: pollentillskott @sv
IAO_0000118: pollentilsetning @no
IAO_0000118: pollentilskud @da
IAO_0000118: suplemento de pólen @pt
IAO_0000118: suplemento del polen @es
IAO_0000118: supliment de polen @ro
IAO_0000118: supplément de pollen @fr
id: EUPH:1492

division board
type: Class
subclass of: https://w3id.org/euph/8163
subclass of: Restriction
  on property: involved in
  some values from: https://w3id.org/euph/832
subclass of: Restriction
  on property: part of
  some values from: https://w3id.org/euph/8
IAO_0000115: A division board is a board made of wood or other, insulating material, fitting in place of a regular frame. It is used to reduce the working space within a beehive, help the worker bees to maintain brood rearing temperature im the beehive and increase air flow.
IAO_0000117: Michael Rubinigg
IAO_0000118: Einschiebebrett @de
IAO_0000118: Schied @de
IAO_0000118: Schiedbrett @de
IAO_0000118: cadre partition @fr
IAO_0000118: delebrett @no
IAO_0000118: diafragmă @ro
IAO_0000118: diafragmă oarbă @ro
IAO_0000118: diaframma @it
IAO_0000118: division board
IAO_0000118: follower board
IAO_0000118: indskud @da
IAO_0000118: innskuddsbrett @no
IAO_0000118: kantraam @nl
IAO_0000118: partição @pt
IAO_0000118: planche de partition @fr
IAO_0000118: redutor @pt
IAO_0000118: scîndură despărțitoare @ro
IAO_0000118: separador @pt
IAO_0000118: separatore @it
IAO_0000118: skiljebräda @sv
IAO_0000118: skiljevägg @sv
IAO_0000118: sluitblok @nl
IAO_0000118: sluitraam @nl
IAO_0000118: tablero divisor @es
IAO_0000118: tábua divisória @pt
IAO_0000118: verdeelplankje @nl
IAO_0000118: vulblok @nl
id: EUPH:15

specifically dependent continuant in geology
type: Class
subclass of: continuant in geology
IAO_0000115: A specifically dependent continuant in geology is a continuant entity in the geology domain that does not exist on its own, but requires a specific single entity in any other domain to exist.
IAO_0000117: Michael Rubinigg
IAO_0000118: specifically dependent continuant in geology
id: EUPH:1527

Axiom
annotated source: specifically dependent continuant in geology
annotated property: IAO_0000115
annotated target: A specifically dependent continuant in geology is a continuant entity in the geology domain that does not exist on its own, but requires a specific single entity in any other domain to exist.
source: http://purl.obolibrary.org/obo/BFO_0000020

generically dependent continuant in geology
type: Class
subclass of: continuant in geology
IAO_0000115: A generically dependent continuant in geology is a continuant entity in the geology domain that does not exist on its own, but does not require a specific single entity in any other domain to exist.
IAO_0000117: Michael Rubinigg
IAO_0000118: generically dependent continuant in geology
id: EUPH:1528

Axiom
annotated source: generically dependent continuant in geology
annotated property: IAO_0000115
annotated target: A generically dependent continuant in geology is a continuant entity in the geology domain that does not exist on its own, but does not require a specific single entity in any other domain to exist.
source: http://purl.obolibrary.org/obo/BFO_0000031

skep
type: Class
subclass of: https://w3id.org/euph/8
IAO_0000115: A skep is a beehive made from an inverted basket of woven plant stems (wicker, coiled-straw), with its open mouth being placed on a wooden or stone stand or a brood chamber.
IAO_0000117: Michael Rubinigg
IAO_0000118: Bienenkorb @de
IAO_0000118: Korb @de
IAO_0000118: arnia di paglia @it
IAO_0000118: bijenkorf @nl
IAO_0000118: butt
IAO_0000118: colmeia de palha @pt
IAO_0000118: colmena de cesta @es
IAO_0000118: colmena de paja @es
IAO_0000118: cortiço de palha @pt
IAO_0000118: coșniță @ro
IAO_0000118: halmkube @no
IAO_0000118: halmkupa @sv
IAO_0000118: korf @nl
IAO_0000118: kube @da
IAO_0000118: panier @fr
IAO_0000118: paniere @it
IAO_0000118: ruche en paille @fr
IAO_0000118: ruche vulgaire @fr
IAO_0000118: ruskie
IAO_0000118: skep
id: EUPH:1535

Axiom
annotated source: skep
annotated property: IAO_0000115
annotated target: A skep is a beehive made from an inverted basket of woven plant stems (wicker, coiled-straw), with its open mouth being placed on a wooden or stone stand or a brood chamber.
has db xref: ISBN:0-415-92467-7

comb production
type: Class
subclass of: https://w3id.org/euph/760
subclass of: Restriction
  on property: has input
  some values from: wax scale
subclass of: Restriction
  on property: has output
  some values from: comb
IAO_0000115: Comb production is a behaviour of honey bees in which worker bees transform wax scales to produce comb.
IAO_0000117: Michael Rubinigg
IAO_0000118: comb production
id: EUPH:1536

beekeeping equipment drive
type: Class
subclass of: function related to beekeeping equipment
IAO_0000115: Beekeeping equipment drive is the function of a beekeeping equipment that transmits power and motion from a power source to a machine or device to perform work.
IAO_0000117: Michael Rubinigg
IAO_0000118: beekeeping equipment drive
id: EUPH:1537

boundary
type: Class
subclass of: function in engineering
IAO_0000115: A boundary is a general function of a system in the engineering domain that creates a physical interface between two areas or spaces with the aim of keeping the conditions on one side of the barrier different from the conditions on the other side.
IAO_0000117: Michael Rubinigg
IAO_0000118: boundary
id: EUPH:1538

function in engineering
type: Class
subclass of: disposition in engineering
IAO_0000115: A function in engineering is a disposition in the engineering domain that exist by evolution or design to realise specific processes.
IAO_0000117: Michael Rubinigg
IAO_0000118: function in engineering
id: EUPH:1539

Axiom
annotated source: function in engineering
annotated property: IAO_0000115
annotated target: A function in engineering is a disposition in the engineering domain that exist by evolution or design to realise specific processes.
source: http://purl.obolibrary.org/obo/BFO_0000034

wax-making bee
type: Class
subclass of: behavioural role
subclass of: Restriction
  on property: role of
  some values from: adult worker bee
subclass of: Restriction
  on property: involved in
  some values from: https://w3id.org/euph/810
IAO_0000115: A wax-making bee is a worker bee carrying out the task of building combs.
IAO_0000117: Michael Rubinigg
IAO_0000118: Baubiene @de
IAO_0000118: abelha cereeira @pt
IAO_0000118: albină cereasă @ro
IAO_0000118: bouwbij @nl
IAO_0000118: byggbi @sv
IAO_0000118: byggebi @da
IAO_0000118: ceraiola @it
IAO_0000118: cereasă @ro
IAO_0000118: cirière @fr
IAO_0000118: obrera cerera @es
IAO_0000118: waszweetster @nl
IAO_0000118: wax-making bee
id: EUPH:1540

single walled
type: Class
subclass of: boundary
subclass of: Restriction
  on property: function of
  some values from: honey bottling tank
subclass of: Restriction
  on property: function of
  some values from: beeswax extractor
IAO_0000115: Single-walled is a function of a boundary consisting of one single wall that provides a layer of protection, containment, insulation or safety.
IAO_0000117: Michael Rubinigg
IAO_0000118: a parete semplice @it
IAO_0000118: cu parete simplu @ro
IAO_0000118: de paredes simples @es
IAO_0000118: einfachwandig @de
IAO_0000118: enkeltvegget @no
IAO_0000118: enkeltvægget @da
IAO_0000118: enkelväggig @sv
IAO_0000118: enkelwandig @nl
IAO_0000118: single-walled
IAO_0000118: à parois simples @fr
id: EUPH:1541

honey extraction by pressing
type: Class
subclass of: honey extraction
subclass of: Restriction
  on property: has input
  some values from: https://w3id.org/euph/802
subclass of: Restriction
  on property: has output
  some values from: pressed honey
IAO_0000115: honey extraction by pressing is a method for honey extraction in which honey is mechanically extracted from honeycombs by applying compression.
IAO_0000117: Michael Rubinigg
IAO_0000118: a stoarce @ro
IAO_0000118: at presse @da
IAO_0000118: att pressa @sv
IAO_0000118: auspressen @de
IAO_0000118: persen @nl
IAO_0000118: prensar @es
IAO_0000118: pressen @de
IAO_0000118: presser @fr
IAO_0000118: pressing
IAO_0000118: to press
IAO_0000118: torchiare @it
IAO_0000118: å presse @no
IAO_0000118: å presse ut @no
id: EUPH:1543

piping of emerged queen
type: Class
subclass of: reproductive behavior of honey bees
subclass of: Restriction
  on property: has participant
  some values from: unmated queen
IAO_0000115: Piping of emerged queen is a reproductive behavior exhibited by a newly hatched virgin queen to announce her presence in the colony by producing a pulsed, high-pitched sound by pressing her thorax against the comb and operating her wing-beating mechanism without spreading her wings.
IAO_0000117: Michael Rubinigg
IAO_0000118: at kvække @da
IAO_0000118: at pibe @da
IAO_0000118: at tytte @da
IAO_0000118: att mana @sv
IAO_0000118: cantar @es
IAO_0000118: cantare @it
IAO_0000118: canto @pt
IAO_0000118: chanter @fr
IAO_0000118: cîntecul mătcii @ro
IAO_0000118: piping
IAO_0000118: to pipe
IAO_0000118: tuten @nl
IAO_0000118: tüten @de
IAO_0000118: å tute @no
id: EUPH:1550

Axiom
annotated source: piping of emerged queen
annotated property: IAO_0000115
annotated target: Piping of emerged queen is a reproductive behavior exhibited by a newly hatched virgin queen to announce her presence in the colony by producing a pulsed, high-pitched sound by pressing her thorax against the comb and operating her wing-beating mechanism without spreading her wings.
has db xref: ISBN:0-674-07409-2

double walled
type: Class
subclass of: boundary
subclass of: Restriction
  on property: function of
  some values from: honey bottling tank
subclass of: Restriction
  on property: function of
  some values from: beeswax extractor
IAO_0000115: Double-walled is a function of a boundary consisting of two separate walls (an inner wall and an outer wall with a space between them) that provides an additional layer of protection, containment, insulation or safety beyond what a single wall can provide.
IAO_0000117: Michael Rubinigg
IAO_0000118: a doppia parete @it
IAO_0000118: cu perete dublu @ro
IAO_0000118: de doble pared @es
IAO_0000118: de parede dupla @pt
IAO_0000118: dobbeltvegget @no
IAO_0000118: dobbeltvægget @da
IAO_0000118: doppelwandig @de
IAO_0000118: double-walled
IAO_0000118: dubbelväggig @sv
IAO_0000118: dubbelwandig @nl
IAO_0000118: à double paroi @fr
id: EUPH:1563

honey bee colony reproduction
type: Class
subclass of: reproductive behavior of honey bees
subclass of: Restriction
  on property: has input
  some values from: honey bee colony
subclass of: Restriction
  on property: has output
  some values from: prime swarm
subclass of: Restriction
  on property: has output
  some values from: https://w3id.org/euph/8253
IAO_0000115: Honey bee colony reproduction is a reproductive behavior of honey bees that eventually takes place through swarming.
IAO_0000117: Michael Rubinigg
IAO_0000118: honey bee colony reproduction
id: EUPH:1565

fiat object part in geography
type: Class
subclass of: material entity in geography
IAO_0000115: A fiat object part in geography is a material entity in the geography domain that is not a collection of disjoint self-standing single objects, but a proper part of an object.
IAO_0000117: Michael Rubinigg
IAO_0000118: fiat object part in geography
id: EUPH:1580

Axiom
annotated source: fiat object part in geography
annotated property: IAO_0000115
annotated target: A fiat object part in geography is a material entity in the geography domain that is not a collection of disjoint self-standing single objects, but a proper part of an object.
source: http://purl.obolibrary.org/obo/BFO_0000024

function in beekeeping
type: Class
subclass of: disposition in beekeeping
IAO_0000115: A function in beekeeping is a disposition in the bekeeping domain that exist by evolution or design to realise specific processes.
IAO_0000117: Michael Rubinigg
IAO_0000118: function in beekeeping
id: EUPH:1585

Axiom
annotated source: function in beekeeping
annotated property: IAO_0000115
annotated target: A function in beekeeping is a disposition in the bekeeping domain that exist by evolution or design to realise specific processes.
source: http://purl.obolibrary.org/obo/BFO_0000034

honey from Apis dorsata
type: Class
subclass of: honey
subclass of: Restriction
  on property: produced by
  some values from: https://www.gbif.org/species/1341978
IAO_0000115: Honey from Apis dorsata is honey collected and processed by the Giant honey bee Apis dorsata.
IAO_0000117: Michael Rubinigg
IAO_0000118: honey from Apis dorsata
id: EUPH:1586

process in economics
type: Class
subclass of: occurrent in economics
IAO_0000115: A process in economics is an occurrent entity in the economics domain that inhabit the universal spatiotemporal region and has a proper temporal part.
IAO_0000117: Michael Rubinigg
IAO_0000118: economic process
id: EUPH:1587

Axiom
annotated source: process in economics
annotated property: IAO_0000115
annotated target: A process in economics is an occurrent entity in the economics domain that inhabit the universal spatiotemporal region and has a proper temporal part.
source: http://purl.obolibrary.org/obo/BFO_0000015

generically dependent continuant in economics
type: Class
subclass of: continuant in economics
IAO_0000115: A generically dependent continuant in economics is a continuant entity in the economics domain that does not exist on its own, but does not require a specific single entity in any other domain to exist.
IAO_0000117: Michael Rubinigg
IAO_0000118: generically dependent continuant in economics
id: EUPH:1588

Axiom
annotated source: generically dependent continuant in economics
annotated property: IAO_0000115
annotated target: A generically dependent continuant in economics is a continuant entity in the economics domain that does not exist on its own, but does not require a specific single entity in any other domain to exist.
source: http://purl.obolibrary.org/obo/BFO_0000031

object aggregate in biology
type: Class
subclass of: material entity in biology
IAO_0000115: An object aggregate in biology is a material entity in the biology domain that is a collection of disjoint self-standing single objects.
IAO_0000117: Michael Rubinigg
IAO_0000118: object aggregate in biology
id: EUPH:1589

Axiom
annotated source: object aggregate in biology
annotated property: IAO_0000115
annotated target: An object aggregate in biology is a material entity in the biology domain that is a collection of disjoint self-standing single objects.
source: http://purl.obolibrary.org/obo/BFO_0000027

honey from Apis florea
type: Class
subclass of: honey
subclass of: Restriction
  on property: produced by
  some values from: https://www.gbif.org/species/1341974
IAO_0000115: Honey from Apis florea is honey collected and processed by the Dwarf honey bee Apis florea.
IAO_0000117: Michael Rubinigg
IAO_0000118: honey from Apis florea
id: EUPH:1592

frame feeder
type: Class
subclass of: https://w3id.org/euph/8162
subclass of: Restriction
  on property: location of
  some values from: honey bee feed
subclass of: Restriction
  on property: part of
  some values from: https://w3id.org/euph/8
IAO_0000115: A frame feeder is a feeder fitting in place of one or more regular frames in a beehive, usually used in the brood chamber to feed a honey bee colony.
IAO_0000117: Michael Rubinigg
IAO_0000118: Futtertasche @de
IAO_0000118: cadre nourrisseur @fr
IAO_0000118: frame feeder
IAO_0000118: nutritore a tasca @it
IAO_0000118: voerraam @nl
id: EUPH:16

uniting
type: Class
subclass of: hive management
subclass of: Restriction
  on property: has output
  some values from: managed honey bee colony
IAO_0000115: Uniting is the process of combining at least two honey bee colonies in the same hive under one single queen.
IAO_0000117: Michael Rubinigg
IAO_0000118: a unifica @ro
IAO_0000118: at forene @da
IAO_0000118: att förena @sv
IAO_0000118: reunir @es
IAO_0000118: riunire @it
IAO_0000118: réunir @fr
IAO_0000118: to unite
IAO_0000118: vereinigen @de
IAO_0000118: verenigen @nl
IAO_0000118: å forene @no
id: EUPH:1606

small fruit
type: Class
subclass of: plant fruit food product
IAO_0000115: A small fruit is a plant fruit food product characterised by small size, soft texture, and growth on herbaceous plants or shrubs, as opposed to tree-borne fruits, with membership determined by horticultural practice rather than botanical taxonomy.
IAO_0000117: Michael Rubinigg
IAO_0000118: small fruit
id: EUPH:1625

information content entity in animal breeding
type: Class
subclass of: generically dependent continuant in animal breeding
IAO_0000115: An information content entity in animal breeding is a generically dependent continuant in the animal breeding domain that is about some thing.
IAO_0000117: Michael Rubinigg
IAO_0000118: information content entity in animal breeding
id: EUPH:1632

Axiom
annotated source: information content entity in animal breeding
annotated property: IAO_0000115
annotated target: An information content entity in animal breeding is a generically dependent continuant in the animal breeding domain that is about some thing.
source: http://purl.obolibrary.org/obo/IAO_0000030

data set in animal breeding
type: Class
subclass of: information content entity in animal breeding
IAO_0000115: A data set in animal breeding is an information content entity in the animal breeding domain that is an aggregate of other data items of the same type that have something in common. Averages and distributions can be determined for data sets.
IAO_0000117: Michael Rubinigg
IAO_0000118: data set in animal breeding
id: EUPH:1635

Axiom
annotated source: data set in animal breeding
annotated property: IAO_0000115
annotated target: A data set in animal breeding is an information content entity in the animal breeding domain that is an aggregate of other data items of the same type that have something in common. Averages and distributions can be determined for data sets.
source: https://github.com/ISA-tools/stato

statistic in animal breeding
type: Class
subclass of: information content entity in animal breeding
IAO_0000115: A statistic in animal breeding is an information content entity in the animal breeding domain that is a measurement datum to describe a dataset or a variable. It is generated by a calculation on set of observed data.
IAO_0000117: Michael Rubinigg
IAO_0000118: statistic in animal breeding
id: EUPH:1636

Axiom
annotated source: statistic in animal breeding
annotated property: IAO_0000115
annotated target: A statistic in animal breeding is an information content entity in the animal breeding domain that is a measurement datum to describe a dataset or a variable. It is generated by a calculation on set of observed data.
source: https://github.com/ISA-tools/stato

identifier in animal breeding
type: Class
subclass of: information content entity in animal breeding
IAO_0000115: An identifier in animal breeding is an information content entity in the animal breeding domain that is the outcome of a dubbing process and is used to refer to one instance of entity shared by a group [...] to refer to that individual entity.
IAO_0000117: Michael Rubinigg
IAO_0000118: identifier in animal breeding
id: EUPH:1638

Axiom
annotated source: identifier in animal breeding
annotated property: IAO_0000115
annotated target: An identifier in animal breeding is an information content entity in the animal breeding domain that is the outcome of a dubbing process and is used to refer to one instance of entity shared by a group [...] to refer to that individual entity.
source: https://github.com/information-artifact-ontology/IAO

disposition in animal breeding
type: Class
subclass of: realisable entitiy in animal breeding
IAO_0000115: A disposition in animal breeding is a realisable entitiy in the animal breeding domain that does not exist, because the bearer is in a specific situation.
IAO_0000117: Michael Rubinigg
IAO_0000118: disposition in animal breeding
id: EUPH:1639

Axiom
annotated source: disposition in animal breeding
annotated property: IAO_0000115
annotated target: A disposition in animal breeding is a realisable entitiy in the animal breeding domain that does not exist, because the bearer is in a specific situation.
source: http://purl.obolibrary.org/obo/BFO_0000016

honey stores
type: Class
subclass of: object aggregate in biology
IAO_0000115: Honey stores are carbohydrate-rich food resources consisting of ripened honey stored by a honey bee colony within cells of the nest, serving as a long-term carbohydrate resource during periods when nectar is unavailable.
IAO_0000117: Michael Rubinigg
IAO_0000118: Honigvorrat @de
IAO_0000118: honey stores
id: EUPH:1656

disease defense trait of honey bees
type: Class
subclass of: fitness trait of honey bees
IAO_0000115: A disease defense trait of honey bees is a fitness trait of honey bees that quantifies the ability of a honey bee colony to defend itself against a pest or a disease.
IAO_0000117: Michael Rubinigg
IAO_0000118: Merkmal von Honigbienen zur Abwehr von Krankheiten @de
IAO_0000118: disease defense trait of honey bees
id: EUPH:1657

disease tolerance trait of honey bees
type: Class
subclass of: disease defense trait of honey bees
IAO_0000115: A disease tolerance trait of honey bees is a disease defense trait that quantifies the ability of a honey bee colony to limit the damage caused by a given parasite burden.
IAO_0000117: Michael Rubinigg
IAO_0000118: disease tolerance trait of honey bees
id: EUPH:1659

Axiom
annotated source: disease tolerance trait of honey bees
annotated property: IAO_0000115
annotated target: A disease tolerance trait of honey bees is a disease defense trait that quantifies the ability of a honey bee colony to limit the damage caused by a given parasite burden.
has db xref: 10.1126/science.1148526

phenotype of queen bee egg-laying rate
type: Class
subclass of: phenotype of honey bees
subclass of: Restriction
  on property: characteristic of
  some values from: egg laying rate of queen bee
IAO_0000115: A phenotype of queen bee egg-laying rate is a phenotype of honey bees that characterises the frequency of egg production by a queen bee.
IAO_0000117: Michael Rubinigg
IAO_0000118: phenotype of queen bee egg-laying rate
id: EUPH:1697

object in animal breeding
type: Class
subclass of: material entity in animal breeding
IAO_0000115: An object in animal breeding is a material entity in the animal breeding domain that is neither a collection of disjoint self-standing single objects, nor a proper part of an object.
IAO_0000117: Michael Rubinigg
IAO_0000118: object in animal breeding
id: EUPH:1698

Axiom
annotated source: object in animal breeding
annotated property: IAO_0000115
annotated target: An object in animal breeding is a material entity in the animal breeding domain that is neither a collection of disjoint self-standing single objects, nor a proper part of an object.
source: http://purl.obolibrary.org/obo/BFO_0000030

object aggregate in animal breeding
type: Class
subclass of: material entity in animal breeding
IAO_0000115: An object aggregate in animal breeding is a material entity in the animal breeding domain that is a collection of disjoint self-standing single objects.
IAO_0000117: Michael Rubinigg
IAO_0000118: object aggregate in animal breeding
id: EUPH:1699

Axiom
annotated source: object aggregate in animal breeding
annotated property: IAO_0000115
annotated target: An object aggregate in animal breeding is a material entity in the animal breeding domain that is a collection of disjoint self-standing single objects.
source: http://purl.obolibrary.org/obo/BFO_0000027

hive body frame
type: Class
subclass of: frame
subclass of: Restriction
  on property: part of
  some values from: https://w3id.org/euph/9
IAO_0000115: A hive body frame is a frame used in a hive body of beehive types having different frame sizes.
IAO_0000117: Michael Rubinigg
IAO_0000118: Brutraumrähmchen @de
IAO_0000118: broedkamer raam @nl
IAO_0000118: cadre de corps @fr
IAO_0000118: deep frame
IAO_0000118: telaino da nido @it
id: EUPH:17

prolific
type: Class
subclass of: phenotype of queen bee egg-laying rate
IAO_0000115: Prolific is a phenotype of queen bee egg-laying rate that refers to the ability of a queen bee to lay a large number of eggs consistently over time.
IAO_0000117: Michael Rubinigg
IAO_0000118: alstringsrik @sv
IAO_0000118: fecunda @pt
IAO_0000118: fecundo @es
IAO_0000118: frugtbar @da
IAO_0000118: fruktbar @no
IAO_0000118: legetüchtig @de
IAO_0000118: legkrachtig @nl
IAO_0000118: prolific
IAO_0000118: prolifico @it
IAO_0000118: prolifique @fr
IAO_0000118: prolífica @pt
IAO_0000118: prolífico @es
IAO_0000118: vruchtbaar @nl
id: EUPH:1700

beekeeping equipment quality
type: Class
subclass of: https://w3id.org/euph/976
IAO_0000115: A beekeeping equipment quality is a quality in the beekeeping domain that is related to beekeeping equipment.
IAO_0000117: Michael Rubinigg
IAO_0000118: Cheese, sheep milk
id: EUPH:1701

Axiom
annotated source: beekeeping equipment quality
annotated property: IAO_0000115
annotated target: A beekeeping equipment quality is a quality in the beekeeping domain that is related to beekeeping equipment.
source: https://basic-formal-ontology.org/

material entity in veterinary medicine
type: Class
subclass of: independent continuant in veterinary medicine
IAO_0000115: A material entity in veterinary medicine is an independent continuant in the veterinary medicine domain that always has some portion of matter as a continuant part.
IAO_0000117: Michael Rubinigg
IAO_0000118: material entity in veterinary medicine
id: EUPH:1702

Axiom
annotated source: material entity in veterinary medicine
annotated property: IAO_0000115
annotated target: A material entity in veterinary medicine is an independent continuant in the veterinary medicine domain that always has some portion of matter as a continuant part.
source: http://purl.obolibrary.org/obo/BFO_0000040

object in veterinary medicine
type: Class
subclass of: material entity in veterinary medicine
IAO_0000115: An object in veterinary medicine is a material entity in the veterinary medicine domain that is neither a collection of disjoint self-standing single objects, nor a proper part of an object.
IAO_0000117: Michael Rubinigg
IAO_0000118: object in veterinary medicine
id: EUPH:1703

Axiom
annotated source: object in veterinary medicine
annotated property: IAO_0000115
annotated target: An object in veterinary medicine is a material entity in the veterinary medicine domain that is neither a collection of disjoint self-standing single objects, nor a proper part of an object.
source: http://purl.obolibrary.org/obo/BFO_0000030

realisable entity in biology
type: Class
subclass of: specifically dependent continuant in biology
IAO_0000115: A realisable entity in biology is a specifically dependent continuant im the biology domain that requires some further process to be realised.
IAO_0000117: Michael Rubinigg
IAO_0000118: realisable entity in biology
id: EUPH:1704

Axiom
annotated source: realisable entity in biology
annotated property: IAO_0000115
annotated target: A realisable entity in biology is a specifically dependent continuant im the biology domain that requires some further process to be realised.
source: http://purl.obolibrary.org/obo/BFO_0000017

role in biology
type: Class
subclass of: realisable entity in biology
IAO_0000115: A role in biology is a realisable entity in the biology domain that exist because the bearer is in a specific situation.
IAO_0000117: Michael Rubinigg
IAO_0000118: role in biology
id: EUPH:1705

Axiom
annotated source: role in biology
annotated property: IAO_0000115
annotated target: A role in biology is a realisable entity in the biology domain that exist because the bearer is in a specific situation.
source: http://purl.obolibrary.org/obo/BFO_0000023

annotation on biological entities
type: Class
subclass of: information content entity in biology
IAO_0000115: An annotation on biological entities is a written explanatory or critical description, or other in-context information that has been associated with data or other types of information in the biology domain.
IAO_0000117: Michael Rubinigg
IAO_0000118: annotation on biological entities
id: EUPH:1706

Axiom
annotated source: annotation on biological entities
annotated property: IAO_0000115
annotated target: An annotation on biological entities is a written explanatory or critical description, or other in-context information that has been associated with data or other types of information in the biology domain.
has db xref: 10.1186/2041-1480-5-14

scientific name part
type: Class
subclass of: information content entity in biology
IAO_0000115: Part of a scientific name
IAO_0000117: Michael Rubinigg
IAO_0000118: scientific name part
id: EUPH:1707

independent continuant in plant production
type: Class
subclass of: continuant in plant production
IAO_0000115: An independent continuant in plant production is an continuant in the plant production domain that does not depend on another entity in any domain for its existence.
IAO_0000117: Michael Rubinigg
IAO_0000118: independent continuant in plant production
id: EUPH:1708

Axiom
annotated source: independent continuant in plant production
annotated property: IAO_0000115
annotated target: An independent continuant in plant production is an continuant in the plant production domain that does not depend on another entity in any domain for its existence.
source: http://purl.obolibrary.org/obo/BFO_0000004

number of beehives
type: Class
subclass of: unit of measure in beekeeping
subclass of: Restriction
  on property: quality of
  some values from: https://w3id.org/euph/8
IAO_0000115: The number of beehives.
IAO_0000117: Michael Rubinigg
IAO_0000118: number of beehives
id: EUPH:1709

honey bee nest component
type: Class
subclass of: fiat object part in beekeeping
IAO_0000115: A honey bee nest component is a material component of a honey bee nest.
IAO_0000117: Michael Rubinigg
IAO_0000118: honey bee nest component
id: EUPH:1763

pollen collection
type: Class
subclass of: collecting
subclass of: Restriction
  on property: has input
  some values from: pollen grain
subclass of: Restriction
  on property: has output
  some values from: pollen pellet
IAO_0000115: Pollen collection is a collecting bahavior of the majority of bees in which pollen ist collected by female bees from flowers of some Magnoliopsida.
IAO_0000117: Michael Rubinigg
IAO_0000118: pollen collection
id: EUPH:1765

precipitation
type: Class
subclass of: https://w3id.org/euph/979
IAO_0000115: All hydrometeors formed in the atmosphere, including liquid, solid, or a combination of the two (e.g., resulting from incomplete melting or freezing or from accretion), that are large enough to fall as a result of gravity.
IAO_0000117: Michael Rubinigg
IAO_0000118: Niederschlag @de
IAO_0000118: precipitation
id: EUPH:1785

Axiom
annotated source: precipitation
annotated property: IAO_0000115
annotated target: All hydrometeors formed in the atmosphere, including liquid, solid, or a combination of the two (e.g., resulting from incomplete melting or freezing or from accretion), that are large enough to fall as a result of gravity.
source: https://glossary.ametsoc.org/wiki/Precipitation

object aggregate in information science
type: Class
subclass of: https://w3id.org/euph/7573
IAO_0000115: An object aggregate in information science is a material entity in the information science domain that is a collection of disjoint self-standing single objects.
IAO_0000117: Michael Rubinigg
IAO_0000118: object aggregate in information science
id: EUPH:1788

Axiom
annotated source: object aggregate in information science
annotated property: IAO_0000115
annotated target: An object aggregate in information science is a material entity in the information science domain that is a collection of disjoint self-standing single objects.
source: http://purl.obolibrary.org/obo/BFO_0000030

association
type: Class
subclass of: object aggregate in information science
IAO_0000115: An association is a group of people organised for a joint purpose.
IAO_0000117: Michael Rubinigg
IAO_0000118: association
id: EUPH:1789

process in information science
type: Class
subclass of: occurrent in information science
IAO_0000115: A process in information science is an occurrent entity in the information science domain that inhabits the universal spatiotemporal region and has a proper temporal part.
IAO_0000117: Michael Rubinigg
IAO_0000118: process in information science
id: EUPH:1790

Axiom
annotated source: process in information science
annotated property: IAO_0000115
annotated target: A process in information science is an occurrent entity in the information science domain that inhabits the universal spatiotemporal region and has a proper temporal part.
source: http://purl.obolibrary.org/obo/BFO_0000015

honey super frame
type: Class
subclass of: frame
subclass of: Restriction
  on property: part of
  some values from: honey chamber
IAO_0000115: A honey super frame is a frame type used in a honey super of beehive types having different frame sizes.
IAO_0000117: Michael Rubinigg
IAO_0000118: Honigraumrähmchen @de
IAO_0000118: Honigrähmchen @de
IAO_0000118: cadre de hausse @fr
IAO_0000118: cuadro alza @es
IAO_0000118: halvramme @da
IAO_0000118: honingkamer raam @nl
IAO_0000118: honingkamerraampje @nl
IAO_0000118: honungsram @sv
IAO_0000118: honungsram i skattlåda @sv
IAO_0000118: quadro de alça @pt
IAO_0000118: ramă de magazin @ro
IAO_0000118: shallow frame
IAO_0000118: skatteramme @no
IAO_0000118: super-frame
IAO_0000118: telaino da melario @it
id: EUPH:18

piping of queen in cell
type: Class
subclass of: reproductive behavior of honey bees
subclass of: Restriction
  on property: has participant
  some values from: unmated queen
IAO_0000115: Piping of a queen in a cell is a reproductive behavior exhibited by an adult virgin queen within the queen cell that serves to inform the workers and the emerged queen that other queens are present [in the colony].
IAO_0000117: Michael Rubinigg
IAO_0000118: at kvække @da
IAO_0000118: at pibe @da
IAO_0000118: at tytte @da
IAO_0000118: att mana @sv
IAO_0000118: cantar @es
IAO_0000118: cantare @it
IAO_0000118: canto @pt
IAO_0000118: chanter @fr
IAO_0000118: cîntecul mătcii @ro
IAO_0000118: kwaken @nl
IAO_0000118: piping
IAO_0000118: quaken @de
IAO_0000118: to pipe
IAO_0000118: å tute @no
id: EUPH:1805

Axiom
annotated source: piping of queen in cell
annotated property: IAO_0000115
annotated target: Piping of a queen in a cell is a reproductive behavior exhibited by an adult virgin queen within the queen cell that serves to inform the workers and the emerged queen that other queens are present [in the colony].
has db xref: ISBN:0-674-07409-2

rendering wax
type: Class
subclass of: beeswax harvesting
subclass of: Restriction
  on property: precedes
  some values from: melting wax
IAO_0000115: Rendering wax is part of beeswax harvesting whereby wax is extracted from combs or other structures constructed by worker bees.
IAO_0000117: Michael Rubinigg
IAO_0000118: a extrage @ro
IAO_0000118: a recupera @ro
IAO_0000118: a topi @ro
IAO_0000118: at afsmelte @da
IAO_0000118: att rensa @sv
IAO_0000118: att smälta @sv
IAO_0000118: auslassen @de
IAO_0000118: einschmelzen @de
IAO_0000118: estraer @es
IAO_0000118: estrarre @it
IAO_0000118: extrair @pt
IAO_0000118: extraire @fr
IAO_0000118: rendering wax
IAO_0000118: smelten @nl
IAO_0000118: to render
IAO_0000118: å smelte ut @no
IAO_0000118: å utsmelte @no
id: EUPH:1817

apiary management
type: Class
subclass of: colony management
IAO_0000115: Apiary management is a colony management process specifically carried out on apiaries.
IAO_0000117: Michael Rubinigg
IAO_0000118: apiary management
id: EUPH:1818

plan specification in beekeeping
type: Class
subclass of: directive information entity in beekeeping
IAO_0000115: A plan specification in beekeeping is a directive information entity in the beekeeping domain with action specifications and objective specifications as parts, and that may be concretized as a realizable entity that, if realized, is realized in a process in which the bearer tries to achieve the objectives by taking the actions specified.
IAO_0000117: Michael Rubinigg
IAO_0000118: plan specification in beekeeping
id: EUPH:1823

Axiom
annotated source: plan specification in beekeeping
annotated property: IAO_0000115
annotated target: A plan specification in beekeeping is a directive information entity in the beekeeping domain with action specifications and objective specifications as parts, and that may be concretized as a realizable entity that, if realized, is realized in a process in which the bearer tries to achieve the objectives by taking the actions specified.
source: plan specification

honey extractor basket
type: Class
subclass of: hive product harvesting equipment component
subclass of: Restriction
  on property: part of
  some values from: honey extractor
IAO_0000115: A honey extractor basket is part of a honey extractor that serves to fix the honey frames in a specific position during the honey extraction process.
IAO_0000117: Michael Rubinigg
IAO_0000118: honey extractor basket
id: EUPH:1831

relational quality of information content entities in biology
type: Class
subclass of: https://w3id.org/euph/928
IAO_0000115: A relational quality of an information content entity in the biology domain.
IAO_0000117: Michael Rubinigg
IAO_0000118: relational quality of an information content entity in biology
id: EUPH:1840

Axiom
annotated source: relational quality of information content entities in biology
annotated property: IAO_0000115
annotated target: A relational quality of an information content entity in the biology domain.
source: relational quality in beekeeping

information content entity in veterinary medicine
type: Class
subclass of: generically dependent continuant in veterinary medicine
IAO_0000115: An information content entity in veterinary medicine is a generically dependent continuant im the veterinary medicine domain that is about some thing.
IAO_0000117: Michael Rubinigg
IAO_0000118: information content entity in veterinary medicine
id: EUPH:1852

Axiom
annotated source: information content entity in veterinary medicine
annotated property: IAO_0000115
annotated target: An information content entity in veterinary medicine is a generically dependent continuant im the veterinary medicine domain that is about some thing.
source: http://purl.obolibrary.org/obo/IAO_0000030

information content entity in beekeeping
type: Class
subclass of: generically dependent continuant in beekeeping
IAO_0000115: An information content entity in beekeeping is a generically dependent continuant in the beekeeping domain that is about some thing.
IAO_0000117: Michael Rubinigg
IAO_0000118: information content entity in beekeeping
id: EUPH:1863

Axiom
annotated source: information content entity in beekeeping
annotated property: IAO_0000115
annotated target: An information content entity in beekeeping is a generically dependent continuant in the beekeeping domain that is about some thing.
source: http://purl.obolibrary.org/obo/IAO_0000030

directive information entity in veterinary medicine
type: Class
subclass of: information content entity in veterinary medicine
IAO_0000115: A directive information entity in veterinary medicine is an information content entity in the veterinary medicine domain whose concretisations indicate to their bearer how to realise them in a process.
IAO_0000117: Michael Rubinigg
IAO_0000118: directive information entity in veterinary medicine
id: EUPH:1866

Axiom
annotated source: directive information entity in veterinary medicine
annotated property: IAO_0000115
annotated target: A directive information entity in veterinary medicine is an information content entity in the veterinary medicine domain whose concretisations indicate to their bearer how to realise them in a process.
source: directive information entity

relational quality of physiological entities
type: Class
subclass of: https://w3id.org/euph/928
IAO_0000115: A relational quality of physiological entities in the biology domain.
IAO_0000117: Michael Rubinigg
IAO_0000118: relational quality of physiological entities
id: EUPH:1867

Axiom
annotated source: relational quality of physiological entities
annotated property: IAO_0000115
annotated target: A relational quality of physiological entities in the biology domain.
source: relational quality in beekeeping

food stores
type: Class
subclass of: physiological role
subclass of: Restriction
  on property: output of
  some values from: food storage
IAO_0000115: Food stores are an aggregate of nutrient-rich substances or objects that are under the control of an organism or a social group of organisms and are stored for future consumption.
IAO_0000117: Michael Rubinigg
IAO_0000118: Nahrungsvorrat @de
IAO_0000118: Vorrat @de
IAO_0000118: food stores
IAO_0000118: forråd @da
IAO_0000118: förråd @sv
IAO_0000118: provisiones @es
IAO_0000118: provisions @fr
IAO_0000118: provisões @pt
IAO_0000118: provviste @it
IAO_0000118: reservas @es
IAO_0000118: rezerve @ro
IAO_0000118: réserves @fr
IAO_0000118: stores
IAO_0000118: voorraad @nl
id: EUPH:1868

maintenance process
type: Class
subclass of: multicellular organismal process
IAO_0000115: A maintenance process is a multicellular organismal process with the objective to maintain some or all of the characteristics of an organism or a social group of organisms over time.
IAO_0000117: Michael Rubinigg
IAO_0000118: maintenance process
id: EUPH:1869

food storage
type: Class
subclass of: maintenance process
subclass of: Restriction
  on property: has output
  some values from: food stores
IAO_0000115: Food storage is a maintenance process aimed at preserving and protecting food stores by keeping them in a specific location within an organism or within or near a nesting site or other location where an organism or social group of organisms resides for an extended period of time.
IAO_0000117: Michael Rubinigg
IAO_0000118: a acumula @ro
IAO_0000118: a depozita @ro
IAO_0000118: accumulare @it
IAO_0000118: accumuler @fr
IAO_0000118: acumular @es
IAO_0000118: almacenar @es
IAO_0000118: amasar @es
IAO_0000118: amasser @fr
IAO_0000118: armazenar @pt
IAO_0000118: at oplagre @da
IAO_0000118: att lagra @sv
IAO_0000118: aufspeichern @de
IAO_0000118: food storage
IAO_0000118: immagazzinare @it
IAO_0000118: opslaan @nl
IAO_0000118: speichern @de
IAO_0000118: to store
IAO_0000118: voorraad maken @nl
IAO_0000118: å lagre @no
id: EUPH:1870

nesting cavity
type: Class
subclass of: ecological role
subclass of: Restriction
  on property: role of
  some values from: cavity
IAO_0000115: A nesting cavity is a sheltered, enclosed chamber (excavated or pre-existing) used by organisms or social groups of organisms to raise their young and protect themselves and their young from unfavourable biotic (e.g. predators) and abiotic (e.g. weather) factors.
IAO_0000117: Michael Rubinigg
IAO_0000118: Nisthöhle @de
IAO_0000118: nesting cavity
id: EUPH:1873

cavity
type: Class
subclass of: ecological space
IAO_0000115: A cavity is a sheltered, enclosed chamber (excavated or pre-existing) in plant tissue (trunk or stem), in rock or in the ground, often used by animals for specific purposes.
IAO_0000117: Michael Rubinigg
IAO_0000118: Hohlraum @de
IAO_0000118: cavity
id: EUPH:1874

one-dimensional temporal region in biology
type: Class
subclass of: temporal region in biology
IAO_0000115: A one-dimensional temporal region in biology is a temporal region in the biology domain that has one dimension.
IAO_0000117: Michael Rubinigg
IAO_0000118: one-dimensional temporal region in biology
id: EUPH:1875

Axiom
annotated source: one-dimensional temporal region in biology
annotated property: IAO_0000115
annotated target: A one-dimensional temporal region in biology is a temporal region in the biology domain that has one dimension.
source: http://purl.obolibrary.org/obo/BFO_0000038

behavioural role
type: Class
subclass of: role in biology
IAO_0000115: A behavioural role is a functional role adopted by an individual that is shaped by the anatomical, physiological or environmental context.
IAO_0000117: Michael Rubinigg
IAO_0000118: behavioural role
id: EUPH:1876

quality of apiaries
type: Class
subclass of: hive management quality
subclass of: Restriction
  on property: quality of
  some values from: apiary
IAO_0000115: A quality of apiaries is a hive management quality that is related to apiaries.
IAO_0000117: Michael Rubinigg
IAO_0000118: quality of apiaries
id: EUPH:1877

relational quality of colonies
type: Class
subclass of: relational quality in beekeeping
IAO_0000115: A relational quality of colonies is a hive management quality that is related to honey bee colonies and one or more other non-identical entities.
IAO_0000117: Michael Rubinigg
IAO_0000118: relational quality of colonies
id: EUPH:1878

Axiom
annotated source: relational quality of colonies
annotated property: IAO_0000115
annotated target: A relational quality of colonies is a hive management quality that is related to honey bee colonies and one or more other non-identical entities.
source: relational quality in beekeeping

quality of combs
type: Class
subclass of: hive management quality
IAO_0000115: A quality of combs is a hive management quality that is related to combs.
IAO_0000117: Michael Rubinigg
IAO_0000118: quality of combs
id: EUPH:1879

unsealed
type: Class
subclass of: quality of combs
subclass of: Restriction
  on property: quality of
  some values from: https://w3id.org/euph/824
IAO_0000115: A condition related to the isolation of the distal part of one or more cells of a comb from its surroundings by a cap of beeswax, which is applied when the cap on each cell is partially or completely missing.
IAO_0000117: Michael Rubinigg
IAO_0000118: offen @de
IAO_0000118: uncapped
IAO_0000118: unsealed
IAO_0000118: unverdeckelt @de
id: EUPH:1880

sheltered site
type: Class
subclass of: quality of apiaries
IAO_0000115: A sheltered site is an apiary that is protected primarily from wind, but also from other adverse influences.
IAO_0000117: Michael Rubinigg
IAO_0000118: beschutte plaats @nl
IAO_0000118: beskyttet plads @da
IAO_0000118: geschützte Lage @de
IAO_0000118: lieu abrité @fr
IAO_0000118: loc adăpostit @ro
IAO_0000118: lugar abrigado @es
IAO_0000118: lun plass @no
IAO_0000118: luogo riparato @it
IAO_0000118: sheltered site
IAO_0000118: sheltered situation
IAO_0000118: sitio abrigado @es
IAO_0000118: situation abritée @fr
IAO_0000118: situação abrigada @pt
IAO_0000118: skyddat läge @sv
IAO_0000118: sítio abrigado @pt
IAO_0000118: vatră adăpostită @ro
id: EUPH:1882

exposed site
type: Class
subclass of: quality of apiaries
IAO_0000115: An exposed site is an apiary that is not protected from wind or other adverse influences.
IAO_0000117: Michael Rubinigg
IAO_0000118: exposed site
IAO_0000118: exposed situation
IAO_0000118: loc expus @ro
IAO_0000118: local exposto @pt
IAO_0000118: lugar expuesto @es
IAO_0000118: luogo esposto @it
IAO_0000118: open ligging @nl
IAO_0000118: oskyddat läge @sv
IAO_0000118: site exposé @fr
IAO_0000118: sitio expuesto @es
IAO_0000118: situation exposée @fr
IAO_0000118: situação exposta @pt
IAO_0000118: sítio exposto @pt
IAO_0000118: ubeskyttet plads @da
IAO_0000118: unbeschutte ligging @nl
IAO_0000118: ungeschützte Lage @de
IAO_0000118: utsatt plass @no
IAO_0000118: vatră expusă @ro
id: EUPH:1883

immature drone bee
type: Class
subclass of: immature honey bee
IAO_0000115: An immature drone bee is an immature honey bee that is going to develop into an adult drone bee.
IAO_0000117: Michael Rubinigg
IAO_0000118: immature drone
id: EUPH:1894

adult worker bee
type: Class
subclass of: adult honey bee
IAO_0000115: An adult worker bee is an adult honey bee that has developed into a worker bee.
IAO_0000117: Michael Rubinigg
IAO_0000118: adult worker bee
id: EUPH:1895

role in plant production
type: Class
subclass of: realisable entitiy in plant production
IAO_0000115: A role in plant production is a realisable entitiy in the plant production domain that exists, because the bearer is in a specific situation.
IAO_0000117: Michael Rubinigg
IAO_0000118: role in plant production
id: EUPH:1978

Axiom
annotated source: role in plant production
annotated property: IAO_0000115
annotated target: A role in plant production is a realisable entitiy in the plant production domain that exists, because the bearer is in a specific situation.
source: http://purl.obolibrary.org/obo/BFO_0000023

pollen
type: Class
subclass of: honey bee forage
subclass of: Restriction
  on property: has part
  some values from: pollen grain
IAO_0000115: Pollen is a honey bee forage that has been defined as follows: Usually a powdery substance consisting of pollen grains which are male microgametophytes of seed plants, which produce male gametes. Male reproductive cells of flowers collected at anthers and used by bees for rearing their young. It is the protein part of the diet [...].
IAO_0000117: Michael Rubinigg
IAO_0000118: Blumenmehl @de
IAO_0000118: Blütenstaub @de
IAO_0000118: Pollen @de
IAO_0000118: blomsterstøv @da
IAO_0000118: frömjöl @sv
IAO_0000118: polen @es
IAO_0000118: pollen @da
IAO_0000118: polline @it
IAO_0000118: pólen @pt
IAO_0000118: stuifmeel @nl
id: EUPH:20

Axiom
annotated source: pollen
annotated property: IAO_0000115
annotated target: Pollen is a honey bee forage that has been defined as follows: Usually a powdery substance consisting of pollen grains which are male microgametophytes of seed plants, which produce male gametes. Male reproductive cells of flowers collected at anthers and used by bees for rearing their young. It is the protein part of the diet [...].
has db xref: ISBN:1-878075-65-4

object aggregate in veterinary medicine
type: Class
subclass of: material entity in veterinary medicine
IAO_0000115: An object aggregate in veterinary medicine is a material entity in the veterinary medicine domain that is a collection of disjoint self-standing single objects.
IAO_0000117: Michael Rubinigg
IAO_0000118: object aggregate in veterinary medicine
id: EUPH:2008

Axiom
annotated source: object aggregate in veterinary medicine
annotated property: IAO_0000115
annotated target: An object aggregate in veterinary medicine is a material entity in the veterinary medicine domain that is a collection of disjoint self-standing single objects.
source: http://purl.obolibrary.org/obo/BFO_0000027

role of organisms in veterinary medicine
type: Class
subclass of: role in veterinary medicine
IAO_0000115: A role of organisms in veterinary medicine is a role played by an organism in the veterinary medicine domain.
IAO_0000117: Michael Rubinigg
IAO_0000118: role of organisms in veterinary medicine
id: EUPH:2009

role in animal breeding
type: Class
subclass of: realisable entitiy in animal breeding
IAO_0000115: A role in animal breeding is a realisable entitiy in the animal breeding domain that exists, because the bearer is in a specific situation.
IAO_0000117: Michael Rubinigg
IAO_0000118: role in animal breeding
id: EUPH:2024

Axiom
annotated source: role in animal breeding
annotated property: IAO_0000115
annotated target: A role in animal breeding is a realisable entitiy in the animal breeding domain that exists, because the bearer is in a specific situation.
source: http://purl.obolibrary.org/obo/BFO_0000023

immaterial entity in geography
type: Class
subclass of: independent continuant in geography
IAO_0000115: An immaterial entity in geography is an independent continuant in the geography domain that never has any portion of matter as a continuant part.
IAO_0000117: Michael Rubinigg
IAO_0000118: immaterial entity in geography
id: EUPH:2027

Axiom
annotated source: immaterial entity in geography
annotated property: IAO_0000115
annotated target: An immaterial entity in geography is an independent continuant in the geography domain that never has any portion of matter as a continuant part.
source: immaterial ecological entity

bee bread production
type: Class
subclass of: collecting
subclass of: Restriction
  on property: preceded by
  some values from: pollen collection
subclass of: Restriction
  on property: has input
  some values from: pollen pellet
subclass of: Restriction
  on property: has output
  some values from: bee bread
IAO_0000115: Bee bread production is a collecting behavior in which pollen collected from flowers is supplied with glandular secretions produced by worker bees and finally stored in uncapped cells of the comb, usually adjacent to the brood nest.
IAO_0000117: Michael Rubinigg
IAO_0000118: bee bread production
id: EUPH:2037

lithostratigraphic unit
type: Class
subclass of: https://w3id.org/euph/991
IAO_0000115: Lithostratigraphic units are bodies of rocks, bedded or unbedded, that are defined and characterized on the basis of their lithologic properties and their stratigraphic relations. Lithostratigraphic units are the basic units of geologic mapping.
IAO_0000117: Michael Rubinigg
IAO_0000118: lithostratigraphic unit
id: EUPH:2046

Axiom
annotated source: lithostratigraphic unit
annotated property: IAO_0000115
annotated target: Lithostratigraphic units are bodies of rocks, bedded or unbedded, that are defined and characterized on the basis of their lithologic properties and their stratigraphic relations. Lithostratigraphic units are the basic units of geologic mapping.
source: https://stratigraphy.org/guide/

chronostratigraphic unit
type: Class
subclass of: https://w3id.org/euph/991
IAO_0000115: Chronostratigraphic units are bodies of rocks, layered or unlayered, that are defined between specified stratigraphic horizons which represent specified intervals of geologic time.
IAO_0000117: Michael Rubinigg
IAO_0000118: chronostratigraphic unit
id: EUPH:2047

Axiom
annotated source: chronostratigraphic unit
annotated property: IAO_0000115
annotated target: Chronostratigraphic units are bodies of rocks, layered or unlayered, that are defined between specified stratigraphic horizons which represent specified intervals of geologic time.
source: https://stratigraphy.org/guide/

object in geography
type: Class
subclass of: material entity in geography
IAO_0000115: An object in geography is a material entity in the geography domain that is neither a collection of disjoint self-standing single objects, nor a proper part of an object.
IAO_0000117: Michael Rubinigg
IAO_0000118: object in geography
id: EUPH:2048

Axiom
annotated source: object in geography
annotated property: IAO_0000115
annotated target: An object in geography is a material entity in the geography domain that is neither a collection of disjoint self-standing single objects, nor a proper part of an object.
source: http://purl.obolibrary.org/obo/BFO_0000030

roof
type: Class
subclass of: https://w3id.org/euph/8163
IAO_0000115: A roof is a beehive component that forms the top covering of the hive.
IAO_0000117: Michael Rubinigg
IAO_0000118: Dach @de
IAO_0000118: capac @ro
IAO_0000118: cobertura @pt
IAO_0000118: dak @nl
IAO_0000118: roof
IAO_0000118: tag @da
IAO_0000118: tak @no
IAO_0000118: tampa @pt
IAO_0000118: tapa @es
IAO_0000118: techado @es
IAO_0000118: tecto @pt
IAO_0000118: tetto @it
IAO_0000118: tettoia @it
IAO_0000118: toit @fr
IAO_0000118: toiture @fr
id: EUPH:2058

honey from Apis mellifera
type: Class
subclass of: honey
subclass of: Restriction
  on property: produced by
  some values from: https://www.gbif.org/species/1341976
IAO_0000115: Honey from Apis mellifera is honey collected and processed by the Western honey bee Apis mellifera.
IAO_0000117: Michael Rubinigg
IAO_0000118: honey from Apis mellifera
id: EUPH:2084

honey from Apis cerana
type: Class
subclass of: honey
subclass of: Restriction
  on property: produced by
  some values from: https://www.gbif.org/species/1341979
IAO_0000115: Honey from Apis cerana is honey collected and processed by the Eastern honey bee Apis cerana.
IAO_0000117: Michael Rubinigg
IAO_0000118: honey from Apis cerana
id: EUPH:2085

independent continuant in animal breeding
type: Class
subclass of: continuant in animal breeding
IAO_0000115: An independent continuant in animal breeding is a continuant in the animal breeding domain that never depends on another entity in any domain for its existence.
IAO_0000117: Michael Rubinigg
IAO_0000118: independent continuant in animal breeding
id: EUPH:2088

Axiom
annotated source: independent continuant in animal breeding
annotated property: IAO_0000115
annotated target: An independent continuant in animal breeding is a continuant in the animal breeding domain that never depends on another entity in any domain for its existence.
source: http://purl.obolibrary.org/obo/BFO_0000004

document in beekeeping
type: Class
subclass of: information content entity in beekeeping
IAO_0000115: A document in beekeeping is a collection of information content entities in the beekeeping domain intended to be understood together as a whole.
IAO_0000117: Michael Rubinigg
IAO_0000118: document in beekeeping
id: EUPH:2093

Axiom
annotated source: document in beekeeping
annotated property: IAO_0000115
annotated target: A document in beekeeping is a collection of information content entities in the beekeeping domain intended to be understood together as a whole.
source: document

hive product harvesting equipment component
type: Class
subclass of: beekeeping equipment component
subclass of: Restriction
  on property: part of
  some values from: hive product harvesting equipment
IAO_0000115: A hive product harvesting equipment component is a beekeeping equipment part that is part of hive product harvesting equipment.
IAO_0000117: Michael Rubinigg
IAO_0000118: hive product harvesting equipment component
id: EUPH:2094

hive product processing equipment component
type: Class
subclass of: beekeeping equipment component
subclass of: Restriction
  on property: part of
  some values from: hive product processing equipment
IAO_0000115: A hive product processing equipment component is a beekeeping equipment part that is part of hive product processing equipment.
IAO_0000117: Michael Rubinigg
IAO_0000118: hive product processing equipment component
id: EUPH:2095

beekeeping vehicle component
type: Class
subclass of: general beekeeping equipment component
IAO_0000115: A beekeeping vehicle component is a general beekeeping equipment part that is part of a beekeeping vehicle.
IAO_0000117: Michael Rubinigg
IAO_0000118: beekeeping vehicle component
id: EUPH:2096

general beekeeping equipment component
type: Class
subclass of: beekeeping equipment component
IAO_0000115: A general beekeeping equipment component is a beekeeping equipment part that is part of general beekeeping equipment.
IAO_0000117: Michael Rubinigg
IAO_0000118: general beekeeping equipment component
id: EUPH:2097

queen breeding and rearing equipment component
type: Class
subclass of: beekeeping equipment component
IAO_0000115: A queen breeding and rearing equipment component is a beekeeping equipment part that is part of queen breeding and rearing equipment.
IAO_0000117: Michael Rubinigg
IAO_0000118: queen breeding and rearing equipment component
id: EUPH:2098

independent continuant in engineering
type: Class
subclass of: continuant in engineering
IAO_0000115: An independent continuant in engineering is a continuant entity in the engineering domain that does not depend on another entity in any domain for its existence.
IAO_0000117: Michael Rubinigg
IAO_0000118: independent continuant in engineering
id: EUPH:2099

Axiom
annotated source: independent continuant in engineering
annotated property: IAO_0000115
annotated target: An independent continuant in engineering is a continuant entity in the engineering domain that does not depend on another entity in any domain for its existence.
source: http://purl.obolibrary.org/obo/BFO_0000004

comb
type: Class
subclass of: honey bee nest component
subclass of: Restriction
  on property: part of
  some values from: honey bee nest
subclass of: Restriction
  on property: produced by
  some values from: wax-making bee
IAO_0000115: A structure inside the nest of social insects to breed offspring and/or to store food. It is made by the insects themselves or after a help from the human.
IAO_0000117: Michael Rubinigg
IAO_0000118: Wabe @de
IAO_0000118: comb
IAO_0000118: fagure @ro
IAO_0000118: favo @it
IAO_0000118: panal @es
IAO_0000118: raat @nl
IAO_0000118: rayon @fr
IAO_0000118: tavle @da
IAO_0000118: vaxkaka @sv
IAO_0000118: vokstavle @no
id: EUPH:21

honeydew flow
type: Class
subclass of: honey flow
IAO_0000115: Honeydew flow is a honey flow from honeydew.
IAO_0000117: Michael Rubinigg
IAO_0000118: Honigtautracht @de
IAO_0000118: honeydew flow
id: EUPH:2112

continuant in plant production
type: Class
subclass of: entity in plant production
IAO_0000115: A continuant in plant production is an entity in the plant production domain that persists through time while maintaining its identity, such as objects.
IAO_0000117: Michael Rubinigg
IAO_0000118: continuant in plant production
id: EUPH:2129

Axiom
annotated source: continuant in plant production
annotated property: IAO_0000115
annotated target: A continuant in plant production is an entity in the plant production domain that persists through time while maintaining its identity, such as objects.
source: http://purl.obolibrary.org/obo/BFO_0000002

specifically dependent continuant in plant production
type: Class
subclass of: continuant in plant production
IAO_0000115: A specifically dependent continuant in plant production is a continuant in the plant production domain that does not exist on its own, but requires a specific single entity in any other domain to exist.
IAO_0000117: Michael Rubinigg
IAO_0000118: specifically dependent continuant in plant production
id: EUPH:2130

Axiom
annotated source: specifically dependent continuant in plant production
annotated property: IAO_0000115
annotated target: A specifically dependent continuant in plant production is a continuant in the plant production domain that does not exist on its own, but requires a specific single entity in any other domain to exist.
source: http://purl.obolibrary.org/obo/BFO_0000020

object aggregate in geography
type: Class
subclass of: material entity in geography
IAO_0000115: An object aggregate in geography is a material entity in the geography domain that is a collection of disjoint self-standing single objects.
IAO_0000117: Michael Rubinigg
IAO_0000118: object aggregate in geography
id: EUPH:2144

Axiom
annotated source: object aggregate in geography
annotated property: IAO_0000115
annotated target: An object aggregate in geography is a material entity in the geography domain that is a collection of disjoint self-standing single objects.
source: http://purl.obolibrary.org/obo/BFO_0000027

one-dimensional spatial region in geography
type: Class
subclass of: spatial region in geography
IAO_0000115: A one-dimensional spatial region in geography is a spatial region in the geography domain that has one dimension.
IAO_0000117: Michael Rubinigg
IAO_0000118: one-dimensional spatial region in geography
id: EUPH:2145

Axiom
annotated source: one-dimensional spatial region in geography
annotated property: IAO_0000115
annotated target: A one-dimensional spatial region in geography is a spatial region in the geography domain that has one dimension.
source: http://purl.obolibrary.org/obo/BFO_0000026

realisable entitiy in plant production
type: Class
subclass of: specifically dependent continuant in plant production
IAO_0000115: A realisable entitiy in plant production is a specifically dependent continuant in the plant production domain that requires some further process to be realised.
IAO_0000117: Michael Rubinigg
IAO_0000118: realisable entitiy in plant production
id: EUPH:2147

Axiom
annotated source: realisable entitiy in plant production
annotated property: IAO_0000115
annotated target: A realisable entitiy in plant production is a specifically dependent continuant in the plant production domain that requires some further process to be realised.
source: http://purl.obolibrary.org/obo/BFO_0000017

article
type: Class
subclass of: document
IAO_0000115: A self-contained work made widely available in a printed publication or a website, where some level of persistence or stewardship is expecteds.
IAO_0000117: Michael Rubinigg
IAO_0000118: article
id: EUPH:219

cell
type: Class
subclass of: honey bee nest component
subclass of: Restriction
  on property: part of
  some values from: comb
subclass of: Restriction
  on property: produced by
  some values from: wax-making bee
IAO_0000115: A cell is a hexagonal prismatic structure built by honey bees or other insects in their nests to contain brood and/or stores of honey and/or pollen.
IAO_0000117: Michael Rubinigg
IAO_0000118: Zelle @de
IAO_0000118: alvéole @fr
IAO_0000118: alvéolo @es
IAO_0000118: cel @nl
IAO_0000118: celda @es
IAO_0000118: cell
IAO_0000118: cella @it
IAO_0000118: celle @da
IAO_0000118: cellule @fr
IAO_0000118: celulă de fagure @ro
IAO_0000118: célula @pt
id: EUPH:22

Statistic Austria
type: Class
subclass of: EUROSTAT
IAO_0000115: Statistics Austria, known locally as Statistik Austria, is the official name of Austria's Federal Statistical Office (German: Bundesanstalt Statistik Österreich), the country's agency for collecting and publishing official statistics related to Austria.
IAO_0000117: Michael Rubinigg
IAO_0000118: Statistic Austria @de
IAO_0000118: Statistics Austria
id: EUPH:220

Axiom
annotated source: Statistic Austria
annotated property: IAO_0000115
annotated target: Statistics Austria, known locally as Statistik Austria, is the official name of Austria's Federal Statistical Office (German: Bundesanstalt Statistik Österreich), the country's agency for collecting and publishing official statistics related to Austria.
source: https://en.wikipedia.org/w/index.php

disease treatment
type: Class
subclass of: disease control
IAO_0000115: A disease treatment is a disease control measure that acts on biological processes of the diseased organism or of the pathogen.
IAO_0000117: Michael Rubinigg
IAO_0000118: Behandlung @de
IAO_0000118: Bekämpfung @de
IAO_0000118: Heilverfahren @de
IAO_0000118: behandeling @nl
IAO_0000118: behandling @da
IAO_0000118: bestrijding @nl
IAO_0000118: cura @es
IAO_0000118: traitement @fr
IAO_0000118: tratament @ro
IAO_0000118: tratamento @pt
IAO_0000118: tratamiento @es
IAO_0000118: trattamento @it
IAO_0000118: treatment
id: EUPH:2204

material entity in geography
type: Class
subclass of: independent continuant in geography
IAO_0000115: A material entity in geography is an independent continuant in the geography domain that always has some portion of matter as a continuant part.
IAO_0000117: Michael Rubinigg
IAO_0000118: material entity in geography
id: EUPH:2205

Axiom
annotated source: material entity in geography
annotated property: IAO_0000115
annotated target: A material entity in geography is an independent continuant in the geography domain that always has some portion of matter as a continuant part.
source: http://purl.obolibrary.org/obo/BFO_0000040

risk management
type: Class
subclass of: risk analysis
IAO_0000115: Risk management is a risk analysis process that has been defined as [...] the process of identifying, selecting and implementing measures that can be applied to reduce the level of risk.
IAO_0000117: Michael Rubinigg
IAO_0000118: risk management
id: EUPH:2206

Axiom
annotated source: risk management
annotated property: IAO_0000115
annotated target: Risk management is a risk analysis process that has been defined as [...] the process of identifying, selecting and implementing measures that can be applied to reduce the level of risk.
has db xref: ISBN:978-92-95115-40-8

grafting tool
type: Class
subclass of: grafting equipment
IAO_0000115: A grafting tool is any hand-held tool used for grafting honey bee larvae.
IAO_0000117: Michael Rubinigg
IAO_0000118: Umlarvlöffel @de
IAO_0000118: Umlarvlöffelchen @de
IAO_0000118: agulha de repicagem @pt
IAO_0000118: cogli-larve @it
IAO_0000118: colher de repicagem @pt
IAO_0000118: colher de transferir larvas @pt
IAO_0000118: cucharita para trasplante de larvas @es
IAO_0000118: entlepeltje @nl
IAO_0000118: grafting tool
IAO_0000118: omlarvenål @da
IAO_0000118: omlarvningsnål @no
IAO_0000118: picking @fr
IAO_0000118: piglia-larve @it
IAO_0000118: raccogli-larve @it
IAO_0000118: spatulă @ro
IAO_0000118: transferring tool
id: EUPH:2207

transferring
type: Class
subclass of: hive management
IAO_0000115: Transferring is the process of moving a honey bee colony from one container to another.
IAO_0000117: Michael Rubinigg
IAO_0000118: a transvaza @ro
IAO_0000118: at omhuse @da
IAO_0000118: at overføre @da
IAO_0000118: att överflytta @sv
IAO_0000118: overbrengen @nl
IAO_0000118: to transfer
IAO_0000118: transfegar @pt
IAO_0000118: transferir @pt
IAO_0000118: transvasar @es
IAO_0000118: transvaser @fr
IAO_0000118: trasegar @es
IAO_0000118: travasare @it
IAO_0000118: umlogieren @de
IAO_0000118: å overføre @no
id: EUPH:2208

top drive
type: Class
subclass of: beekeeping equipment drive
IAO_0000115: A top drive is a drive which is mounted on the top of an appliance, e.g. a honey extractor.
IAO_0000117: Michael Rubinigg
IAO_0000118: Oberantrieb @de
IAO_0000118: angrenaj superior @ro
IAO_0000118: bovenaandrijving @nl
IAO_0000118: drevet foroven @da
IAO_0000118: drift ovenfra @no
IAO_0000118: engranaje superior @es
IAO_0000118: engrenage supérieur @fr
IAO_0000118: engrenagem superior @pt
IAO_0000118: ingranaggio superiore @it
IAO_0000118: ovenhjulsdrift @sv
IAO_0000118: top drive
id: EUPH:2209

function related to beekeeping equipment
type: Class
subclass of: function in beekeeping
IAO_0000115: A function related to beekeeping equipment is a function in the beekeeping domain that has been designed to realise specific processes in which beekeeping equipment is involved.
IAO_0000117: Michael Rubinigg
IAO_0000118: function related to beekeeping equipment
id: EUPH:2210

function related to hive management
type: Class
subclass of: function in beekeeping
IAO_0000115: A function related to hive management is a function in the beekeeping domain that exists (by evolution or design) to realise specific processes in hive management.
IAO_0000117: Michael Rubinigg
IAO_0000118: function related to hive management
id: EUPH:2211

frame component
type: Class
subclass of: https://w3id.org/euph/8163
subclass of: Restriction
  on property: part of
  some values from: frame
IAO_0000115: A frame component is a beehive component that is part of a frame
IAO_0000117: Michael Rubinigg
IAO_0000118: frame component
id: EUPH:2212

occurrent in information science
type: Class
subclass of: entity in information science
IAO_0000115: An occurrent in information science is an entity in the information science domain that unfolds through time and does not exist wholly at a single moment.
IAO_0000117: Michael Rubinigg
IAO_0000118: occurrent in information science
id: EUPH:2213

Axiom
annotated source: occurrent in information science
annotated property: IAO_0000115
annotated target: An occurrent in information science is an entity in the information science domain that unfolds through time and does not exist wholly at a single moment.
source: http://purl.obolibrary.org/obo/BFO_0000003

occurrent in chemistry
type: Class
subclass of: entity in chemistry
IAO_0000115: An occurrent in chemistry is an entity in the chemistry domain that unfolds through time and does not exist wholly at a single moment.
IAO_0000117: Michael Rubinigg
IAO_0000118: occurrent in chemistry
id: EUPH:2214

Axiom
annotated source: occurrent in chemistry
annotated property: IAO_0000115
annotated target: An occurrent in chemistry is an entity in the chemistry domain that unfolds through time and does not exist wholly at a single moment.
source: http://purl.obolibrary.org/obo/BFO_0000003

continuant in engineering
type: Class
subclass of: entity in engineering
IAO_0000115: A continuant in engineering is an entity in the engineering domain that persists through time while maintaining its identity, such as objects.
IAO_0000117: Michael Rubinigg
IAO_0000118: continuant in engineering
id: EUPH:2215

Axiom
annotated source: continuant in engineering
annotated property: IAO_0000115
annotated target: A continuant in engineering is an entity in the engineering domain that persists through time while maintaining its identity, such as objects.
source: http://purl.obolibrary.org/obo/BFO_0000002

object in engineering
type: Class
subclass of: material entity in engineering
IAO_0000115: An object in engineering is a material entity in the engineering domain that is neither a collection of disjoint self-standing single objects, nor a proper part of an object.
IAO_0000117: Michael Rubinigg
IAO_0000118: object in engineering
id: EUPH:2216

Axiom
annotated source: object in engineering
annotated property: IAO_0000115
annotated target: An object in engineering is a material entity in the engineering domain that is neither a collection of disjoint self-standing single objects, nor a proper part of an object.
source: http://purl.obolibrary.org/obo/BFO_0000030

function in biology
type: Class
subclass of: disposition in biology
IAO_0000115: A function in biology is a disposition in the biology domain that exist by evolution or design to realise specific processes.
IAO_0000117: Michael Rubinigg
IAO_0000118: function in biology
id: EUPH:2217

Axiom
annotated source: function in biology
annotated property: IAO_0000115
annotated target: A function in biology is a disposition in the biology domain that exist by evolution or design to realise specific processes.
source: http://purl.obolibrary.org/obo/BFO_0000034

fiat object part in biology
type: Class
subclass of: material entity in biology
IAO_0000115: A fiat object part in biology is a material entity in the biology domain that is not a collection of disjoint self-standing single objects, but a proper part of an object.
IAO_0000117: Michael Rubinigg
IAO_0000118: fiat object part in biology
id: EUPH:2218

Axiom
annotated source: fiat object part in biology
annotated property: IAO_0000115
annotated target: A fiat object part in biology is a material entity in the biology domain that is not a collection of disjoint self-standing single objects, but a proper part of an object.
source: http://purl.obolibrary.org/obo/BFO_0000024

occurrent in biology
type: Class
subclass of: entity in biology
IAO_0000115: An occurrent in biology is an entity in the biology domain that unfolds through time and does not exist wholly at a single moment.
IAO_0000117: Michael Rubinigg
IAO_0000118: occurrent in biology
id: EUPH:2219

Axiom
annotated source: occurrent in biology
annotated property: IAO_0000115
annotated target: An occurrent in biology is an entity in the biology domain that unfolds through time and does not exist wholly at a single moment.
source: http://purl.obolibrary.org/obo/BFO_0000003

continuant in biology
type: Class
subclass of: entity in biology
IAO_0000115: A continuant in biology is an entity in the biology domain that persists through time while maintaining its identity, such as objects.
IAO_0000117: Michael Rubinigg
IAO_0000118: continuant in biology
id: EUPH:2220

Axiom
annotated source: continuant in biology
annotated property: IAO_0000115
annotated target: A continuant in biology is an entity in the biology domain that persists through time while maintaining its identity, such as objects.
source: http://purl.obolibrary.org/obo/BFO_0000002

information content entity in geology
type: Class
subclass of: generically dependent continuant in geology
IAO_0000115: An information content entity in geology is an generically dependent continuant in the geology domain that unfolds through time and does not exist wholly at a single moment.
IAO_0000117: Michael Rubinigg
IAO_0000118: information content entity in geology
id: EUPH:2221

Axiom
annotated source: information content entity in geology
annotated property: IAO_0000115
annotated target: An information content entity in geology is an generically dependent continuant in the geology domain that unfolds through time and does not exist wholly at a single moment.
source: http://purl.obolibrary.org/obo/IAO_0000030

object in information science
type: Class
subclass of: https://w3id.org/euph/7573
IAO_0000115: An object in information science is a material entity in the information science domain that is neither a collection of disjoint self-standing single objects, nor a proper part of an object.
IAO_0000117: Michael Rubinigg
IAO_0000118: object in information science
id: EUPH:2222

Axiom
annotated source: object in information science
annotated property: IAO_0000115
annotated target: An object in information science is a material entity in the information science domain that is neither a collection of disjoint self-standing single objects, nor a proper part of an object.
source: http://purl.obolibrary.org/obo/BFO_0000030

continuant in pharmacology
type: Class
subclass of: https://w3id.org/euph/8106
IAO_0000115: A continuant in pharmacology is an entity in the pharmacology domain that persists through time while maintaining its identity, such as objects.
IAO_0000117: Michael Rubinigg
IAO_0000118: continuant in pharmacology
id: EUPH:2223

Axiom
annotated source: continuant in pharmacology
annotated property: IAO_0000115
annotated target: A continuant in pharmacology is an entity in the pharmacology domain that persists through time while maintaining its identity, such as objects.
source: http://purl.obolibrary.org/obo/BFO_0000002

occurrent in veterinary medicine
type: Class
subclass of: entity in veterinary medicine
IAO_0000115: An occurrent in veterinary medicine is an entity in the veterinary medicine domain that unfolds through time and does not exist wholly at a single moment.
IAO_0000117: Michael Rubinigg
IAO_0000118: occurrent in veterinary medicine
id: EUPH:2224

Axiom
annotated source: occurrent in veterinary medicine
annotated property: IAO_0000115
annotated target: An occurrent in veterinary medicine is an entity in the veterinary medicine domain that unfolds through time and does not exist wholly at a single moment.
source: http://purl.obolibrary.org/obo/BFO_0000003

continuant in veterinary medicine
type: Class
subclass of: entity in veterinary medicine
IAO_0000115: A continuant in veterinary medicine is an entity in the veterinary medicine domain that persists through time while maintaining its identity, such as objects.
IAO_0000117: Michael Rubinigg
IAO_0000118: continuant in veterinary medicine
id: EUPH:2225

Axiom
annotated source: continuant in veterinary medicine
annotated property: IAO_0000115
annotated target: A continuant in veterinary medicine is an entity in the veterinary medicine domain that persists through time while maintaining its identity, such as objects.
source: http://purl.obolibrary.org/obo/BFO_0000002

continuant in chemistry
type: Class
subclass of: entity in chemistry
IAO_0000115: A continuant in chemistry is an entity in the chemistry domain that persists through time while maintaining its identity, such as objects.
IAO_0000117: Michael Rubinigg
IAO_0000118: continuant in chemistry
id: EUPH:2226

Axiom
annotated source: continuant in chemistry
annotated property: IAO_0000115
annotated target: A continuant in chemistry is an entity in the chemistry domain that persists through time while maintaining its identity, such as objects.
source: http://purl.obolibrary.org/obo/BFO_0000002

continuant in geography
type: Class
subclass of: https://w3id.org/euph/960
IAO_0000115: A continuant in geography is an entity in the geography domain that persists through time while maintaining its identity, such as objects.
IAO_0000117: Michael Rubinigg
IAO_0000118: continuant in geography
id: EUPH:2227

Axiom
annotated source: continuant in geography
annotated property: IAO_0000115
annotated target: A continuant in geography is an entity in the geography domain that persists through time while maintaining its identity, such as objects.
source: http://purl.obolibrary.org/obo/BFO_0000002

continuant in geology
type: Class
subclass of: entity in geology
IAO_0000115: A continuant in geology is an entity in the geology domain that persists through time while maintaining its identity, such as objects.
IAO_0000117: Michael Rubinigg
IAO_0000118: continuant in geology
id: EUPH:2228

Axiom
annotated source: continuant in geology
annotated property: IAO_0000115
annotated target: A continuant in geology is an entity in the geology domain that persists through time while maintaining its identity, such as objects.
source: http://purl.obolibrary.org/obo/BFO_0000002

occurrent in meteorology
type: Class
subclass of: entity meteorology
IAO_0000115: An occurrent in meteorology is an entity in the meteorology domain that unfolds through time and does not exist wholly at a single moment.
IAO_0000117: Michael Rubinigg
IAO_0000118: occurrent in meteorology
id: EUPH:2229

Axiom
annotated source: occurrent in meteorology
annotated property: IAO_0000115
annotated target: An occurrent in meteorology is an entity in the meteorology domain that unfolds through time and does not exist wholly at a single moment.
source: http://purl.obolibrary.org/obo/BFO_0000003

continuant in meteorology
type: Class
subclass of: entity meteorology
IAO_0000115: A continuant in meteorology is an entity in the meteorology domain that persists through time while maintaining its identity, such as objects.
IAO_0000117: Michael Rubinigg
IAO_0000118: continuant in meteorology
id: EUPH:2230

Axiom
annotated source: continuant in meteorology
annotated property: IAO_0000115
annotated target: A continuant in meteorology is an entity in the meteorology domain that persists through time while maintaining its identity, such as objects.
source: http://purl.obolibrary.org/obo/BFO_0000002

independent continuant in meteorology
type: Class
subclass of: continuant in meteorology
IAO_0000115: An independent continuant in meteorology is a continuant entity in the meteorology domain that does not depend on another entity in any domain for its existence.
IAO_0000117: Michael Rubinigg
IAO_0000118: independent continuant in meteorology
id: EUPH:2231

Axiom
annotated source: independent continuant in meteorology
annotated property: IAO_0000115
annotated target: An independent continuant in meteorology is a continuant entity in the meteorology domain that does not depend on another entity in any domain for its existence.
source: http://purl.obolibrary.org/obo/BFO_0000004

specifically dependent continuant in meteorology
type: Class
subclass of: continuant in meteorology
IAO_0000115: A specifically dependent continuant in meteorology is a continuant entity in the meteorology domain that does not exist on its own, but requires a specific single entity in any other domain to exist.
IAO_0000117: Michael Rubinigg
IAO_0000118: specifically dependent continuant in meteorology
id: EUPH:2232

Axiom
annotated source: specifically dependent continuant in meteorology
annotated property: IAO_0000115
annotated target: A specifically dependent continuant in meteorology is a continuant entity in the meteorology domain that does not exist on its own, but requires a specific single entity in any other domain to exist.
source: http://purl.obolibrary.org/obo/BFO_0000020

hydrological precipitation process
type: Class
subclass of: https://w3id.org/euph/8178
IAO_0000115: Hydrological precipitation is a process during which any product of the condensation of atmospheric water vapour is pulled to the planetary surface by gravity.
IAO_0000117: Michael Rubinigg
IAO_0000118: hydrological precipitation process
id: EUPH:2234

Axiom
annotated source: hydrological precipitation process
annotated property: IAO_0000115
annotated target: Hydrological precipitation is a process during which any product of the condensation of atmospheric water vapour is pulled to the planetary surface by gravity.
has db xref: 10.1186/s13326-016-0097-6

quality in meteorology
type: Class
subclass of: specifically dependent continuant in meteorology
IAO_0000115: A quality in meteorology is a specifically dependent continuant in the meteorology domain that does not require any further process to be realised.
IAO_0000117: Michael Rubinigg
IAO_0000118: quality in meteorology
id: EUPH:2236

Axiom
annotated source: quality in meteorology
annotated property: IAO_0000115
annotated target: A quality in meteorology is a specifically dependent continuant in the meteorology domain that does not require any further process to be realised.
source: http://purl.obolibrary.org/obo/BFO_0000019

meteorological quantity
type: Class
subclass of: quality in meteorology
IAO_0000115: A quantity of a meteorological entity that exists through action of continuants int the meteorology domain in relation to other entities.
IAO_0000117: Michael Rubinigg
IAO_0000118: meteorological quantity
id: EUPH:2237

moderate snowfall intensity
type: Class
subclass of: snowfall intensity
IAO_0000115: For weather-observing purposes, the intensity of snow is characterized as [...] moderate when the visibility is less than 1 km (5/8 statute mile) but not less than 1/2 km (5/16 statute mile) [...].
IAO_0000117: Michael Rubinigg
IAO_0000118: moderate snowfall intensity
id: EUPH:2238

Axiom
annotated source: moderate snowfall intensity
annotated property: IAO_0000115
annotated target: For weather-observing purposes, the intensity of snow is characterized as [...] moderate when the visibility is less than 1 km (5/8 statute mile) but not less than 1/2 km (5/16 statute mile) [...].
source: https://glossary.ametsoc.org/wiki/

light snowfall intensity
type: Class
subclass of: snowfall intensity
IAO_0000115: For weather-observing purposes, the intensity of snow is characterized as [...] light when the visibility is 1 km (5/8 statute mile) or more [...].
IAO_0000117: Michael Rubinigg
IAO_0000118: light snowfall intensity
id: EUPH:2239

Axiom
annotated source: light snowfall intensity
annotated property: IAO_0000115
annotated target: For weather-observing purposes, the intensity of snow is characterized as [...] light when the visibility is 1 km (5/8 statute mile) or more [...].
source: https://glossary.ametsoc.org/wiki/

snowfall intensity
type: Class
subclass of: meteorological quantity
subclass of: Restriction
  on property: quality of
  some values from: falling snow
IAO_0000115: Snowfall intensity is the rate of transfer per unit area of snow.
IAO_0000117: Michael Rubinigg
IAO_0000118: Schneefallintensität @de
IAO_0000118: snowfall intensity
id: EUPH:2240

Axiom
annotated source: snowfall intensity
annotated property: IAO_0000115
annotated target: Snowfall intensity is the rate of transfer per unit area of snow.
source: https://glossary.ametsoc.org/wiki/

heavy snowfall intensity
type: Class
subclass of: snowfall intensity
IAO_0000115: For weather-observing purposes, the intensity of snow is characterized as 1) light when the visibility is [...] heavy when the visibility is less than 1/2 km (5/16 statute mile).
IAO_0000117: Michael Rubinigg
IAO_0000118: heavy snowfall intensity
id: EUPH:2241

Axiom
annotated source: heavy snowfall intensity
annotated property: IAO_0000115
annotated target: For weather-observing purposes, the intensity of snow is characterized as 1) light when the visibility is [...] heavy when the visibility is less than 1/2 km (5/16 statute mile).
source: https://glossary.ametsoc.org/wiki/

occurrent in economics
type: Class
subclass of: entity in economics
IAO_0000115: An occurrent in economics is an entity in the economics domain that unfolds through time and does not exist wholly at a single moment.
IAO_0000117: Michael Rubinigg
IAO_0000118: occurrent in economics
id: EUPH:2242

Axiom
annotated source: occurrent in economics
annotated property: IAO_0000115
annotated target: An occurrent in economics is an entity in the economics domain that unfolds through time and does not exist wholly at a single moment.
source: http://purl.obolibrary.org/obo/BFO_0000003

continuant in economics
type: Class
subclass of: entity in economics
IAO_0000115: A continuant in economics is an entity in the economics domain that persists through time while maintaining its identity, such as objects.
IAO_0000117: Michael Rubinigg
IAO_0000118: continuant in economics
id: EUPH:2243

Axiom
annotated source: continuant in economics
annotated property: IAO_0000115
annotated target: A continuant in economics is an entity in the economics domain that persists through time while maintaining its identity, such as objects.
source: http://purl.obolibrary.org/obo/BFO_0000002

specifically dependent continuant in economics
type: Class
subclass of: continuant in economics
IAO_0000115: A specifically dependent continuant in economics is a continuant entity in the economics domain that does not exist on its own, but requires a specific single entity in any other domain to exist.
IAO_0000117: Michael Rubinigg
IAO_0000118: specifically dependent continuant in economics
id: EUPH:2244

Axiom
annotated source: specifically dependent continuant in economics
annotated property: IAO_0000115
annotated target: A specifically dependent continuant in economics is a continuant entity in the economics domain that does not exist on its own, but requires a specific single entity in any other domain to exist.
source: http://purl.obolibrary.org/obo/BFO_0000020

quality in economics
type: Class
subclass of: specifically dependent continuant in economics
IAO_0000115: A quality in economics is a specifically dependent continuant in the economics domain that does not require any further process to be realised.
IAO_0000117: Michael Rubinigg
IAO_0000118: quality in economics
id: EUPH:2245

Axiom
annotated source: quality in economics
annotated property: IAO_0000115
annotated target: A quality in economics is a specifically dependent continuant in the economics domain that does not require any further process to be realised.
source: http://purl.obolibrary.org/obo/BFO_0000019

occurrent in beekeeping
type: Class
subclass of: entity in beekeeping
IAO_0000115: An occurrent in beekeeping is an entity in the beekeeping domain that unfolds through time and does not exist wholly at a single moment.
IAO_0000117: Michael Rubinigg
IAO_0000118: occurrent in beekeeping
id: EUPH:2246

Axiom
annotated source: occurrent in beekeeping
annotated property: IAO_0000115
annotated target: An occurrent in beekeeping is an entity in the beekeeping domain that unfolds through time and does not exist wholly at a single moment.
source: http://purl.obolibrary.org/obo/BFO_0000003

continuant in beekeeping
type: Class
subclass of: entity in beekeeping
IAO_0000115: A continuant in beekeeping is an entity in the beekeeping domain that persists through time while maintaining its identity, such as objects.
IAO_0000117: Michael Rubinigg
IAO_0000118: continuant in beekeeping
id: EUPH:2247

Axiom
annotated source: continuant in beekeeping
annotated property: IAO_0000115
annotated target: A continuant in beekeeping is an entity in the beekeeping domain that persists through time while maintaining its identity, such as objects.
source: http://purl.obolibrary.org/obo/BFO_0000002/

beekeeping establishment
type: Class
subclass of: object aggregate in beekeeping
IAO_0000115: A beekeeping establishment is any facility for the management of honeybee colonies or the rearing/breeding of queens for the production of beekeeping products such as honey, beeswax, package bees and honey bee queens, or the provision of services such as pollination and apitherapy.
IAO_0000117: Michael Rubinigg
IAO_0000118: beekeeping establishment
id: EUPH:2248

fiat object part in engineering
type: Class
subclass of: material entity in engineering
IAO_0000115: A fiat object part in engineering is a material entity in the engineering domain that is not a collection of disjoint self-standing single objects, but a proper part of an object.
IAO_0000117: Michael Rubinigg
IAO_0000118: fiat object part in engineering
id: EUPH:2249

Axiom
annotated source: fiat object part in engineering
annotated property: IAO_0000115
annotated target: A fiat object part in engineering is a material entity in the engineering domain that is not a collection of disjoint self-standing single objects, but a proper part of an object.
source: http://purl.obolibrary.org/obo/BFO_0000024

queen identification
type: Class
subclass of: queen management
IAO_0000115: Queen identification is an important step in the selection process, ensuring that the correct breeding animal is used for reproduction.
IAO_0000117: Michael Rubinigg
IAO_0000118: queen identification
id: EUPH:2250

taking
type: Class
subclass of: https://w3id.org/euph/899
IAO_0000115: Taking (a swarm) is a swarm management process in which an absconded swarm is captured.
IAO_0000117: Michael Rubinigg
IAO_0000118: a captura @ro
IAO_0000118: at fange @da
IAO_0000118: at tage @da
IAO_0000118: att inrånga @sv
IAO_0000118: capturar @es
IAO_0000118: capturer @fr
IAO_0000118: catturare @it
IAO_0000118: coger @es
IAO_0000118: einfangen @de
IAO_0000118: fangen @de
IAO_0000118: raccogliere @it
IAO_0000118: recolher @pt
IAO_0000118: récolter @fr
IAO_0000118: scheppen @nl
IAO_0000118: taking
IAO_0000118: to take
IAO_0000118: å fange @no
IAO_0000118: å ta @no
id: EUPH:2251

syrup
type: Class
subclass of: honey bee feed
subclass of: Restriction
  on property: provides nutrients for
  some values from: managed honey bee colony
subclass of: Restriction
  on property: has part
  some values from: glucose
subclass of: Restriction
  on property: has part
  some values from: sucrose
subclass of: Restriction
  on property: has part
  some values from: fructose
IAO_0000115: Syrup is a honey bee feed with a liquid consistency, made from sugar or starch and water. Depending on the manufacturing process and raw materials, it mainly contains disaccharides such as sucrose and monosaccharides such as fructose and glucose, in addition to water.
IAO_0000117: Michael Rubinigg
IAO_0000118: Sirup @de
IAO_0000118: Zuckerlösung @de
IAO_0000118: Zuckerwasser @de
IAO_0000118: jarabe @es
IAO_0000118: sciroppo @it
IAO_0000118: sirop @fr
IAO_0000118: sirup @no
IAO_0000118: sockerlösning @sv
IAO_0000118: stroop @nl
IAO_0000118: suikerstroop @nl
IAO_0000118: sukkeroppløsning @no
IAO_0000118: sukkervand @da
IAO_0000118: syrup
IAO_0000118: xarope @pt
id: EUPH:2252

temporal region in beekeeping
type: Class
subclass of: occurrent in beekeeping
IAO_0000115: A temporal region in beekeeping is an occurrent entity in the beekeeping domain that is a projection of the universal spatiotemporal region.
IAO_0000117: Michael Rubinigg
IAO_0000118: temporal region in beekeeping
id: EUPH:2254

Axiom
annotated source: temporal region in beekeeping
annotated property: IAO_0000115
annotated target: A temporal region in beekeeping is an occurrent entity in the beekeeping domain that is a projection of the universal spatiotemporal region.
source: http://purl.obolibrary.org/obo/BFO_0000008

swarming season
type: Class
subclass of: one-dimensional temporal region in beekeeping
IAO_0000115: The swarming season is the period within a calendar year when honeybee colonies swarm in order to reproduce.
IAO_0000117: Michael Rubinigg
IAO_0000118: Schwarmzeit @de
IAO_0000118: perioadă de roire @ro
IAO_0000118: período de enjabrazón @es
IAO_0000118: período de enxameagem @pt
IAO_0000118: período de enxameação @pt
IAO_0000118: période d'essaimage @fr
IAO_0000118: stagione degli sciami @it
IAO_0000118: svermetid @no
IAO_0000118: svärmningstid @sv
IAO_0000118: sværmeperiode @da
IAO_0000118: sværmetid @da
IAO_0000118: swarming season
IAO_0000118: zwermtijd @nl
id: EUPH:2255

disposition in biology
type: Class
subclass of: realisable entity in biology
IAO_0000115: A disposition in biology is a realisable entity in the biology domain that does not exist because the bearer is in a specific situation.
IAO_0000117: Michael Rubinigg
IAO_0000118: disposition in biology
id: EUPH:2256

Axiom
annotated source: disposition in biology
annotated property: IAO_0000115
annotated target: A disposition in biology is a realisable entity in the biology domain that does not exist because the bearer is in a specific situation.
source: http://purl.obolibrary.org/obo/BFO_0000016

swarming impulse
type: Class
subclass of: physiological function
subclass of: Restriction
  on property: realised in
  some values from: swarming fever
subclass of: Restriction
  on property: function of
  some values from: honey bee colony
IAO_0000115: A swarming impulse is the innate drive of a honey bee colony to reproduce by splitting and is realised in swarming fever.
IAO_0000117: Michael Rubinigg
IAO_0000118: Schwarmtieb @de
IAO_0000118: impulso sciamatorio @it
IAO_0000118: instinct d'essaimage @fr
IAO_0000118: instinct de roire @ro
IAO_0000118: instinto de enjambrazón @es
IAO_0000118: instinto de enxameagem @pt
IAO_0000118: instinto de enxameação @pt
IAO_0000118: instinto enxameatório @pt
IAO_0000118: svermedrift @no
IAO_0000118: svermetrang @no
IAO_0000118: svärmningsdrift @sv
IAO_0000118: svärmningsimpuls @sv
IAO_0000118: sværmedrift @da
IAO_0000118: swarming impulse
IAO_0000118: tendință la roire @ro
IAO_0000118: zwermdrift @nl
id: EUPH:2260

swarming fever
type: Class
subclass of: honey bee colony reproduction
IAO_0000115: Swarming fever is a reproductive process in honey bee colonies, during which a honey bee colony prepares for reproduction by splitting.
IAO_0000117: Michael Rubinigg
IAO_0000118: Schwarmfieber @de
IAO_0000118: Schwarmstimmung @de
IAO_0000118: febbre sciamatoria @it
IAO_0000118: febre de enxameagem @pt
IAO_0000118: febre de enxameação @pt
IAO_0000118: febre enxameatória @pt
IAO_0000118: fiebre de enjambrazón @es
IAO_0000118: fièvre d'essaimage @fr
IAO_0000118: frigurile roirii @ro
IAO_0000118: svermefeber @no
IAO_0000118: svärmningslust @sv
IAO_0000118: sværmefeber @da
IAO_0000118: swarming fever
IAO_0000118: zwermkoorts @nl
IAO_0000118: zwermlust @nl
id: EUPH:2262

swarm box
type: Class
subclass of: hive management equipment
subclass of: Restriction
  on property: involved in
  some values from: hive management
subclass of: Restriction
  on property: involved in
  some values from: https://w3id.org/euph/899
IAO_0000115: A swarm box is a specially designed container used to house naturally swarmed colonies or bees that have been intentionally removed from honey bee colonies in order to produce bee packages for sale or for further use within one's own operation.
IAO_0000117: Michael Rubinigg
IAO_0000118: Schwarmkasten @de
IAO_0000118: Schwarmkistchen @de
IAO_0000118: boîte à essaims @fr
IAO_0000118: caixa para enxames @pt
IAO_0000118: cassetta per sciami @it
IAO_0000118: cogeenjambres @es
IAO_0000118: enjambrera @es
IAO_0000118: roiniță @ro
IAO_0000118: svermkasse @no
IAO_0000118: svärmlåda @sv
IAO_0000118: sværmkasse @da
IAO_0000118: swarm box
IAO_0000118: zwermkistje @nl
id: EUPH:2264

clustering behavior
type: Class
subclass of: https://w3id.org/euph/760
IAO_0000115: Clustering behavior is a behaviour exhibited by a honeybee colony in which a large group of bees gather to perform certain activities (e.g. comb building, swarming) or achieve certain goals (e.g. thermoregulation).
IAO_0000117: Michael Rubinigg
IAO_0000118: clustering behavior
id: EUPH:2265

reproductive behavior of honey bees
type: Class
subclass of: https://w3id.org/euph/760
IAO_0000115: Reproductive behavior of honey bees is a behavior of honey bees that is related to reproduction.
IAO_0000117: Michael Rubinigg
IAO_0000118: reproductive behavior of honey bees
id: EUPH:2266

artificial swarm
type: Class
subclass of: swarm
subclass of: Restriction
  on property: produced by
  some values from: beekeeper
subclass of: Restriction
  on property: has part
  some values from: adult worker bee
subclass of: Restriction
  on property: has part
  some values from: adult drone bee
subclass of: Restriction
  on property: has part
  some values from: queen bee
IAO_0000115: An artificial swarm is a swarm deliberately created by a beekeeper, consisting of bees obtained from one or more honey bee colonies and a queen, usually introduced by the beekeeper.
IAO_0000117: Michael Rubinigg
IAO_0000118: Kunstschwarm @de
IAO_0000118: artificial swarm
IAO_0000118: enjambre artificial @es
IAO_0000118: enxame artificial @pt
IAO_0000118: essaim artificiel @fr
IAO_0000118: konstsvärm @sv
IAO_0000118: kunstsverm @no
IAO_0000118: kunstsværm @da
IAO_0000118: kunstzwerm @nl
IAO_0000118: roi artificial @ro
IAO_0000118: sciame artificiale @it
IAO_0000118: shook swarm
id: EUPH:2267

prime swarm
type: Class
subclass of: swarm
subclass of: Restriction
  on property: has part
  some values from: adult worker bee
subclass of: Restriction
  on property: has part
  some values from: mated queen
IAO_0000115: A prime swarm is the first (and often largest) swarm to issue from a colony; often includes the mother queen.
IAO_0000117: Michael Rubinigg
IAO_0000118: Erstschwarm @de
IAO_0000118: Hauptschwarm @de
IAO_0000118: Vorschwarm @de
IAO_0000118: brandzwerm @nl
IAO_0000118: bromzwerm @nl
IAO_0000118: enjambre primario @pt
IAO_0000118: enxame primário @pt
IAO_0000118: forsverm @no
IAO_0000118: forsværm @da
IAO_0000118: förstasvärm @sv
IAO_0000118: prime swarm
IAO_0000118: roi primar @ro
IAO_0000118: sciame primario @it
IAO_0000118: voorzwerm @nl
id: EUPH:2268

Axiom
annotated source: prime swarm
annotated property: IAO_0000115
annotated target: A prime swarm is the first (and often largest) swarm to issue from a colony; often includes the mother queen.
has db xref: ISBN:1-878075-65-4

phenotype of swarming behaviour
type: Class
subclass of: phenotype of honey bees
subclass of: Restriction
  on property: characteristic of
  some values from: https://w3id.org/euph/936
IAO_0000115: A phenotype of swarming behavior is a phenotype of honey bees that characterises the swarming behavior trait, evaluated in honey bee breeding programmes.
IAO_0000117: Michael Rubinigg
IAO_0000118: phenotype of swarming behaviour
id: EUPH:2269

phenotype of defensive behaviour
type: Class
subclass of: phenotype of honey bees
subclass of: Restriction
  on property: characteristic of
  some values from: defensive behaviour trait of honey bees
IAO_0000115: A phenotype of defensive behavior is a phenotype of honey bees that characterises the defensive behavior trait, evaluated in honey bee breeding programmes.
IAO_0000117: Michael Rubinigg
IAO_0000118: phenotype of defensive behaviour
id: EUPH:2270

phenotype of calmness
type: Class
subclass of: phenotype of honey bees
subclass of: Restriction
  on property: characteristic of
  some values from: https://w3id.org/euph/778
IAO_0000115: A phenotype of calmness is a phenotype of honey bees that characterises the calmness trait, evaluated in honey bee breeding programmes.
IAO_0000117: Michael Rubinigg
IAO_0000118: phenotype of calmness
id: EUPH:2271

material entity in beekeeping
type: Class
subclass of: https://w3id.org/euph/7832
IAO_0000115: A material entity in beekeeping is an independent continuant in the beekeeping domain that always has some portion of matter as a continuant part.
IAO_0000117: Michael Rubinigg
IAO_0000118: material entity in beekeeping
id: EUPH:2272

Axiom
annotated source: material entity in beekeeping
annotated property: IAO_0000115
annotated target: A material entity in beekeeping is an independent continuant in the beekeeping domain that always has some portion of matter as a continuant part.
source: http://purl.obolibrary.org/obo/BFO_0000040

object in beekeeping
type: Class
subclass of: material entity in beekeeping
IAO_0000115: An object in beekeeping is a material entity in the beekeeping domain that is neither a collection of disjoint self-standing single objects, nor a proper part of an object.
IAO_0000117: Michael Rubinigg
IAO_0000118: object in beekeeping
id: EUPH:2273

Axiom
annotated source: object in beekeeping
annotated property: IAO_0000115
annotated target: An object in beekeeping is a material entity in the beekeeping domain that is neither a collection of disjoint self-standing single objects, nor a proper part of an object.
source: http://purl.obolibrary.org/obo/BFO_0000030

fiat object part in beekeeping
type: Class
subclass of: material entity in beekeeping
IAO_0000115: A fiat object part in beekeeping is a material entity in the beekeeping domain that is not a collection of disjoint self-standing single objects, but a proper part of an object.
IAO_0000117: Michael Rubinigg
IAO_0000118: fiat object part in beekeeping
id: EUPH:2274

Axiom
annotated source: fiat object part in beekeeping
annotated property: IAO_0000115
annotated target: A fiat object part in beekeeping is a material entity in the beekeeping domain that is not a collection of disjoint self-standing single objects, but a proper part of an object.
source: http://purl.obolibrary.org/obo/BFO_0000024

object aggregate in beekeeping
type: Class
subclass of: material entity in beekeeping
IAO_0000115: An object aggregate in beekeeping is a material entity in the beekeeping domain that is a collection of disjoint self-standing single objects.
IAO_0000117: Michael Rubinigg
IAO_0000118: object aggregate in beekeeping
id: EUPH:2275

Axiom
annotated source: object aggregate in beekeeping
annotated property: IAO_0000115
annotated target: An object aggregate in beekeeping is a material entity in the beekeeping domain that is a collection of disjoint self-standing single objects.
source: http://purl.obolibrary.org/obo/BFO_0000027

immaterial entity in beekeeping
type: Class
subclass of: https://w3id.org/euph/7832
IAO_0000115: An immaterial entity in beekeeping is an independent continuant in the beekeeping domain that never has any portion of matter as a continuant part.
IAO_0000117: Michael Rubinigg
IAO_0000118: immaterial entity in beekeeping
id: EUPH:2276

Axiom
annotated source: immaterial entity in beekeeping
annotated property: IAO_0000115
annotated target: An immaterial entity in beekeeping is an independent continuant in the beekeeping domain that never has any portion of matter as a continuant part.
source: http://purl.obolibrary.org/obo/BFO_0000141/

site in beekeeping
type: Class
subclass of: immaterial entity in beekeeping
IAO_0000115: A site in beekeeping is an immaterial entity in the beekeeping domain whose location is determined relative to some material entity that has three dimensions.
IAO_0000117: Michael Rubinigg
IAO_0000118: site in beekeeping
id: EUPH:2277

Axiom
annotated source: site in beekeeping
annotated property: IAO_0000115
annotated target: A site in beekeeping is an immaterial entity in the beekeeping domain whose location is determined relative to some material entity that has three dimensions.
source: http://purl.obolibrary.org/obo/BFO_0000029/

spatial region in beekeeping
type: Class
subclass of: immaterial entity in beekeeping
IAO_0000115: A spatial region in beekeeping is an immaterial entity in the beekeeping domain that is a spatial projection of a portion of spacetime, but whose location is not determined relative to some material entity
IAO_0000117: Michael Rubinigg
IAO_0000118: spatial region in beekeeping
id: EUPH:2278

Axiom
annotated source: spatial region in beekeeping
annotated property: IAO_0000115
annotated target: A spatial region in beekeeping is an immaterial entity in the beekeeping domain that is a spatial projection of a portion of spacetime, but whose location is not determined relative to some material entity
source: http://purl.obolibrary.org/obo/BFO_0000006

two-dimensional spatial region in beekeeping
type: Class
subclass of: spatial region in beekeeping
IAO_0000115: A two-dimensional spatial region in beekeeping is a spatial region in the beekeeping domain that has two dimensions.
IAO_0000117: Michael Rubinigg
IAO_0000118: two-dimensional spatial region in beekeeping
id: EUPH:2279

Axiom
annotated source: two-dimensional spatial region in beekeeping
annotated property: IAO_0000115
annotated target: A two-dimensional spatial region in beekeeping is a spatial region in the beekeeping domain that has two dimensions.
source: http://purl.obolibrary.org/obo/BFO_0000009

virgin
type: Class
subclass of: intrinsic role in beekeeping
subclass of: Restriction
  on property: role of
  some values from: unmated queen
IAO_0000115: Virgin is the characteristic in the life cycle of a queen that has not been mated by drones or instrumentally inseminated.
IAO_0000117: Michael Rubinigg
IAO_0000118: jomfruelig @da
IAO_0000118: jungfrulig @sv
IAO_0000118: jungfräulich @de
IAO_0000118: maagdelijk @nl
IAO_0000118: onbevrucht @nl
IAO_0000118: oparad @sv
IAO_0000118: pur @ro
IAO_0000118: ubefrugtet @da
IAO_0000118: unbegattet @de
IAO_0000118: uparet @no
IAO_0000118: vergine @it
IAO_0000118: vierge @fr
IAO_0000118: virgem @pt
IAO_0000118: virgen @es
IAO_0000118: virgin
id: EUPH:2280

role in beekeeping
type: Class
subclass of: realisable entitiy in beekeeping
IAO_0000115: A role in beekeeping is a realisable entitiy in the beekeeping domain that exists, because the bearer is in a specific situation.
IAO_0000117: Michael Rubinigg
IAO_0000118: role in beekeeping
id: EUPH:2281

Axiom
annotated source: role in beekeeping
annotated property: IAO_0000115
annotated target: A role in beekeeping is a realisable entitiy in the beekeeping domain that exists, because the bearer is in a specific situation.
source: http://purl.obolibrary.org/obo/BFO_0000023

two-dimensional spatial region in geography
type: Class
subclass of: spatial region in geography
IAO_0000115: A two-dimensional spatial region in geography is a spatial region in the geography domain that has two dimensions.
IAO_0000117: Michael Rubinigg
IAO_0000118: two-dimensional spatial region in geography
id: EUPH:2285

Axiom
annotated source: two-dimensional spatial region in geography
annotated property: IAO_0000115
annotated target: A two-dimensional spatial region in geography is a spatial region in the geography domain that has two dimensions.
source: http://purl.obolibrary.org/obo/BFO_0000009

area in country
type: Class
subclass of: two-dimensional spatial region in geography
IAO_0000115: An area in a country is a two-dimensional region that is subject to the jurisdiction of that country and is bounded by certain parameters, such as landmarks or the distance from a zero- or one-dimensional spatial region in that country or in another country.
IAO_0000117: Michael Rubinigg
IAO_0000118: area in a country
id: EUPH:2286

specifically dependent continuant in chemistry
type: Class
subclass of: continuant in chemistry
IAO_0000115: A specifically dependent continuant in chemistry is a continuant entity in the chemistry domain that does not exist on its own, but requires a specific single entity in any other domain to exist.
IAO_0000117: Michael Rubinigg
IAO_0000118: specifically dependent continuant in chemistry
id: EUPH:2287

Axiom
annotated source: specifically dependent continuant in chemistry
annotated property: IAO_0000115
annotated target: A specifically dependent continuant in chemistry is a continuant entity in the chemistry domain that does not exist on its own, but requires a specific single entity in any other domain to exist.
source: http://purl.obolibrary.org/obo/BFO_0000020

realisable entity in chemistry
type: Class
subclass of: specifically dependent continuant in chemistry
IAO_0000115: A realisable entity in chemistry is a specifically dependent continuant in the chemistry domain that requires some further process to be realised.
IAO_0000117: Michael Rubinigg
IAO_0000118: realisable entity in chemistry
id: EUPH:2288

Axiom
annotated source: realisable entity in chemistry
annotated property: IAO_0000115
annotated target: A realisable entity in chemistry is a specifically dependent continuant in the chemistry domain that requires some further process to be realised.
source: http://purl.obolibrary.org/obo/BFO_0000017

role in chemistry
type: Class
subclass of: realisable entity in chemistry
IAO_0000115: A role in chemistry is a realisable entity in the chemistry domain that exist because the bearer is in a specific situation.
IAO_0000117: Michael Rubinigg
IAO_0000118: role in chemistry
id: EUPH:2289

Axiom
annotated source: role in chemistry
annotated property: IAO_0000115
annotated target: A role in chemistry is a realisable entity in the chemistry domain that exist because the bearer is in a specific situation.
source: http://purl.obolibrary.org/obo/BFO_0000023

material entity in chemistry
type: Class
subclass of: https://w3id.org/euph/8118
IAO_0000115: A material entity in chemistry is an independent continuant in the chemistry domain that always has some portion of matter as a continuant part.
IAO_0000117: Michael Rubinigg
IAO_0000118: material entity in chemistry
id: EUPH:2291

Axiom
annotated source: material entity in chemistry
annotated property: IAO_0000115
annotated target: A material entity in chemistry is an independent continuant in the chemistry domain that always has some portion of matter as a continuant part.
source: http://purl.obolibrary.org/obo/BFO_0000040

object in chemistry
type: Class
subclass of: material entity in chemistry
IAO_0000115: An object in chemistry is a material entity in the chemistry domain that is neither a collection of disjoint self-standing single objects, nor a proper part of an object.
IAO_0000117: Michael Rubinigg
IAO_0000118: object in chemistry
id: EUPH:2292

Axiom
annotated source: object in chemistry
annotated property: IAO_0000115
annotated target: An object in chemistry is a material entity in the chemistry domain that is neither a collection of disjoint self-standing single objects, nor a proper part of an object.
source: http://purl.obolibrary.org/obo/BFO_0000030

fiat object part in chemistry
type: Class
subclass of: material entity in chemistry
IAO_0000115: A fiat object part in chemistry is a material entity in the chemistry domain that is not a collection of disjoint self-standing single objects, but a proper part of an object.
IAO_0000117: Michael Rubinigg
IAO_0000118: fiat object part in chemistry
id: EUPH:2293

Axiom
annotated source: fiat object part in chemistry
annotated property: IAO_0000115
annotated target: A fiat object part in chemistry is a material entity in the chemistry domain that is not a collection of disjoint self-standing single objects, but a proper part of an object.
source: http://purl.obolibrary.org/obo/BFO_0000024

function in veterinary medicine
type: Class
subclass of: disposition in veterinary medicine
IAO_0000115: A function in veterinary medicine is a disposition in the veterinary medicine domain that exist by evolution or design to realise specific processes.
IAO_0000117: Michael Rubinigg
IAO_0000118: function in veterinary medicine
id: EUPH:2294

Axiom
annotated source: function in veterinary medicine
annotated property: IAO_0000115
annotated target: A function in veterinary medicine is a disposition in the veterinary medicine domain that exist by evolution or design to realise specific processes.
source: http://purl.obolibrary.org/obo/BFO_0000034

continuant in information science
type: Class
subclass of: entity in information science
IAO_0000115: A continuant in information science is an entity in the information science domain that persists through time while maintaining its identity, such as objects.
IAO_0000117: Michael Rubinigg
IAO_0000118: continuant in information science
id: EUPH:2295

Axiom
annotated source: continuant in information science
annotated property: IAO_0000115
annotated target: A continuant in information science is an entity in the information science domain that persists through time while maintaining its identity, such as objects.
source: http://purl.obolibrary.org/obo/BFO_0000002

realisable entitiy in information science
type: Class
subclass of: specifically dependent continuant in information science
IAO_0000115: A realisable entitiy in information science is a specifically dependent continuant in the information science domain that requires some further process to be realised.
IAO_0000117: Michael Rubinigg
IAO_0000118: realisable entitiy in information science
id: EUPH:2296

Axiom
annotated source: realisable entitiy in information science
annotated property: IAO_0000115
annotated target: A realisable entitiy in information science is a specifically dependent continuant in the information science domain that requires some further process to be realised.
source: http://purl.obolibrary.org/obo/BFO_0000017

one-dimensional temporal region in information science
type: Class
subclass of: temporal region in information science
IAO_0000115: A one-dimensional temporal region in information science is a temporal region in informations science that has a beginning and an end.
IAO_0000117: Michael Rubinigg
IAO_0000118: one-dimensional temporal region in information science
id: EUPH:2297

Axiom
annotated source: one-dimensional temporal region in information science
annotated property: IAO_0000115
annotated target: A one-dimensional temporal region in information science is a temporal region in informations science that has a beginning and an end.
source: http://purl.obolibrary.org/obo/BFO_0000038

zero-dimensional temporal region in information science
type: Class
subclass of: temporal region in information science
IAO_0000115: A zero-dimensional temporal region in information science is a temporal region in informations science that defines a specific point in time.
IAO_0000117: Michael Rubinigg
IAO_0000118: zero-dimensional temporal region in information science
id: EUPH:2298

Axiom
annotated source: zero-dimensional temporal region in information science
annotated property: IAO_0000115
annotated target: A zero-dimensional temporal region in information science is a temporal region in informations science that defines a specific point in time.
source: http://purl.obolibrary.org/obo/BFO_0000148

honey
type: Class
subclass of: primary hive product
subclass of: Restriction
  on property: present in taxon
  some values from: https://www.gbif.org/species/1334757
subclass of: Restriction
  on property: has part
  some values from: glucose
subclass of: Restriction
  on property: has part
  some values from: sucrose
subclass of: Restriction
  on property: has part
  some values from: fructose
subclass of: Restriction
  on property: has part
  some values from: 5-hydroxymethylfurfural
subclass of: Restriction
  on property: has part
  some values from: pollen grain
subclass of: Restriction
  on property: has part
  some values from: glucose oxidase
subclass of: Restriction
  on property: has part
  some values from: alpha-amylase
subclass of: Restriction
  on property: has part
  some values from: alpha-glucosidase
subclass of: Restriction
  on property: has part
  some values from: scum
subclass of: Restriction
  on property: derives from
  some values from: nectar
subclass of: Restriction
  on property: derives from
  some values from: honeydew
IAO_0000115: Honey is a primary hive product and has been defined as [...] the natural sweet substance produced by honey bees from the nectar of plants or from secretions of living parts of plants or excretions of plant sucking insects on the living parts of plants, which the bees collect, transform by combining with specific substances of their own, deposit, dehydrate, store and leave in the honey comb to ripen and mature. It is described by the following attributes or identifiers: FOSTAT Item Code: 1182 FAOSTAT Label: Natural honey CPC code: 02910 HS07 code: 040900 HS12 code: 040900
IAO_0000117: Michael Rubinigg
IAO_0000118: Honig @de
IAO_0000118: għasel @mt
IAO_0000118: honey
IAO_0000118: honig @nl
IAO_0000118: honing @nl
IAO_0000118: honning @da
IAO_0000118: honung @sv
IAO_0000118: hunaja @fi
IAO_0000118: med @cs
IAO_0000118: medus @lt
IAO_0000118: mel @pt
IAO_0000118: mesi @et
IAO_0000118: miel @es
IAO_0000118: miele @it
IAO_0000118: miere @ro
IAO_0000118: miere de albine @ro
IAO_0000118: miód @pl
IAO_0000118: méz @hu
IAO_0000118: μέλι @el
IAO_0000118: мед @bg
IAO_0000118: عسل @ar
id: EUPH:23

Axiom
annotated source: honey
annotated property: IAO_0000115
annotated target: Honey is a primary hive product and has been defined as [...] the natural sweet substance produced by honey bees from the nectar of plants or from secretions of living parts of plants or excretions of plant sucking insects on the living parts of plants, which the bees collect, transform by combining with specific substances of their own, deposit, dehydrate, store and leave in the honey comb to ripen and mature. It is described by the following attributes or identifiers: FOSTAT Item Code: 1182 FAOSTAT Label: Natural honey CPC code: 02910 HS07 code: 040900 HS12 code: 040900
source: https://www.fao.org/fao-who-codexalimentarius/sh-proxy/en/
source: https://www.fao.org/faostat/en/#definitions

stinging
type: Class
subclass of: bee behavior
subclass of: Restriction
  on property: part of
  some values from: defensive behavior of honey bees
IAO_0000115: Stinging is a defensive behaviour of an animal in which it inflicts a stinging injury on another animal or a device for harvesting bee venom with a stinging organ and releases a substance that can cause pain or death.
IAO_0000117: Michael Rubinigg
IAO_0000118: a înțepa @ro
IAO_0000118: at stikke @da
IAO_0000118: att sticka @sv
IAO_0000118: att stinga @sv
IAO_0000118: ferroar @pt
IAO_0000118: picar @es
IAO_0000118: piquer @fr
IAO_0000118: pungere @it
IAO_0000118: stechen @de
IAO_0000118: steken @nl
IAO_0000118: stinging
IAO_0000118: to sting
IAO_0000118: å stikke @no
id: EUPH:2303

temporal region in veterinary medicine
type: Class
subclass of: occurrent in veterinary medicine
IAO_0000115: A temporal region in veterinary medicine is an occurrent in veterinary medicine domain that is a projection of the universal spatiotemporal region.
IAO_0000117: Michael Rubinigg
IAO_0000118: temporal region in veterinary medicine
id: EUPH:2304

Axiom
annotated source: temporal region in veterinary medicine
annotated property: IAO_0000115
annotated target: A temporal region in veterinary medicine is an occurrent in veterinary medicine domain that is a projection of the universal spatiotemporal region.
source: http://purl.obolibrary.org/obo/BFO_0000008

one-dimensional temporal region in veterinary medicine
type: Class
subclass of: temporal region in veterinary medicine
IAO_0000115: A one-dimensional temporal region in veterinary medicine is a temporal region in the veterinary medicine domain that has one dimension.
IAO_0000117: Michael Rubinigg
IAO_0000118: one-dimensional temporal region in veterinary medicine
id: EUPH:2305

Axiom
annotated source: one-dimensional temporal region in veterinary medicine
annotated property: IAO_0000115
annotated target: A one-dimensional temporal region in veterinary medicine is a temporal region in the veterinary medicine domain that has one dimension.
source: http://purl.obolibrary.org/obo/BFO_0000038

process boundary in veterinary medicine
type: Class
subclass of: occurrent in veterinary medicine
IAO_0000115: A process boundary in veterinary medicine is an occurrent entity in the veterinary medicine domain that inhabits the universal spatiotemporal region, but has no proper temporal part.
IAO_0000117: Michael Rubinigg
IAO_0000118: process boundaries in veterinary medicine
id: EUPH:2306

Axiom
annotated source: process boundary in veterinary medicine
annotated property: IAO_0000115
annotated target: A process boundary in veterinary medicine is an occurrent entity in the veterinary medicine domain that inhabits the universal spatiotemporal region, but has no proper temporal part.
source: http://purl.obolibrary.org/obo/BFO_0000035

taxon-typical behavior
type: Class
subclass of: behavior
IAO_0000115: A taxon-typical behavior is a behavior that occurs in a similar fashion in many members of a taxon.
IAO_0000117: Michael Rubinigg
IAO_0000118: taxon-typical behavior
id: EUPH:2308

restriction of brood rearing
type: Class
subclass of: queen management
IAO_0000115: Restriction of brood rearing is a queen management process in which queens are prevented from laying eggs using various methods (e.g. caging) in order to make colonies temporarily broodless.
IAO_0000117: Michael Rubinigg
IAO_0000118: Brutstop @de
IAO_0000118: begrænsning af yngelleje @da
IAO_0000118: beperking van de eiafzetting @nl
IAO_0000118: blocage de la ponte @fr
IAO_0000118: blocage du couvain @fr
IAO_0000118: blocco della covata @it
IAO_0000118: blocco della deposizione @it
IAO_0000118: bloqueo de la puesta @es
IAO_0000118: indsnævring af yngelleje @da
IAO_0000118: inskränkning av yngeluppfödning @sv
IAO_0000118: limitarea pontei @ro
IAO_0000118: parada da postura @pt
IAO_0000118: restriction of brood rearing
IAO_0000118: restrição da postura @pt
IAO_0000118: yngelbegrensning @no
id: EUPH:2313

colony management
type: Class
subclass of: https://w3id.org/euph/924
IAO_0000115: Colony management is a process in beekeeping that is related to honey bee colonies.
IAO_0000117: Michael Rubinigg
IAO_0000118: colony management
id: EUPH:2318

disposition in engineering
type: Class
subclass of: realisable entitiy in engineering
IAO_0000115: A disposition in engineering is a realisable entitiy in the engineering domain that does not exist, because the bearer is in a specific situation.
IAO_0000117: Michael Rubinigg
IAO_0000118: disposition in engineering
id: EUPH:2340

Axiom
annotated source: disposition in engineering
annotated property: IAO_0000115
annotated target: A disposition in engineering is a realisable entitiy in the engineering domain that does not exist, because the bearer is in a specific situation.
source: http://purl.obolibrary.org/obo/BFO_0000016

immature worker bee
type: Class
subclass of: immature honey bee
IAO_0000115: An immature worker bee is an immature honey bee that is going to develop into an adult worker bee.
IAO_0000117: Michael Rubinigg
IAO_0000118: immature worker bee
id: EUPH:2342

putting on
type: Class
subclass of: hive management
IAO_0000115: Putting on is an activity in which a honey chamber is added to a beehive, usually at the onset of honey flow.
IAO_0000117: Michael Rubinigg
IAO_0000118: a adăuga @ro
IAO_0000118: at sætte på @da
IAO_0000118: att påsætte @da
IAO_0000118: att sätta på @sv
IAO_0000118: aufsetzen @de
IAO_0000118: colocar @es
IAO_0000118: colocar sobre @pt
IAO_0000118: opzetten @nl
IAO_0000118: placer @fr
IAO_0000118: putting on
IAO_0000118: sobrebor @pt
IAO_0000118: sovrapporre @it
IAO_0000118: superponer @es
IAO_0000118: to put on
IAO_0000118: å sette på @no
id: EUPH:2357

brood
type: Class
subclass of: object aggregate in beekeeping
subclass of: Restriction
  on property: located in
  some values from: cell
subclass of: Restriction
  on property: has part
  some values from: egg
subclass of: Restriction
  on property: has part
  some values from: immature honey bee
IAO_0000115: Brood is an aggregate of eggs, immature honey bees (larvae, pupae) or adult hony bees shortly before hatching, contained in brood cells.
IAO_0000117: Michael Rubinigg
IAO_0000118: Brut @de
IAO_0000118: broed @nl
IAO_0000118: brood
IAO_0000118: couvain @fr
IAO_0000118: covata @it
IAO_0000118: cria @pt
IAO_0000118: criação @pt
IAO_0000118: cría @es
IAO_0000118: pollo @es
IAO_0000118: puiet @ro
IAO_0000118: yngel @da
IAO_0000118: пило @bg
IAO_0000118: حضنة @ar
id: EUPH:24

one-dimensional temporal region in beekeeping
type: Class
subclass of: temporal region in beekeeping
IAO_0000115: A one-dimensional temporal region in beekeeping is a temporal region in the beekeeping domain that has one dimension.
IAO_0000117: Michael Rubinigg
IAO_0000118: one-dimensional temporal region in beekeeping
id: EUPH:2415

Axiom
annotated source: one-dimensional temporal region in beekeeping
annotated property: IAO_0000115
annotated target: A one-dimensional temporal region in beekeeping is a temporal region in the beekeeping domain that has one dimension.
source: http://purl.obolibrary.org/obo/BFO_0000038

material entity in plant production
type: Class
subclass of: independent continuant in plant production
IAO_0000115: A material entity in plant production is an independent continuant in the plant production domain that always has some portion of matter as a continuant part.
IAO_0000117: Michael Rubinigg
IAO_0000118: material entity in plant production
id: EUPH:2416

Axiom
annotated source: material entity in plant production
annotated property: IAO_0000115
annotated target: A material entity in plant production is an independent continuant in the plant production domain that always has some portion of matter as a continuant part.
source: http://purl.obolibrary.org/obo/BFO_0000040

plan specification in veterinary medicine
type: Class
subclass of: directive information entity in veterinary medicine
IAO_0000115: A plan specification in veterinary medicine is a directive information entity in the veterinary medicine domain with action specifications and objective specifications as parts, and that may be concretised as a realisable entity that, if realised, is realized in a process in which the bearer tries to achieve the objectives by taking the actions specified.
IAO_0000117: Michael Rubinigg
IAO_0000118: plan specification in veterinary medicine
id: EUPH:2436

Axiom
annotated source: plan specification in veterinary medicine
annotated property: IAO_0000115
annotated target: A plan specification in veterinary medicine is a directive information entity in the veterinary medicine domain with action specifications and objective specifications as parts, and that may be concretised as a realisable entity that, if realised, is realized in a process in which the bearer tries to achieve the objectives by taking the actions specified.
source: plan specification

relational quality in veterinary medicine
type: Class
subclass of: quality in veterinary medicine
IAO_0000115: A relational quality in veterinary medicine is a quality entity in the veterinary medicine domain that is specifically dependent on two or more non-identical entities.
IAO_0000117: Michael Rubinigg
IAO_0000118: relational quality in veterinary medicine
id: EUPH:2441

Axiom
annotated source: relational quality in veterinary medicine
annotated property: IAO_0000115
annotated target: A relational quality in veterinary medicine is a quality entity in the veterinary medicine domain that is specifically dependent on two or more non-identical entities.
source: relational quality in beekeeping

specifically dependent continuant in biology
type: Class
subclass of: continuant in biology
IAO_0000115: A specifically dependent continuant in biology is a continuant entity in the biology domain that does not exist on its own, but requires a specific single entity in any other domain to exist.
IAO_0000117: Michael Rubinigg
IAO_0000118: specifically dependent continuant in biology
id: EUPH:2447

Axiom
annotated source: specifically dependent continuant in biology
annotated property: IAO_0000115
annotated target: A specifically dependent continuant in biology is a continuant entity in the biology domain that does not exist on its own, but requires a specific single entity in any other domain to exist.
source: http://purl.obolibrary.org/obo/BFO_0000020

quality in biology
type: Class
subclass of: specifically dependent continuant in biology
IAO_0000115: A quality in biology is a specifically dependent continuant in the biology domain that does not require any further process to be realised.
IAO_0000117: Michael Rubinigg
IAO_0000118: quality in biology
id: EUPH:2448

Axiom
annotated source: quality in biology
annotated property: IAO_0000115
annotated target: A quality in biology is a specifically dependent continuant in the biology domain that does not require any further process to be realised.
source: http://purl.obolibrary.org/obo/BFO_0000019

code set of biological entities
type: Class
subclass of: information content entity in biology
IAO_0000115: A code set of biological entities is an information content entity in the biology domain [...] that is a collection of other information content entities that has been created to identify or annotate things in a specified domain, and where the intention of its creators is that the collection has a one-to-one correspondence with those things.
IAO_0000117: Michael Rubinigg
IAO_0000118: code set of biological entities
id: EUPH:2449

Axiom
annotated source: code set of biological entities
annotated property: IAO_0000115
annotated target: A code set of biological entities is an information content entity in the biology domain [...] that is a collection of other information content entities that has been created to identify or annotate things in a specified domain, and where the intention of its creators is that the collection has a one-to-one correspondence with those things.
source: code set

data item in biology
type: Class
subclass of: information content entity in biology
IAO_0000115: A data item in biology is an information content entity that is intended to be a truthful statement about something in the biology domain and is constructed/acquired by a method which reliably tends to produce (approximately) truthful statements.
IAO_0000117: Michael Rubinigg
IAO_0000118: data item in biology
id: EUPH:2450

Axiom
annotated source: data item in biology
annotated property: IAO_0000115
annotated target: A data item in biology is an information content entity that is intended to be a truthful statement about something in the biology domain and is constructed/acquired by a method which reliably tends to produce (approximately) truthful statements.
source: data item

honey bee disease control eqipment
type: Class
subclass of: beekeeping equipment
IAO_0000115: A honey bee disease control equipment is an equipment that is used to control of a honey bee disease.
IAO_0000117: Michael Rubinigg
IAO_0000118: honey bee disease control eqipment
id: EUPH:2452

adult drone bee
type: Class
subclass of: adult honey bee
IAO_0000115: An adult drone bee is an adult honey bee that has developed into a drone.
IAO_0000117: Michael Rubinigg
IAO_0000118: adult drone
id: EUPH:2453

generically dependent continuant in animal breeding
type: Class
subclass of: continuant in animal breeding
IAO_0000115: A generically dependent contiunant in animal breeding is a continuant in the animal breeding domain that does not exist on its own, but does not require a specific single entity in any other domain to exist.
IAO_0000117: Michael Rubinigg
IAO_0000118: generically dependent continuant in animal breeding
id: EUPH:2457

Axiom
annotated source: generically dependent continuant in animal breeding
annotated property: IAO_0000115
annotated target: A generically dependent contiunant in animal breeding is a continuant in the animal breeding domain that does not exist on its own, but does not require a specific single entity in any other domain to exist.
source: http://purl.obolibrary.org/obo/BFO_0000031

specifically dependent continuant in animal breeding
type: Class
subclass of: continuant in animal breeding
IAO_0000115: A specifically dependent continuant in animal breeding is a continuant in the animal breeding domain that does not exist on its own, but requires a specific single entity in any other domain to exist.
IAO_0000117: Michael Rubinigg
IAO_0000118: specifically dependent continuant in animal breeding
id: EUPH:2458

Axiom
annotated source: specifically dependent continuant in animal breeding
annotated property: IAO_0000115
annotated target: A specifically dependent continuant in animal breeding is a continuant in the animal breeding domain that does not exist on its own, but requires a specific single entity in any other domain to exist.
source: http://purl.obolibrary.org/obo/BFO_0000020

occurrent in animal breeding
type: Class
subclass of: entity in animal breeding
IAO_0000115: An occurrent in animal breeding is an entity in the animal breeding domain that unfolds through time and does not exist wholly at a single moment.
IAO_0000117: Michael Rubinigg
IAO_0000118: occurrent in animal breeding
id: EUPH:2459

Axiom
annotated source: occurrent in animal breeding
annotated property: IAO_0000115
annotated target: An occurrent in animal breeding is an entity in the animal breeding domain that unfolds through time and does not exist wholly at a single moment.
source: http://purl.obolibrary.org/obo/BFO_0000003

adult queen bee
type: Class
subclass of: adult honey bee
subclass of: Restriction
  on property: target participant in
  some values from: https://w3id.org/euph/7927
IAO_0000115: An adult queen bee is an adult honey bee that has developed into a queen.
IAO_0000117: Michael Rubinigg
IAO_0000118: adult queen
id: EUPH:2461

three-dimensional spatial region in beekeeping
type: Class
subclass of: spatial region in beekeeping
IAO_0000115: A three-dimensional spatial region in beekeeping is a spatial region in the beekeeping domain that has three dimensions.
IAO_0000117: Michael Rubinigg
IAO_0000118: three-dimensional spatial region in beekeeping
id: EUPH:2462

Axiom
annotated source: three-dimensional spatial region in beekeeping
annotated property: IAO_0000115
annotated target: A three-dimensional spatial region in beekeeping is a spatial region in the beekeeping domain that has three dimensions.
source: http://purl.obolibrary.org/obo/BFO_0000028

animal breeding process
type: Class
subclass of: occurrent in animal breeding
IAO_0000115: An animal breeding process is an occurrent entity in the animal breeding domain that inhabits the universal spatiotemporal region and has a proper temporal part.
IAO_0000117: Michael Rubinigg
IAO_0000118: animal breeding process
id: EUPH:2465

Axiom
annotated source: animal breeding process
annotated property: IAO_0000115
annotated target: An animal breeding process is an occurrent entity in the animal breeding domain that inhabits the universal spatiotemporal region and has a proper temporal part.
source: http://purl.obolibrary.org/obo/BFO_0000015

realisable entitiy in animal breeding
type: Class
subclass of: specifically dependent continuant in animal breeding
IAO_0000115: A realisable entitiy in animal breeding is a specifically dependent continuant in the animal breeding domain that requires some further process to be realised.
IAO_0000117: Michael Rubinigg
IAO_0000118: realisable entitiy in animal breeding
id: EUPH:2472

Axiom
annotated source: realisable entitiy in animal breeding
annotated property: IAO_0000115
annotated target: A realisable entitiy in animal breeding is a specifically dependent continuant in the animal breeding domain that requires some further process to be realised.
source: http://purl.obolibrary.org/obo/BFO_0000017

uncapped brood
type: Class
subclass of: physiological function
subclass of: Restriction
  on property: function of
  some values from: brood
IAO_0000115: Uncapped brood is brood (an egg or a larva), contained in the uncapped cell of a comb.
IAO_0000117: Michael Rubinigg
IAO_0000118: couvain ouvert @fr
IAO_0000118: covata non opercolata @it
IAO_0000118: open broed @nl
IAO_0000118: uncapped brood
IAO_0000118: unverdeckelte Brut @de
id: EUPH:25

honey foraging
type: Class
subclass of: https://w3id.org/euph/760
subclass of: Restriction
  on property: has input
  some values from: nectar
subclass of: Restriction
  on property: has input
  some values from: honeydew
subclass of: Restriction
  on property: has output
  some values from: honey stores
IAO_0000115: Honey foraging is a behaviour of honeybee workers in which nectar or honeydew is collected, supplied with glandular secretions, dehydrated, and finally stored in capped cells of the honeycomb.
IAO_0000117: Michael Rubinigg
IAO_0000118: Honig sammeln @de
IAO_0000118: honey foraging
id: EUPH:2509

plum and sloe
type: Class
subclass of: drupe fruit food product
IAO_0000115: Plum and sloe is an aggregate of drupe fruit food products used for statistical purposes by FAOSTAT. It is described by the following attributes or identifiers: FAOSTAT Item Code: 536 FAOSTAT Label: Plums and sloes CPC code: 01346 HS07 code: 080940 HS12 code: 080940
IAO_0000117: Michael Rubinigg
IAO_0000118: plum and sloe
id: EUPH:2526

Axiom
annotated source: plum and sloe
annotated property: IAO_0000115
annotated target: Plum and sloe is an aggregate of drupe fruit food products used for statistical purposes by FAOSTAT. It is described by the following attributes or identifiers: FAOSTAT Item Code: 536 FAOSTAT Label: Plums and sloes CPC code: 01346 HS07 code: 080940 HS12 code: 080940
source: https://www.fao.org/faostat/en/#definitions

hive management quality
type: Class
subclass of: https://w3id.org/euph/976
IAO_0000115: A hive management quality is a quality in the beekeeping domain related to hive management.
IAO_0000117: Michael Rubinigg
IAO_0000118: hive management quality entity
id: EUPH:2528

Axiom
annotated source: hive management quality
annotated property: IAO_0000115
annotated target: A hive management quality is a quality in the beekeeping domain related to hive management.
source: https://basic-formal-ontology.org/

resistant
type: Class
subclass of: phenotype of defense against diseases
subclass of: Restriction
  on property: quality of
  some values from: disease resistance trait of honey bees
IAO_0000115: Resistant is the most desirable phenotype of defense against diseases and indicates that a honey bee colony is able to keep the parasite burden to a minimum.
IAO_0000117: Michael Rubinigg
IAO_0000118: modstandsdygtig @da
IAO_0000118: motstandsdyktig @no
IAO_0000118: motståndskraftig @sv
IAO_0000118: ontvatbaar @nl
IAO_0000118: resistant
IAO_0000118: resistent @da
IAO_0000118: resistente @es
IAO_0000118: rezistent @ro
IAO_0000118: résistant @fr
IAO_0000118: widerstandsfähig @de
id: EUPH:2535

royal jelly biosynthetic process
type: Class
subclass of: metabolic process
subclass of: Restriction
  on property: has output
  some values from: royal jelly
IAO_0000115: A royal jelly biosynthetic process is a set of chemical reactions and pathways resulting in the formation of royal jelly.
IAO_0000117: Michael Rubinigg
IAO_0000118: royal jelly biosynthetic process
id: EUPH:2536

multipurpose water
type: Class
subclass of: honey bee forage
IAO_0000115: Multipurpose water is honey bee forage collected mainly to produce food for larvae [...] and to maintain colony thermal homeostasis [...]. Water collected by honey bees comes from a wide range of sources, including puddles, streams, irrigation, swimming pools, or even the sea.
IAO_0000117: Michael Rubinigg
IAO_0000118: multipurpose water
id: EUPH:2542

Axiom
annotated source: multipurpose water
annotated property: IAO_0000115
annotated target: Multipurpose water is honey bee forage collected mainly to produce food for larvae [...] and to maintain colony thermal homeostasis [...]. Water collected by honey bees comes from a wide range of sources, including puddles, streams, irrigation, swimming pools, or even the sea.
has db xref: 10.1007/s13592-025-01219-3

extrinsic role in beekeeping
type: Class
subclass of: role in beekeeping
IAO_0000115: An extrinsic role is a realisable entity in the beekeeping domain that exists because something outside the honeybee colony is in a specific situation.
IAO_0000117: Michael Rubinigg
IAO_0000118: extrinsic role in beekeeping
id: EUPH:2556

intrinsic role in beekeeping
type: Class
subclass of: role in beekeeping
IAO_0000115: An intrinsic role is a realisable entity in the beekeeping domain that exists because something within the honeybee colony is in a specific situation.
IAO_0000117: Michael Rubinigg
IAO_0000118: intrinsic role in beekeeping
id: EUPH:2557

lost swarm
type: Class
subclass of: swarm
IAO_0000115: A lost swarm is a swarm, either a prime swarm or an afterswarm, that a beekeeper has lost before hiving it.
IAO_0000117: Michael Rubinigg
IAO_0000118: durchgegangener Schwarm @de
IAO_0000118: durchgehender Schwarm @de
IAO_0000118: enjambre perdido @es
IAO_0000118: enxame perdido @pt
IAO_0000118: essaim volage @fr
IAO_0000118: lost swarm
IAO_0000118: ontsnapte zwerm @nl
IAO_0000118: roi fugit @ro
IAO_0000118: roi vagabond @ro
IAO_0000118: rymsvärm @sv
IAO_0000118: rømmet sværm @da
IAO_0000118: sciame perduto @it
IAO_0000118: tabt sværm @da
IAO_0000118: tapt sverm @no
id: EUPH:2558

disposition in beekeeping
type: Class
subclass of: realisable entitiy in beekeeping
IAO_0000115: A disposition in beekeeping is a realisable entitiy in the beekeeping domain that does not exist, because the bearer is in a specific situation.
IAO_0000117: Michael Rubinigg
IAO_0000118: realisable entitiy related to beekeeping equipment
id: EUPH:2559

Axiom
annotated source: disposition in beekeeping
annotated property: IAO_0000115
annotated target: A disposition in beekeeping is a realisable entitiy in the beekeeping domain that does not exist, because the bearer is in a specific situation.
source: http://purl.obolibrary.org/obo/BFO_0000016

honey bee breed
type: Class
subclass of: object in beekeeping
subclass of: Restriction
  on property: artificially selected from
  some values from: https://www.gbif.org/species/1341976
IAO_0000115: A honey bee breed is a group of domesticated animals of the species Apis mellifera that have similar morphological, physiological and ethological characteristics and a common breeding history.
IAO_0000117: Michael Rubinigg
IAO_0000118: Bienenrasse @de
IAO_0000118: Rasse der Westlichen Honigbiene @de
IAO_0000118: honey bee breed
id: EUPH:2560

information content entity in engineering
type: Class
subclass of: generically dependent continuant in engineering
IAO_0000115: An information content entity in engineering is a generically dependent continuant in the engineering domain that is about some thing.
IAO_0000117: Michael Rubinigg
IAO_0000118: information content entity in engineering
id: EUPH:2561

Axiom
annotated source: information content entity in engineering
annotated property: IAO_0000115
annotated target: An information content entity in engineering is a generically dependent continuant in the engineering domain that is about some thing.
source: http://purl.obolibrary.org/obo/IAO_0000030

FAOSTAT domain
type: Class
subclass of: FAOSTAT
IAO_0000115: A FAOSTAT domain is thematic section or category within the FAOSTAT database.
IAO_0000117: Michael Rubinigg
IAO_0000118: Domain
IAO_0000118: FAOSTAT domain
id: EUPH:2562

Axiom
annotated source: FAOSTAT domain
annotated property: IAO_0000115
annotated target: A FAOSTAT domain is thematic section or category within the FAOSTAT database.
source: https://www.fao.org/faostat/en/#definitions

FAOSTAT element
type: Class
subclass of: FAOSTAT
IAO_0000115: A FAOSTAT element is a specific variable within the FAOSTAT database.
IAO_0000117: Michael Rubinigg
IAO_0000118: Element
IAO_0000118: FAOSTAT element
id: EUPH:2563

Axiom
annotated source: FAOSTAT element
annotated property: IAO_0000115
annotated target: A FAOSTAT element is a specific variable within the FAOSTAT database.
source: https://www.fao.org/faostat/en/#definitions

material entity in engineering
type: Class
subclass of: independent continuant in engineering
IAO_0000115: A material entity in engineering is an independent continuant in the engineering domain that always has some portion of matter as a continuant part.
IAO_0000117: Michael Rubinigg
IAO_0000118: material entity in engineering
id: EUPH:2566

Axiom
annotated source: material entity in engineering
annotated property: IAO_0000115
annotated target: A material entity in engineering is an independent continuant in the engineering domain that always has some portion of matter as a continuant part.
source: http://purl.obolibrary.org/obo/BFO_0000040

engineering quantity
type: Class
subclass of: quality in engineering
IAO_0000115: A quantity of an engineering entity that exists through action of continuants in the engineering domain in relation to other entities.
IAO_0000117: Michael Rubinigg
IAO_0000118: engineering quantity
id: EUPH:2567

beekeeping quantity
type: Class
subclass of: https://w3id.org/euph/976
IAO_0000115: A quantity of a beekeeping entity that exists through action of continuants in the beekeeping domain in relation to other entities.
IAO_0000117: Michael Rubinigg
IAO_0000118: beekeeping quantity
id: EUPH:2568

Axiom
annotated source: beekeeping quantity
annotated property: IAO_0000115
annotated target: A quantity of a beekeeping entity that exists through action of continuants in the beekeeping domain in relation to other entities.
source: https://basic-formal-ontology.org/

continuant in animal breeding
type: Class
subclass of: entity in animal breeding
IAO_0000115: A continuant in animal breeding is an entity in the animal breeding domain that persists through time while maintaining its identity, such as objects.
IAO_0000117: Michael Rubinigg
IAO_0000118: continuant in animal breeding
id: EUPH:2591

Axiom
annotated source: continuant in animal breeding
annotated property: IAO_0000115
annotated target: A continuant in animal breeding is an entity in the animal breeding domain that persists through time while maintaining its identity, such as objects.
source: http://purl.obolibrary.org/obo/BFO_0000002

beekeeping equipment component
type: Class
subclass of: fiat object part in beekeeping
subclass of: Restriction
  on property: part of
  some values from: beekeeping equipment
IAO_0000115: A beekeeping equipment component is a proper part of a beekeeping equipment that contributes to the structure or function of that equipment.
IAO_0000117: Michael Rubinigg
IAO_0000118: beekeeping equipment component
id: EUPH:2592

capped brood
type: Class
subclass of: physiological function
subclass of: Restriction
  on property: function of
  some values from: brood
IAO_0000115: Capped brood is brood (a larva, pupa, adult shortly before hatching), contained in the capped cell of a comb.
IAO_0000117: Michael Rubinigg
IAO_0000118: capped brood
IAO_0000118: couvain fermé @fr
IAO_0000118: couvain operculé @fr
IAO_0000118: covata opercolata @it
IAO_0000118: gesloten broed @nl
IAO_0000118: verdeckelte Brut @de
id: EUPH:26

specifically dependent continuant in engineering
type: Class
subclass of: continuant in engineering
IAO_0000115: A specifically dependent continuant in engineering is a continuant entity in the engineering domain that does not exist on its own, but requires a specific single entity in any other domain to exist.
IAO_0000117: Michael Rubinigg
IAO_0000118: specifically dependent continuant in engineering
id: EUPH:2617

Axiom
annotated source: specifically dependent continuant in engineering
annotated property: IAO_0000115
annotated target: A specifically dependent continuant in engineering is a continuant entity in the engineering domain that does not exist on its own, but requires a specific single entity in any other domain to exist.
source: http://purl.obolibrary.org/obo/BFO_0000020

quality in engineering
type: Class
subclass of: specifically dependent continuant in engineering
IAO_0000115: A quality in engineering is a specifically dependent continuant in the engineering domain that does not require any further process to be realised.
IAO_0000117: Michael Rubinigg
IAO_0000118: quality in engineering
id: EUPH:2618

Axiom
annotated source: quality in engineering
annotated property: IAO_0000115
annotated target: A quality in engineering is a specifically dependent continuant in the engineering domain that does not require any further process to be realised.
source: http://purl.obolibrary.org/obo/BFO_0000019

process in chemistry
type: Class
subclass of: occurrent in chemistry
IAO_0000115: A process in chemistry is an occurrent entity in the chemistry domain that inhabit the universal spatiotemporal region and has a proper temporal part.
IAO_0000117: Michael Rubinigg
IAO_0000118: process in chemistry
id: EUPH:2619

Axiom
annotated source: process in chemistry
annotated property: IAO_0000115
annotated target: A process in chemistry is an occurrent entity in the chemistry domain that inhabit the universal spatiotemporal region and has a proper temporal part.
source: http://purl.obolibrary.org/obo/BFO_0000015

identifier of engineering entities
type: Class
subclass of: quality in engineering
IAO_0000115: An identifier of engineering entities is an identifier that is specific for entities in the engineering domain.
IAO_0000117: Michael Rubinigg
IAO_0000118: identifier of engineering entities
id: EUPH:2634

generically dependent continuant in pharmacology
type: Class
subclass of: continuant in pharmacology
IAO_0000115: A generically dependent continuant in pharmacology is an continuant entity in the pharmacology domain that does not exist on its own, but does not require a specific single entity in any other domain to exist.
IAO_0000117: Michael Rubinigg
IAO_0000118: generically dependent continuant in pharmacology
id: EUPH:2635

Axiom
annotated source: generically dependent continuant in pharmacology
annotated property: IAO_0000115
annotated target: A generically dependent continuant in pharmacology is an continuant entity in the pharmacology domain that does not exist on its own, but does not require a specific single entity in any other domain to exist.
source: http://purl.obolibrary.org/obo/BFO_0000031

propolising
type: Class
subclass of: https://w3id.org/euph/760
subclass of: Restriction
  on property: preceded by
  some values from: propolis production
IAO_0000115: Propolising is a propolis production process in which the resin collected from plants and mixed with wax and other endogenous glandular secretion is used as coating and filling material in the nest (e.g. sealing gaps, coating surfaces, embalming dead intruders, reducing the size of the entrance).
IAO_0000117: Michael Rubinigg
IAO_0000118: a propoliza @ro
IAO_0000118: at kitte @da
IAO_0000118: att kitta ihop @sv
IAO_0000118: propoliser @fr
IAO_0000118: propolisieren @de
IAO_0000118: propolising
IAO_0000118: propolizar @es
IAO_0000118: propolizzare @it
IAO_0000118: to propolise
IAO_0000118: vastkitten @nl
IAO_0000118: verkitten @de
IAO_0000118: å kitte med propolis @no
id: EUPH:2644

independent continuant in biology
type: Class
subclass of: continuant in biology
IAO_0000115: An independent continuant in biology is a continuant entity in the biology domain that does not depend on another entity in any domain for its existence.
IAO_0000117: Michael Rubinigg
IAO_0000118: independent continuant in biology
id: EUPH:2648

Axiom
annotated source: independent continuant in biology
annotated property: IAO_0000115
annotated target: An independent continuant in biology is a continuant entity in the biology domain that does not depend on another entity in any domain for its existence.
source: http://purl.obolibrary.org/obo/BFO_0000004

uncapping plane
type: Class
subclass of: uncapping equipment
subclass of: Restriction
  on property: involved in
  some values from: uncapping
IAO_0000115: An uncapping plane is an uncapping tool, consisting of a horizontal spacer and an opposing fork, which allows the tool to be pulled across the honeycomb to remove the wax caps.
IAO_0000117: Michael Rubinigg
IAO_0000118: Entdeckelungshobel @de
IAO_0000118: avtäckningsbricka @sv
IAO_0000118: ontzegelschaaf @nl
IAO_0000118: pialla disopercolatrice @it
IAO_0000118: plaina de desopercular @pt
IAO_0000118: plaina desoperculadora @pt
IAO_0000118: raspador de desopercular @es
IAO_0000118: râcloir á désoperculer @fr
IAO_0000118: skrellehøvel @no
IAO_0000118: skrællehøvl @da
IAO_0000118: uncapping plane
IAO_0000118: șpaclu de descăpăcit @ro
id: EUPH:2654

Single Superphosphate
type: Class
subclass of: FAOSTAT item label
IAO_0000115: FAOSTAT Item Single Superphosphate (FAOSTAT Item) listed on page Definitions and standards
IAO_0000117: Michael Rubinigg
IAO_0000118: Single Superphosphate
id: EUPH:2661

Axiom
annotated source: Single Superphosphate
annotated property: IAO_0000115
annotated target: FAOSTAT Item Single Superphosphate (FAOSTAT Item) listed on page Definitions and standards
source: https://www.fao.org/faostat/en/#definitions

directive information entity in geography
type: Class
subclass of: information content entity in geography
IAO_0000115: A directive information entity in geography is an information content entity in the geography domain whose concretisations indicate to their bearer how to realise them in a process.
IAO_0000117: Michael Rubinigg
IAO_0000118: directive information entity in geography
id: EUPH:2663

Axiom
annotated source: directive information entity in geography
annotated property: IAO_0000115
annotated target: A directive information entity in geography is an information content entity in the geography domain whose concretisations indicate to their bearer how to realise them in a process.
source: directive information entity

independent continuant in geography
type: Class
subclass of: continuant in geography
IAO_0000115: An independent continuant in geography is a continuant entity in the geography domain that does not depend on another entity in any domain for its existence.
IAO_0000117: Michael Rubinigg
IAO_0000118: independent continuant in geography
id: EUPH:2670

Axiom
annotated source: independent continuant in geography
annotated property: IAO_0000115
annotated target: An independent continuant in geography is a continuant entity in the geography domain that does not depend on another entity in any domain for its existence.
source: http://purl.obolibrary.org/obo/BFO_0000004

quality in geography
type: Class
subclass of: specifically dependent continuant in geography
IAO_0000115: A quality in geography is a specifically dependent entity in the geography domain that does not require any further process to be realised.
IAO_0000117: Michael Rubinigg
IAO_0000118: quality in geography
id: EUPH:2671

Axiom
annotated source: quality in geography
annotated property: IAO_0000115
annotated target: A quality in geography is a specifically dependent entity in the geography domain that does not require any further process to be realised.
source: http://purl.obolibrary.org/obo/BFO_0000019

relational quality in geography
type: Class
subclass of: quality in geography
IAO_0000115: A geographical relational quality is a quality entity in the geography domain that specifically dependends on two or more non-identical entities.
IAO_0000117: Michael Rubinigg
IAO_0000118: geographical relational quality
id: EUPH:2672

Axiom
annotated source: relational quality in geography
annotated property: IAO_0000115
annotated target: A geographical relational quality is a quality entity in the geography domain that specifically dependends on two or more non-identical entities.
source: relational quality in beekeeping

propolis production
type: Class
subclass of: https://w3id.org/euph/760
subclass of: Restriction
  on property: has output
  some values from: propolis
IAO_0000115: Propolis production is a behavior exhibited by honey bees in which resin collected from plants is mixed with wax and other endogenous glandular secretion.
IAO_0000117: Michael Rubinigg
IAO_0000118: Sodium nitrate
id: EUPH:2674

ISO 3166 country code
type: Class
subclass of: identifier of geographical enities
subclass of: Restriction
  on property: quality of
  some values from: country
IAO_0000115: An ISO 3166 country code is a geographical identifier issued by the International Organization for Standardization.
IAO_0000117: Michael Rubinigg
IAO_0000118: ISO 3166 country code
id: EUPH:2675

Axiom
annotated source: ISO 3166 country code
annotated property: IAO_0000115
annotated target: An ISO 3166 country code is a geographical identifier issued by the International Organization for Standardization.
source: https://www.iso.org/standard/72482.html

empty
type: Class
subclass of: qualitative attribute
IAO_0000115: unoccupied, at leisure, containing nothing, having nothing in it
IAO_0000117: Michael Rubinigg
IAO_0000118: empty
IAO_0000118: leeg @nl
IAO_0000118: leer @de
IAO_0000118: vide @fr
IAO_0000118: vuoto @it
id: EUPH:27

Axiom
annotated source: empty
annotated property: IAO_0000115
annotated target: unoccupied, at leisure, containing nothing, having nothing in it
has db xref: ISBN:0-13-947169-3

specifically dependent continuant in geography
type: Class
subclass of: continuant in geography
IAO_0000115: A specifically dependent continuant in geography is a continuant entity in the geography domain that does not exist on its own, but requires a specific single entity in any other domain to exist.
IAO_0000117: Michael Rubinigg
IAO_0000118: specifically dependent geographical entity
id: EUPH:2732

Axiom
annotated source: specifically dependent continuant in geography
annotated property: IAO_0000115
annotated target: A specifically dependent continuant in geography is a continuant entity in the geography domain that does not exist on its own, but requires a specific single entity in any other domain to exist.
source: http://purl.obolibrary.org/obo/BFO_0000020

generically dependent continuant in geography
type: Class
subclass of: continuant in geography
IAO_0000115: A generically dependent continuant in geography is a continuant entity in the geography domain that does not exist on its own, but does not require a specific single entity in any other domain to exist.
IAO_0000117: Michael Rubinigg
IAO_0000118: generically dependent geographical entity
id: EUPH:2733

Axiom
annotated source: generically dependent continuant in geography
annotated property: IAO_0000115
annotated target: A generically dependent continuant in geography is a continuant entity in the geography domain that does not exist on its own, but does not require a specific single entity in any other domain to exist.
source: http://purl.obolibrary.org/obo/BFO_0000031

honey bee nest
type: Class
subclass of: object in beekeeping
IAO_0000115: A honey bee nest is a site consisting of at least one comb in which open- and cavity-nesting honey bees live, raise their young and store food.
IAO_0000117: Michael Rubinigg
IAO_0000118: honey bee nest
id: EUPH:2734

zero-dimensional spatial region in geography
type: Class
subclass of: spatial region in geography
IAO_0000115: A zero-dimensional spatial region in geography is a spatial region in the geography domain that has zero dimensions.
IAO_0000117: Michael Rubinigg
IAO_0000118: zero-dimensional spatial region in geography
id: EUPH:2746

Axiom
annotated source: zero-dimensional spatial region in geography
annotated property: IAO_0000115
annotated target: A zero-dimensional spatial region in geography is a spatial region in the geography domain that has zero dimensions.
source: http://purl.obolibrary.org/obo/BFO_0000018

disease resistance trait of honey bees
type: Class
subclass of: disease defense trait of honey bees
IAO_0000115: A disease resistance trait of honey bees is a disease defense trait that quantifies the ability of a honey bee colony to limit the parasite burden.
IAO_0000117: Michael Rubinigg
IAO_0000118: disease resistance trait of honey bees
id: EUPH:2777

Axiom
annotated source: disease resistance trait of honey bees
annotated property: IAO_0000115
annotated target: A disease resistance trait of honey bees is a disease defense trait that quantifies the ability of a honey bee colony to limit the parasite burden.
has db xref: 10.1126/science.1148526

object aggregate in plant production
type: Class
subclass of: material entity in plant production
IAO_0000115: An object aggregate in plant production is a material entity in the plant production domain that is a collection of disjoint self-standing single objects.
IAO_0000117: Michael Rubinigg
IAO_0000118: object aggregate in plant production
id: EUPH:2788

Axiom
annotated source: object aggregate in plant production
annotated property: IAO_0000115
annotated target: An object aggregate in plant production is a material entity in the plant production domain that is a collection of disjoint self-standing single objects.
source: http://purl.obolibrary.org/obo/BFO_0000004

queen bee
type: Class
subclass of: member of honey bee colony
subclass of: Restriction
  on property: target participant in
  some values from: queen management
subclass of: Restriction
  on property: target participant in
  some values from: https://w3id.org/euph/839
subclass of: Restriction
  on property: has role
  some values from: caste
IAO_0000115: A queen bee is a member of honey bee colony that is female and fully capable of reproduction as an imago.
IAO_0000117: Michael Rubinigg
IAO_0000118: Königin @de
IAO_0000118: Weisel @de
IAO_0000118: abelha mestra @pt
IAO_0000118: abelha mãe @pt
IAO_0000118: dronning @da
IAO_0000118: drottning @sv
IAO_0000118: koningin @nl
IAO_0000118: machiega @es
IAO_0000118: madre @it
IAO_0000118: maesa @es
IAO_0000118: maestra @es
IAO_0000118: matcă @ro
IAO_0000118: moer @nl
IAO_0000118: mère @fr
IAO_0000118: queen
IAO_0000118: rainha @pt
IAO_0000118: regina @it
IAO_0000118: regină @ro
IAO_0000118: reina @es
IAO_0000118: reine @fr
IAO_0000118: vise @sv
id: EUPH:28

object in meteorology
type: Class
subclass of: material entity in meteorology
IAO_0000115: An object in meteorology is a material entity in the meteorology domain that is neither a collection of disjoint self-standing single objects, nor a proper part of an object.
IAO_0000117: Michael Rubinigg
IAO_0000118: object in meteorology
id: EUPH:2815

Axiom
annotated source: object in meteorology
annotated property: IAO_0000115
annotated target: An object in meteorology is a material entity in the meteorology domain that is neither a collection of disjoint self-standing single objects, nor a proper part of an object.
source: http://purl.obolibrary.org/obo/BFO_0000030

scum
type: Class
subclass of: hive product part
IAO_0000115: Scum is an undesired layer of extraneous matter that forms on top of a hive product.
IAO_0000117: Michael Rubinigg
IAO_0000118: Schaum @de
IAO_0000118: espuma @es
IAO_0000118: schiuma @it
IAO_0000118: schuim @nl
IAO_0000118: scum
IAO_0000118: skum @da
IAO_0000118: spumă @ro
IAO_0000118: écume @fr
id: EUPH:2816

egg laying rate of queen bee
type: Class
subclass of: reproductive trait of honey bees
IAO_0000115: The egg laying rate of a queen bee is a reproductive trait of a honey bee colony that quantifies the number of eggs produced by a queen bee over a specified time period.
IAO_0000117: Michael Rubinigg
IAO_0000118: Legerate von Honigbienenköniginnen @de
IAO_0000118: egg laying rate of honey bee queens
id: EUPH:2823

independent continuant in veterinary medicine
type: Class
subclass of: continuant in veterinary medicine
IAO_0000115: An independent continuant in veterinary medicine is a continuant entity in the veterinary medicine domain that does not depend on another entity in any domain for its existence.
IAO_0000117: Michael Rubinigg
IAO_0000118: independent continuant in veterinary medicine
id: EUPH:2828

Axiom
annotated source: independent continuant in veterinary medicine
annotated property: IAO_0000115
annotated target: An independent continuant in veterinary medicine is a continuant entity in the veterinary medicine domain that does not depend on another entity in any domain for its existence.
source: http://purl.obolibrary.org/obo/BFO_0000004

process in veterinary medicine
type: Class
subclass of: occurrent in veterinary medicine
IAO_0000115: A process in veterinary medicine is an occurrent entity in the veterinary medicine domain that inhabits the universal spatiotemporal region and has a proper temporal part.
IAO_0000117: Michael Rubinigg
IAO_0000118: process in veterinary medicine
id: EUPH:2829

Axiom
annotated source: process in veterinary medicine
annotated property: IAO_0000115
annotated target: A process in veterinary medicine is an occurrent entity in the veterinary medicine domain that inhabits the universal spatiotemporal region and has a proper temporal part.
source: http://purl.obolibrary.org/obo/BFO_0000015

wax plate
type: Class
subclass of: cuticle
subclass of: Restriction
  on property: part of
  some values from: wax gland
IAO_0000115: The wax plate, also referred to as wax mirror, is a structure in the cuticle of worker bees that is part of the wax gland complex. It is characterised by the presence of a large, oval, polished surface framed in dark marginal bands and separated by a broader median space.
IAO_0000117: Michael Rubinigg
IAO_0000118: Wachsspiegel @de
IAO_0000118: espejo de la cera @es
IAO_0000118: espelho segregador de cera @pt
IAO_0000118: miroir á cire @fr
IAO_0000118: oglindă cerieră @ro
IAO_0000118: placa de cera @es
IAO_0000118: plăcuță cerieră @ro
IAO_0000118: specchio della cera @it
IAO_0000118: speil @no
IAO_0000118: spejl @da
IAO_0000118: vaxspegel @sv
IAO_0000118: voksspeil @no
IAO_0000118: wasspiegel @nl
IAO_0000118: wax mirror
IAO_0000118: wax plate
id: EUPH:2837

Axiom
annotated source: wax plate
annotated property: IAO_0000115
annotated target: The wax plate, also referred to as wax mirror, is a structure in the cuticle of worker bees that is part of the wax gland complex. It is characterised by the presence of a large, oval, polished surface framed in dark marginal bands and separated by a broader median space.
has db xref: ISBN:978-0-8014-0400-9

quality in veterinary medicine
type: Class
subclass of: specifically dependent continuant in veterinary medicine
IAO_0000115: A quality in veterinary medicine is a specifically dependent continuant in the veterinary medicine domain that does not require any further process to be realised.
IAO_0000117: Michael Rubinigg
IAO_0000118: quality in veterinary medicine
id: EUPH:2843

Axiom
annotated source: quality in veterinary medicine
annotated property: IAO_0000115
annotated target: A quality in veterinary medicine is a specifically dependent continuant in the veterinary medicine domain that does not require any further process to be realised.
source: http://purl.obolibrary.org/obo/BFO_0000019

disposition in veterinary medicine
type: Class
subclass of: realisable entity in veterinary medicine
IAO_0000115: A disposition in veterinary medicine is a realisable entity that does not exist, because the bearer is in a specific situation.
IAO_0000117: Michael Rubinigg
IAO_0000118: disposition in veterinary medicine
id: EUPH:2844

Axiom
annotated source: disposition in veterinary medicine
annotated property: IAO_0000115
annotated target: A disposition in veterinary medicine is a realisable entity that does not exist, because the bearer is in a specific situation.
source: http://purl.obolibrary.org/obo/BFO_0000016

generically dependent continuant in veterinary medicine
type: Class
subclass of: continuant in veterinary medicine
IAO_0000115: A generically dependent continuant in veterinary medicine is a continuant entity in the veterinary medicine domain that does not exist on its own, but does not require a specific single entity in any other domain to exist.
IAO_0000117: Michael Rubinigg
IAO_0000118: generically dependent continuant in veterinary medicine
id: EUPH:2845

Axiom
annotated source: generically dependent continuant in veterinary medicine
annotated property: IAO_0000115
annotated target: A generically dependent continuant in veterinary medicine is a continuant entity in the veterinary medicine domain that does not exist on its own, but does not require a specific single entity in any other domain to exist.
source: http://purl.obolibrary.org/obo/BFO_0000031

specifically dependent continuant in veterinary medicine
type: Class
subclass of: continuant in veterinary medicine
IAO_0000115: A specifically dependent continuant in veterinary medicine is a continuant entity in the veterinary medicine domain that does not exist on its own, but requires a specific single entity in any other domain to exist.
IAO_0000117: Michael Rubinigg
IAO_0000118: specifically dependent continuant in veterinary medicine
id: EUPH:2846

Axiom
annotated source: specifically dependent continuant in veterinary medicine
annotated property: IAO_0000115
annotated target: A specifically dependent continuant in veterinary medicine is a continuant entity in the veterinary medicine domain that does not exist on its own, but requires a specific single entity in any other domain to exist.
source: http://purl.obolibrary.org/obo/BFO_0000020

realisable entity in veterinary medicine
type: Class
subclass of: specifically dependent continuant in veterinary medicine
IAO_0000115: A realisable entity in veterinary medicine is a specifically dependent continuant in the veterinary medicine domain that requires some further process to be realised.
IAO_0000117: Michael Rubinigg
IAO_0000118: realisable entity in veterinary medicine
id: EUPH:2848

Axiom
annotated source: realisable entity in veterinary medicine
annotated property: IAO_0000115
annotated target: A realisable entity in veterinary medicine is a specifically dependent continuant in the veterinary medicine domain that requires some further process to be realised.
source: http://purl.obolibrary.org/obo/BFO_0000017

chemistry lab equipment
type: Class
subclass of: object in chemistry
IAO_0000115: Chemistry lab equipment is equipment that is used to perform analyses in a chemical labratory.
IAO_0000117: Michael Rubinigg
IAO_0000118: chemistry lab equipment
id: EUPH:2851

role in veterinary medicine
type: Class
subclass of: realisable entity in veterinary medicine
IAO_0000115: A role in veterinary medicine is a realisable entity in the veterinary medicine domain that exist because the bearer is in a specific situation.
IAO_0000117: Michael Rubinigg
IAO_0000118: role in veterinary medicine
id: EUPH:2852

Axiom
annotated source: role in veterinary medicine
annotated property: IAO_0000115
annotated target: A role in veterinary medicine is a realisable entity in the veterinary medicine domain that exist because the bearer is in a specific situation.
source: http://purl.obolibrary.org/obo/BFO_0000023

uncapping machine
type: Class
subclass of: uncapping equipment
subclass of: Restriction
  on property: involved in
  some values from: uncapping
subclass of: Restriction
  on property: part of
  some values from: honey extraction line
IAO_0000115: A device that automatically removes wax cappings from honey frames.
IAO_0000117: Michael Rubinigg
IAO_0000118: Entdeckelungsmachine @de
IAO_0000118: uncapping machine
id: EUPH:2853

honey frame
type: Class
subclass of: frame of drawn comb
subclass of: Restriction
  on property: surrounds
  some values from: https://w3id.org/euph/802
IAO_0000115: A frame of honey comb.
IAO_0000117: Michael Rubinigg
IAO_0000118: Honigwabe @de
IAO_0000118: honey frame
id: EUPH:2854

uncapping equipment
type: Class
subclass of: honey harvesting equipment
subclass of: Restriction
  on property: involved in
  some values from: honey harvesting
IAO_0000115: Any equipment used to remove wax caps from honey frames.
IAO_0000117: Michael Rubinigg
IAO_0000118: Entdeckelungsgerät @de
IAO_0000118: uncapping equipment
id: EUPH:2855

uncapping tray
type: Class
subclass of: uncapping equipment
subclass of: Restriction
  on property: involved in
  some values from: uncapping
IAO_0000115: A receptacle, usually made of stainless ssteel, used for holding a honey comb for manual uncapping.
IAO_0000117: Michael Rubinigg
IAO_0000118: Entdeckelungsgestell @de
IAO_0000118: avtäckningsbricka @sv
IAO_0000118: caballete de desopercular @es
IAO_0000118: caja de opérculos @es
IAO_0000118: cavalletto per disopercolare @it
IAO_0000118: chevalet à désoperculer @fr
IAO_0000118: cuba de desopercular @pt
IAO_0000118: lekbak @nl
IAO_0000118: mesa de desopercular @pt
IAO_0000118: ontzegelbak @nl
IAO_0000118: skrellekar @no
IAO_0000118: skrællebakke @da
IAO_0000118: supporto per disopercolare @it
IAO_0000118: tavă de căpăcele @ro
IAO_0000118: tavă de descăpăcit @ro
IAO_0000118: uncapping tray
id: EUPH:2856

uncapping tank
type: Class
subclass of: uncapping equipment
subclass of: Restriction
  on property: involved in
  some values from: uncapping
IAO_0000115: A vessel, usually made of stainless steel or food grade plastic hilding uncapped honey frames and often one or more uncapping trays.
IAO_0000117: Michael Rubinigg
IAO_0000118: Entdeckelungswanne @de
IAO_0000118: uncapping tank
id: EUPH:2857

labelling machine
type: Class
subclass of: general hive product processing equipment
IAO_0000115: A machine that automatically sticks labels onto, for example, honey jars or beverage bottles.
IAO_0000117: Michael Rubinigg
IAO_0000118: Etikettiermaschine @de
IAO_0000118: labelling machine
id: EUPH:2858

glass washer machine
type: Class
subclass of: general hive product processing equipment
IAO_0000115: A device that cleans glasses, e.g. honey jars, according to the legal requirements for foodstuffs.
IAO_0000117: Michael Rubinigg
IAO_0000118: Gläserwaschmaschine @de
IAO_0000118: glass washer machine
id: EUPH:2859

mobile lift table
type: Class
subclass of: beekeeping vehicle
IAO_0000115: A motor powered or unpowered vehicle used to raise or lower goods, employing a scissors mechanism.
IAO_0000117: Michael Rubinigg
IAO_0000118: Hubtischwagen @de
IAO_0000118: mobile lift table
id: EUPH:2860

honey decrystallization device
type: Class
subclass of: honey processing equipment
subclass of: Restriction
  on property: involved in
  some values from: honey processing
IAO_0000115: A device for liquefying chrystallized honey with the aid of heat and/or mechanical force.
IAO_0000117: Michael Rubinigg
IAO_0000118: Honigauftaugerät @de
IAO_0000118: honey decrystallization device
id: EUPH:2861

honey heating tank
type: Class
subclass of: honey decrystallization device
IAO_0000115: A heatable vessel, usually made of stainless steel, used to liquefy crystallised honey.
IAO_0000117: Michael Rubinigg
IAO_0000118: Auftaubehälter @de
IAO_0000118: honey heating tank
id: EUPH:2862

honey decrystallization and sieving device
type: Class
subclass of: honey decrystallization device
IAO_0000115: A device that is used to liquefy crystallised honey and then immediately filter it.
IAO_0000117: Michael Rubinigg
IAO_0000118: Schmelz- und Siebgerät für Honig @de
IAO_0000118: honey decrystallization and sieving device
id: EUPH:2863

Melitherm
type: Class
subclass of: honey decrystallization and sieving device
IAO_0000115: A device consisting of a top chamber with a stainless steel mesh base, above which a a fine nylon cloth, trapped in place with a steel hoop, and a flat spiral heater with a thermostat control is placed. Between the lower tank and the top chamber a perforated steel ring allows condensation to escape as the honey is heated.
IAO_0000117: Michael Rubinigg
IAO_0000118: Melitherm
IAO_0000118: Mellitherm @de
id: EUPH:2864

honey decrystallization coil
type: Class
subclass of: hive product processing equipment component
subclass of: Restriction
  on property: part of
  some values from: honey decrystallization and sieving device
IAO_0000115: An electrically powered device used for for melting crystallized honey stored in tanks, which is inserted directly onto the chrystalized honey, consiting of a coiled heating element that is loger than the height of the tank and a controlling unit on top.
IAO_0000117: Michael Rubinigg
IAO_0000118: Tauchwärmer @de
IAO_0000118: honey decrystallization coil
id: EUPH:2865

honey heating cabinet
type: Class
subclass of: honey decrystallization device
IAO_0000115: A boxlike enclosure, usually made of stainless steel or plastic, with a electrically powered heating element and a controlling unit in which honey tanks or hoeny pails containing crystallised honey can be heated to liquefy the honey.
IAO_0000117: Michael Rubinigg
IAO_0000118: Honigauftauschrank @de
IAO_0000118: Wärmeschrank @de
IAO_0000118: honey heating cabinet
id: EUPH:2866

honey creaming machine
type: Class
subclass of: honey processing equipment
subclass of: Restriction
  on property: involved in
  some values from: creamed honey processing
IAO_0000115: A device used to produce creamed honey.
IAO_0000117: Michael Rubinigg
IAO_0000118: Cremehonig-Rührgerät @de
IAO_0000118: honey creaming machine
id: EUPH:2867

uncapped honey comb
type: Class
subclass of: https://w3id.org/euph/802
IAO_0000115: An uncapped honey comb is a honey comb from which the caps have been removed.
IAO_0000117: Michael Rubinigg
IAO_0000118: entdeckelte Honigwabe @de
IAO_0000118: uncapped honey comb
id: EUPH:2868

heating unit
type: Class
subclass of: temperature control unit
subclass of: Restriction
  on property: involved in or involved in regulation of
  some values from: temperature
subclass of: Restriction
  on property: part of
  some values from: queen cell incubator
subclass of: Restriction
  on property: part of
  some values from: honey heating tank
subclass of: Restriction
  on property: part of
  some values from: Melitherm
subclass of: Restriction
  on property: part of
  some values from: honey decrystallization coil
subclass of: Restriction
  on property: part of
  some values from: honey heating cabinet
IAO_0000115: A heating unit controlled by a thermostat that increases the temperature in an enclosed compartment above ambient temperature.
IAO_0000117: Michael Rubinigg
IAO_0000118: Heizaggregat @de
IAO_0000118: heating unit
id: EUPH:2869

honey blending machine
type: Class
subclass of: honey decrystallization device
IAO_0000115: A device used to blend honey batches from different proveniance.
IAO_0000117: Michael Rubinigg
IAO_0000118: Honigrührgerät @de
IAO_0000118: honey blending machine
id: EUPH:2870

forklift
type: Class
subclass of: beekeeping vehicle
IAO_0000115: A powered industrial truck used to lift and move materials over short distances.
IAO_0000117: Michael Rubinigg
IAO_0000118: Hubstapler @de
IAO_0000118: forklift
id: EUPH:2871

pallet jack
type: Class
subclass of: beekeeping vehicle
IAO_0000115: A tool used to lift and move pallets.
IAO_0000117: Michael Rubinigg
IAO_0000118: Hubwagen @de
IAO_0000118: pallet jack
id: EUPH:2872

disease control
type: Class
subclass of: animal health management
IAO_0000115: Disease control is a set of management and physical measures in the field of animal health management that aims to reduce [...] the [...] disease incidence, prevalence, morbidity or mortality to a locally acceptable level as a result of deliberate efforts; continued intervention measures are required to maintain the reduction.
IAO_0000117: Michael Rubinigg
IAO_0000118: Krankheitsbekämpfung @de
IAO_0000118: disease control
id: EUPH:2873

elimination of a disease
type: Class
subclass of: disease control
IAO_0000115: Reduction to zero of the incidence of a specified disease in a defined geographical area as a result of deliberate etforts; continued intervenition measures are required.
IAO_0000117: Michael Rubinigg
IAO_0000118: elimination of a disease
id: EUPH:2874

elimination of an infection
type: Class
subclass of: disease control
IAO_0000115: Reduction to zero of the incidence of infection caused by a specific agent in a defined geographical area as a result of deliberate efforts; continued measures to prevent reestabishment of transmission are required
IAO_0000117: Michael Rubinigg
IAO_0000118: elimination of an infection
id: EUPH:2875

disease eradication
type: Class
subclass of: disease control
IAO_0000115: Disease eradication is a process of disease control that has been defined as a permanent reduction to zero of the worldwide incidence of infection caused by a specific agent as a result of deliberate efforts; intervention measures are no longer needed.
IAO_0000117: Michael Rubinigg
IAO_0000118: disease eradication
id: EUPH:2876

disease extinction
type: Class
subclass of: disease control
IAO_0000115: The specific infectious agent no longer exists in nature or in the laboratory.
IAO_0000117: Michael Rubinigg
IAO_0000118: disease extinction
id: EUPH:2877

biotechnical method for disease control
type: Class
subclass of: disease treatment
IAO_0000115: A biotechnical method for disease control is a treatment of a disease based on technical interventions.
IAO_0000117: Michael Rubinigg
IAO_0000118: biotechnical methods for disease control
IAO_0000118: biotechnische Methoden zur Krankheitsbekämpfung @de
IAO_0000118: métodos biotécnicos para el control de enfermedades @es
id: EUPH:2878

hyperthermia varroa control device
type: Class
subclass of: honey bee disease control eqipment
subclass of: Restriction
  on property: capable of inhibiting or preventing pathological process
  some values from: varroosis of honey bees
IAO_0000115: A device for controlling the Varroa mite (Varroa destructor) in Honey bees (Apis mellifera), based on the difference in resistance to elevated temperatures of honey bee larvae as compared to Varroa mites.
IAO_0000117: Michael Rubinigg
IAO_0000118: Hyperthermie-Gerät zur Varroabekämpfung @de
IAO_0000118: hyperthermia varroa control device
id: EUPH:2879

cooling unit
type: Class
subclass of: temperature control unit
subclass of: Restriction
  on property: involved in or involved in regulation of
  some values from: temperature
subclass of: Restriction
  on property: involved in negative regulation of
  some values from: thermodynamic temperature
subclass of: Restriction
  on property: part of
  some values from: cooling chamber
IAO_0000115: A cooling unit controlled by a thermostat that decreases the temperature in an enclosed compartment below ambient temperature.
IAO_0000117: Michael Rubinigg
IAO_0000118: Kühlaggregat @de
IAO_0000118: cooling unit
id: EUPH:2880

temperature control unit
type: Class
subclass of: control unit
IAO_0000115: A unit controlled by a thermostat that keeps the temperature in an enclosed compartment within a certain temperature range.
IAO_0000117: Michael Rubinigg
IAO_0000118: Temperaturregler @de
IAO_0000118: temperature control unit
id: EUPH:2881

crane
type: Class
subclass of: beekeeping vehicle component
subclass of: Restriction
  on property: transports
  some values from: https://w3id.org/euph/8
subclass of: Restriction
  on property: has target end location
  some values from: trailer
subclass of: Restriction
  on property: has target end location
  some values from: commercial vehicle
subclass of: Restriction
  on property: part of
  some values from: commercial vehicle
IAO_0000115: A powered or unpowered machine, often attached to a vehicle, which is used to lift and lower heavy objects or to transport them to other places which are within the range of the outrigger of the crane.
IAO_0000117: Michael Rubinigg
IAO_0000118: Ladekran @de
IAO_0000118: crane
id: EUPH:2882

pollen processing equipment
type: Class
subclass of: hive product processing equipment
IAO_0000115: Any quipment used for extraction, cleaning, drying, and grinding of pollen collected by honey bees.
IAO_0000117: Michael Rubinigg
IAO_0000118: Pollenverarbeitungsgerät @de
IAO_0000118: pollen processing equipment
id: EUPH:2883

pollen cleaner
type: Class
subclass of: pollen processing equipment
subclass of: Restriction
  on property: involved in
  some values from: pollen processing
IAO_0000115: A device used to remove organic and inorganic foreign materials from pollen collected by honey bees.
IAO_0000117: Michael Rubinigg
IAO_0000118: Pollenreinigungsgerät @de
IAO_0000118: pollen cleaner
id: EUPH:2884

pollen dryer
type: Class
subclass of: pollen processing equipment
subclass of: Restriction
  on property: involved in
  some values from: pollen processing
IAO_0000115: A decice uesed to dry clean pollen collected by bees.
IAO_0000117: Michael Rubinigg
IAO_0000118: Pollentrocknungsgerät @de
IAO_0000118: pollen dryer
id: EUPH:2885

pump for royal jelly
type: Class
subclass of: royal jelly harvesting equipment
subclass of: Restriction
  on property: involved in
  some values from: royal jelly harvesting
IAO_0000115: A device used to remove royal jelly from a queen cell by suction.
IAO_0000117: Michael Rubinigg
IAO_0000118: Gelée-Royale-Pumpe @de
IAO_0000118: pump for royal jelly
id: EUPH:2886

room dehumidifier
type: Class
subclass of: general beekeeping equipment
IAO_0000115: A device used to reduce the relative humidity in a room.
IAO_0000117: Michael Rubinigg
IAO_0000118: Raumentfeuchter @de
IAO_0000118: room dehumidifier
id: EUPH:2887

honey extractor
type: Class
subclass of: honey extraction equipment
subclass of: Restriction
  on property: involved in
  some values from: honey extraction by centrifugation
subclass of: Restriction
  on property: part of
  some values from: honey extraction line
IAO_0000115: A honey extracor is an equipment used to extract honey from uncapped honey frames by applying centrifugal force.
IAO_0000117: Michael Rubinigg
IAO_0000118: Honigschleuder @de
IAO_0000118: centrifugă @ro
IAO_0000118: centrífuga @pt
IAO_0000118: extracteur centrifuge @fr
IAO_0000118: extractor
IAO_0000118: extractor centrifugal @ro
IAO_0000118: extractor centrífugo @es
IAO_0000118: honingslinger @nl
IAO_0000118: honungsslungare @sv
IAO_0000118: slynge @da
IAO_0000118: smelatore @it
id: EUPH:2888

honey extraction equipment
type: Class
subclass of: honey harvesting equipment
subclass of: Restriction
  on property: involved in
  some values from: honey harvesting
IAO_0000115: honey extraction equipment is any equipment used for extraction of honey.
IAO_0000117: Michael Rubinigg
IAO_0000118: Geräte zur Honiggewinnung @de
IAO_0000118: honey extraction equipment
id: EUPH:2889

all-in-one honey extractor
type: Class
subclass of: honey extraction equipment
subclass of: Restriction
  on property: involved in
  some values from: honey harvesting
IAO_0000115: A work tool for hobby beekeepers that combines uncapping tank, uncapping tray and honey extractor in a single unit.
IAO_0000117: Michael Rubinigg
IAO_0000118: Kombi-Schleuder @de
IAO_0000118: all-in-one honey extractor
id: EUPH:2890

honey extractor with horizontal axis
type: Class
subclass of: honey extractor
subclass of: Restriction
  on property: involved in
  some values from: honey harvesting
IAO_0000115: A honey extractor in which the axis of the basket lays in horizontal direction.
IAO_0000117: Michael Rubinigg
IAO_0000118: Horizontal-Honigschleuder @de
IAO_0000118: honey extractor with horizontal axis
id: EUPH:2891

honey extractor with vertical axis
type: Class
subclass of: honey extractor
subclass of: Restriction
  on property: involved in
  some values from: honey harvesting
IAO_0000115: A honey extractor with vertical axis is a honey extractor in which the axis of the basket lays in vertical direction.
IAO_0000117: Michael Rubinigg
IAO_0000118: Vertikal-Honigschleuder @de
IAO_0000118: honey extractor with vertical axis
id: EUPH:2892

tangential basket
type: Class
subclass of: honey extractor basket
subclass of: Restriction
  on property: part of
  some values from: manual drive extractor
subclass of: Restriction
  on property: part of
  some values from: electric bottom drive extractor
subclass of: Restriction
  on property: part of
  some values from: electric top drive extractor
IAO_0000115: A honey extractor in which the uncapped honeycombs are arranged in the basket in a tangential direction and tharefore have to be reversed at least once.
IAO_0000117: Michael Rubinigg
IAO_0000118: Tangentialkorb @de
IAO_0000118: tangential basket
id: EUPH:2893

radial basket
type: Class
subclass of: honey extractor basket
subclass of: Restriction
  on property: part of
  some values from: electric bottom drive extractor
subclass of: Restriction
  on property: part of
  some values from: electric top drive extractor
IAO_0000115: A honey extractor in which the uncapped honeycombs are arranged in the basket in a radial direction.
IAO_0000117: Michael Rubinigg
IAO_0000118: Radialkorb @de
IAO_0000118: radial basket
id: EUPH:2894

hybrid basket
type: Class
subclass of: honey extractor basket
subclass of: Restriction
  on property: part of
  some values from: manual drive extractor
subclass of: Restriction
  on property: part of
  some values from: electric bottom drive extractor
subclass of: Restriction
  on property: part of
  some values from: electric top drive extractor
IAO_0000115: A honey extractor in which the uncapped honeycombs may be arranged in the basket in both a tangential and a radial direction.
IAO_0000117: Michael Rubinigg
IAO_0000118: Hybridkorb @de
IAO_0000118: hybrid basket
id: EUPH:2895

self-turning cassettes
type: Class
subclass of: hive product harvesting equipment component
subclass of: Restriction
  on property: part of
  some values from: tangential basket
IAO_0000115: A basket in which frames are held within a cassette. Cassettes automatically turn outwards (tangentially) as the machine picks up speed. Reversing the machine causes the cassettes to turn in the opposite direction.
IAO_0000117: Michael Rubinigg
IAO_0000118: Selbstwender @de
IAO_0000118: self-turning cassettes
id: EUPH:2896

manual drive extractor
type: Class
subclass of: honey extractor
subclass of: Restriction
  on property: has function
  some values from: manually powered drive
subclass of: Restriction
  on property: involved in
  some values from: honey harvesting
IAO_0000115: A manual drive extractor is a honey extractor in which the basket is driven manually by a hand crank.
IAO_0000117: Michael Rubinigg
IAO_0000118: Schleuder mit Handbetrieb @de
IAO_0000118: manual drive extractor
id: EUPH:2897

electric bottom drive extractor
type: Class
subclass of: honey extractor
subclass of: Restriction
  on property: has function
  some values from: electrically powered drive
subclass of: Restriction
  on property: involved in
  some values from: honey harvesting
IAO_0000115: An electric bottom drive extractor is a honey extractor in which the basket is driven by an electric motor fitted at the bottom of the extractor.
IAO_0000117: Michael Rubinigg
IAO_0000118: Schleuder mit elektrischem Unterantrieb @de
IAO_0000118: electric bottom drive extractor
id: EUPH:2898

electric top drive extractor
type: Class
subclass of: honey extractor
subclass of: Restriction
  on property: has function
  some values from: electrically powered drive
subclass of: Restriction
  on property: involved in
  some values from: honey harvesting
IAO_0000115: An electric top drive extractor is a honey extractor in which the basket is driven by an electric motor fitted on top of the extractor.
IAO_0000117: Michael Rubinigg
IAO_0000118: Schleuder mit elektrischem Oberantrieb @de
IAO_0000118: electric top drive extractor
id: EUPH:2899

control unit
type: Class
subclass of: fiat object part in engineering
IAO_0000115: An electronic or mechanical component that controls a device.
IAO_0000117: Michael Rubinigg
IAO_0000118: Steuerungseinheit @de
IAO_0000118: control unit
id: EUPH:2900

manual control unit
type: Class
subclass of: control unit
IAO_0000115: A device without any automatic control by an electronic component. It is entirely under human control during operation.
IAO_0000117: Michael Rubinigg
IAO_0000118: manual control unit
IAO_0000118: manuelle Steuerungseinheit @de
id: EUPH:2901

semi-automatic control unit
type: Class
subclass of: control unit
IAO_0000115: An electronic component that partially automatically controls a device during operation and partially relies on human intervention.
IAO_0000117: Michael Rubinigg
IAO_0000118: halbautomatische Steuerungseinheit @de
IAO_0000118: semi-automatic steering unit
id: EUPH:2902

automatic control unit
type: Class
subclass of: control unit
IAO_0000115: An electronic component that automatically controls a device during operation and requires no further human intervention.
IAO_0000117: Michael Rubinigg
IAO_0000118: automatic steering unit
IAO_0000118: automatische Steuerungseinheit @de
id: EUPH:2903

honey extraction line
type: Class
subclass of: honey extraction equipment
subclass of: Restriction
  on property: involved in
  some values from: honey harvesting
IAO_0000115: A work tool for professional beekeepers that combines uncapping machine and honey extractor in a single unit.
IAO_0000117: Michael Rubinigg
IAO_0000118: Schleuderstraße @de
IAO_0000118: honey extraction line
id: EUPH:2904

honey tank
type: Class
subclass of: honey processing equipment
subclass of: Restriction
  on property: involved in
  some values from: honey processing
IAO_0000115: Any vessel used for storing or settling of honey.
IAO_0000117: Michael Rubinigg
IAO_0000118: Klärkessel @de
IAO_0000118: clarificador @es
IAO_0000118: clarificador de mel @pt
IAO_0000118: clarificateur @fr
IAO_0000118: decantador de mel @pt
IAO_0000118: depósito de mel @pt
IAO_0000118: honey ripener
IAO_0000118: honey tank
IAO_0000118: honing reservoir @nl
IAO_0000118: honingrijper @nl
IAO_0000118: honningbeholder @da
IAO_0000118: honungsbehallare @sv
IAO_0000118: klarebeholder @no
IAO_0000118: klarningskärl @sv
IAO_0000118: maturateur @fr
IAO_0000118: maturator @ro
IAO_0000118: maturatore @it
IAO_0000118: purificatore @it
IAO_0000118: tanc de sedimentare @ro
IAO_0000118: tanque de sedimentación @es
IAO_0000118: tanque de sedimentação de mel @pt
id: EUPH:2905

honey pump
type: Class
subclass of: honey processing equipment
subclass of: Restriction
  on property: involved in
  some values from: honey processing
IAO_0000115: A device that moves honey from an extractor to a storage or settling tank.
IAO_0000117: Michael Rubinigg
IAO_0000118: Honigpumpe @de
IAO_0000118: honey pump
id: EUPH:2906

mini loader
type: Class
subclass of: beekeeping vehicle
subclass of: Restriction
  on property: transports
  some values from: https://w3id.org/euph/8
subclass of: Restriction
  on property: has target end location
  some values from: trailer
subclass of: Restriction
  on property: has target end location
  some values from: commercial vehicle
IAO_0000115: A compact sized, articulated forklift used in migratory beekeeping to load beehives on a truck.
IAO_0000117: Michael Rubinigg
IAO_0000118: Hoflader @de
IAO_0000118: mini loader
id: EUPH:2907

hive handcart
type: Class
subclass of: beekeeping vehicle
subclass of: Restriction
  on property: transports
  some values from: https://w3id.org/euph/8
IAO_0000115: A small cart, pulled or pushed by hand, used to transport a beehive.
IAO_0000117: Michael Rubinigg
IAO_0000118: Imkerei-Transportkarre @de
IAO_0000118: hive handcart
id: EUPH:2908

beeswax processing equipment
type: Class
subclass of: hive product processing equipment
IAO_0000115: Any equipment used to melt and pour beeswax .
IAO_0000117: Michael Rubinigg
IAO_0000118: Wachsverarbeitungsgerät @de
IAO_0000118: wax processing equipment
id: EUPH:2909

beeswax foundation machine
type: Class
subclass of: beeswax processing equipment
subclass of: Restriction
  on property: involved in
  some values from: beeswax processing
IAO_0000115: A device used to produce beeswax foundation either manually or automatically.
IAO_0000117: Michael Rubinigg
IAO_0000118: Maschine zur Mittelwanderzeugung @de
IAO_0000118: beeswax foundation machine
id: EUPH:2910

beeswax extractor
type: Class
subclass of: https://w3id.org/euph/8251
subclass of: Restriction
  on property: has function
  some values from: electrically powered drive
subclass of: Restriction
  on property: has function
  some values from: gas powered drive
subclass of: Restriction
  on property: has function
  some values from: solar powered drive
subclass of: Restriction
  on property: involved in
  some values from: beeswax harvesting
IAO_0000115: A device used to melt pure beeswax, or beeswax from wax cappings or combs of honey bee colonies.
IAO_0000117: Michael Rubinigg
IAO_0000118: Wachsschmelzer @de
IAO_0000118: apparecchio per estrarre la cera @it
IAO_0000118: extracteur à cire @fr
IAO_0000118: extractor de ceară @ro
IAO_0000118: extractor de cera @es
IAO_0000118: sceratrice @it
IAO_0000118: separator @ro
IAO_0000118: vaxsmältare @sv
IAO_0000118: vokssmelteer @da
IAO_0000118: vokssmelter @no
IAO_0000118: wassmelter @nl
IAO_0000118: wax extractor
IAO_0000118: wax melter
id: EUPH:2911

wax capping
type: Class
subclass of: honey bee nest component
subclass of: Restriction
  on property: part of
  some values from: capped cell
subclass of: Restriction
  on property: produced by
  some values from: adult worker bee
IAO_0000115: Beeswax covering of honey-filled honey cells which are removed before extracting honey
IAO_0000117: Michael Rubinigg
IAO_0000118: Zelldeckel @de
IAO_0000118: cappings
IAO_0000118: cellelokk @no
IAO_0000118: cellelåg @da
IAO_0000118: cellock @sv
IAO_0000118: căpăcele @ro
IAO_0000118: forsegling @da
IAO_0000118: opercoli @it
IAO_0000118: opercules @fr
IAO_0000118: opérculos @es
IAO_0000118: skrellevoks @no
IAO_0000118: täckvax @sv
IAO_0000118: wasdeksels @nl
IAO_0000118: wax cappings
IAO_0000118: zegels @nl
id: EUPH:2912

Axiom
annotated source: wax capping
annotated property: IAO_0000115
annotated target: Beeswax covering of honey-filled honey cells which are removed before extracting honey
has db xref: ISBN:1-878075-65-4

power source
type: Class
subclass of: generically dependent continuant in engineering
IAO_0000115: The type of energy source for the operation of a device.
IAO_0000117: Michael Rubinigg
IAO_0000118: Energieversorgung @de
IAO_0000118: power source
id: EUPH:2913

manually powered drive
type: Class
subclass of: beekeeping equipment drive
IAO_0000115: The energy source used to operate a device is manual work.
IAO_0000117: Michael Rubinigg
IAO_0000118: hanbetrieben @de
IAO_0000118: manually powered
id: EUPH:2914

electrically powered drive
type: Class
subclass of: beekeeping equipment drive
IAO_0000115: The energy source used to operate a device is electric energy.
IAO_0000117: Michael Rubinigg
IAO_0000118: electrically powered
IAO_0000118: elektrisch betrieben @de
id: EUPH:2915

gas powered drive
type: Class
subclass of: beekeeping equipment drive
IAO_0000115: The energy source used to operate a device is natural gas.
IAO_0000117: Michael Rubinigg
IAO_0000118: gas powered
IAO_0000118: gasbetrieben @de
id: EUPH:2916

solar powered drive
type: Class
subclass of: beekeeping equipment drive
IAO_0000115: The energy source used to operate a device is solar radiation.
IAO_0000117: Michael Rubinigg
IAO_0000118: solar powered
IAO_0000118: solarbetrieben @de
id: EUPH:2917

steam generator
type: Class
subclass of: general beekeeping equipment
IAO_0000115: A device generating hot vapour from water using energy from electric current or gas.
IAO_0000117: Michael Rubinigg
IAO_0000118: Dampferzeugungsgerät @de
IAO_0000118: steam generator
id: EUPH:2918

beeswax spinner
type: Class
subclass of: https://w3id.org/euph/8251
subclass of: Restriction
  on property: involved in
  some values from: beeswax harvesting
IAO_0000115: A device that uses centrifugal force to separate liquids (e.g. honey) from solids (e.g. solid wax)
IAO_0000117: Michael Rubinigg
IAO_0000118: Wachsschleuder @de
IAO_0000118: spinner
id: EUPH:2919

frame wire
type: Class
subclass of: frame component
subclass of: Restriction
  on property: connected to
  some values from: frame
IAO_0000115: Wire stretched between opposing bars of frames, supposed to hold and stabilise beeswax foundation or combs.
IAO_0000117: Michael Rubinigg
IAO_0000118: Rähmchendraht @de
IAO_0000118: frame wire
id: EUPH:2920

frame wire crimper
type: Class
subclass of: https://w3id.org/euph/8160
subclass of: Restriction
  on property: involved in
  some values from: https://w3id.org/euph/8157
IAO_0000115: A tool for stretching frame wire, consisting of two counter-rotating gear wheels between which the wire is clamped and pulled through. The resulting deformation of the wire shortens its net length.
IAO_0000117: Michael Rubinigg
IAO_0000118: Drahtspanner @de
IAO_0000118: frame wire crimper
id: EUPH:2921

hive tool
type: Class
subclass of: hive management equipment
subclass of: Restriction
  on property: involved in
  some values from: colony management
IAO_0000115: A tool used to separate hive bodies and to lever frames.
IAO_0000117: Michael Rubinigg
IAO_0000118: Schaber @de
IAO_0000118: Stockmeissel @de
IAO_0000118: Wabenmeissel @de
IAO_0000118: alavanca de apicultor @pt
IAO_0000118: alavanca raspadeira de apicultor @pt
IAO_0000118: alzaprima @es
IAO_0000118: daltă apicolă @ro
IAO_0000118: espátula @pt
IAO_0000118: formão de apicultor @pt
IAO_0000118: hive tool
IAO_0000118: kubeskraper @no
IAO_0000118: kupjärn @sv
IAO_0000118: kupkniv @sv
IAO_0000118: leva stacca-favi @it
IAO_0000118: levantacuadros @es
IAO_0000118: lève-cadres @fr
IAO_0000118: raampjeslichter @nl
IAO_0000118: schraapbeitel @nl
IAO_0000118: schraapijzer @nl
IAO_0000118: stadekniv @da
id: EUPH:2922

smoker
type: Class
subclass of: hive management equipment
subclass of: Restriction
  on property: involved in
  some values from: smoking
IAO_0000115: A tool in which to ignite flammable material that subsequently emits smoke that can be used to calm honey bees during an inspection.
IAO_0000117: Michael Rubinigg
IAO_0000118: Rauchapparat @de
IAO_0000118: Raucher @de
IAO_0000118: affumicatore @it
IAO_0000118: afumător @ro
IAO_0000118: ahumador @es
IAO_0000118: beroker @nl
IAO_0000118: enfumoir @fr
IAO_0000118: fumigador @pt
IAO_0000118: rookapparaat @nl
IAO_0000118: rökpust @sv
IAO_0000118: røgpuster @da
IAO_0000118: røkpuster @no
IAO_0000118: røykpuster @no
IAO_0000118: smoker
id: EUPH:2923

wood
type: Class
subclass of: material quality
IAO_0000115: Made of wood.
IAO_0000117: Michael Rubinigg
IAO_0000118: Holz @de
IAO_0000118: wood
id: EUPH:2924

straw
type: Class
subclass of: material quality
subclass of: Restriction
  on property: quality of
  some values from: skep
IAO_0000115: Made of dry, hollow stalk of cereal plants (such as wheat, barley, or oats) that remains after the grain has been harvested, typically used as animal bedding, packaging material, or for thatching and weaving.
IAO_0000117: Michael Rubinigg
IAO_0000118: Stroh @de
IAO_0000118: straw
id: EUPH:2925

honey bee sire
type: Class
subclass of: breeder queen
subclass of: Restriction
  on property: role of
  some values from: mated queen
IAO_0000115: A honey bee sire is a breeder queen, commonly abbreviated to 4a, which in honey bee breeding programs refers to the queen from which the drones descend directly or through its daughters (referred to as drone producing queens) that mate with an unmated queen descending from a honey bee dam.
IAO_0000117: Michael Rubinigg
IAO_0000118: 4a @de
IAO_0000118: Anpaarung @de
IAO_0000118: Vatermutter @de
IAO_0000118: sire
id: EUPH:2926

uncapping knife
type: Class
subclass of: uncapping equipment
subclass of: Restriction
  on property: involved in
  some values from: uncapping
IAO_0000115: A heated knife-like tool used for manually removing wax cappings from honey frames.
IAO_0000117: Michael Rubinigg
IAO_0000118: Entdeckelungsmesser @de
IAO_0000118: avtäckningskniv @sv
IAO_0000118: coltello disopercolatore @it
IAO_0000118: couteau à désoperculer @fr
IAO_0000118: cuchillo de desopercular @es
IAO_0000118: cuțit de descăpăcit @ro
IAO_0000118: faca desoperculadora @pt
IAO_0000118: ontzegelmes @nl
IAO_0000118: skrellekniv @no
IAO_0000118: skrællekniv @da
IAO_0000118: uncapping knife
id: EUPH:2927

bee brush
type: Class
subclass of: hive management equipment
subclass of: Restriction
  on property: involved in
  some values from: colony management
IAO_0000115: A tool having soft natural or sythetic hairs or feathers to gently remove honey bees from combs or woodware.
IAO_0000117: Michael Rubinigg
IAO_0000118: Bienenbürste @de
IAO_0000118: bee brush
IAO_0000118: biborste @sv
IAO_0000118: bibørste @da
IAO_0000118: bijenborstel @nl
IAO_0000118: brosse à abeilles @fr
IAO_0000118: cepillo para abejas @es
IAO_0000118: escova apícola @pt
IAO_0000118: escova de apicultor @pt
IAO_0000118: perie pentru albine @ro
IAO_0000118: spazzola per api @it
id: EUPH:2928

frame grip
type: Class
subclass of: hive management equipment
subclass of: Restriction
  on property: involved in
  some values from: hive management
IAO_0000115: A pincer-like tool used to lift combs from a hive.
IAO_0000117: Michael Rubinigg
IAO_0000118: Wabenzieher @de
IAO_0000118: frame grip
id: EUPH:2929

spacing tool
type: Class
subclass of: hive management equipment
subclass of: Restriction
  on property: involved in
  some values from: hive management
IAO_0000115: A tool in the shape of a small rake that can be used to adjust the desired distances between combs.
IAO_0000117: Michael Rubinigg
IAO_0000118: Abstandsrechen @de
IAO_0000118: spacing tool
id: EUPH:2930

bottom board
type: Class
subclass of: https://w3id.org/euph/8163
subclass of: Restriction
  on property: part of
  some values from: https://w3id.org/euph/8
IAO_0000115: The bottom board serves as the floor of the hive. It contains an entrance and exit for the honey bees.
IAO_0000117: Michael Rubinigg
IAO_0000118: Bodenbrett @de
IAO_0000118: Standbrett @de
IAO_0000118: assoalho @pt
IAO_0000118: bodemplank @nl
IAO_0000118: bottenbräda @sv
IAO_0000118: bottom board
IAO_0000118: bund @da
IAO_0000118: bunnebrett @no
IAO_0000118: estrado @pt
IAO_0000118: floorboard
IAO_0000118: fondo @it
IAO_0000118: fondo dell'arnia @it
IAO_0000118: fund de stub @ro
IAO_0000118: plancher @fr
IAO_0000118: plateau @fr
IAO_0000118: stadebund @da
IAO_0000118: tablero fondo @es
IAO_0000118: tabuleiro @pt
id: EUPH:2931

entrance reducer
type: Class
subclass of: bottom board
subclass of: Restriction
  on property: part of
  some values from: https://w3id.org/euph/8
subclass of: Restriction
  on property: connected to
  some values from: https://w3id.org/euph/816
IAO_0000115: An entrance reducer is part of a beehive, connected to the hive entrance. It reduces the size of the hive entrance to prevent predators such as mice from entering the beehive and to reduce the risk of robbing by worker bees from other honey bee colonies.
IAO_0000117: Michael Rubinigg
IAO_0000118: Fluglochschieber @de
IAO_0000118: adjustable entrance
IAO_0000118: bloc de urdiniș @ro
IAO_0000118: entrada regulável @pt
IAO_0000118: entrance reducer
IAO_0000118: flusterförminskare @sv
IAO_0000118: guardapiquera @es
IAO_0000118: piquera regulable @es
IAO_0000118: porticina graduabile @it
IAO_0000118: reductor de entrada @es
IAO_0000118: reductor de urdiniș @ro
IAO_0000118: regulerbart flyhull @no
IAO_0000118: réducteur d'entrée @fr
IAO_0000118: skyder @da
IAO_0000118: vlieggatschuif @nl
id: EUPH:2932

veterinary medicinal product active substance
type: Class
subclass of: role in veterinary medicine
subclass of: Restriction
  on property: role of
  some values from: chemical entity
subclass of: Restriction
  on property: part of
  some values from: veterinary medicinal product (VMP)
IAO_0000115: A veterinary medicinal product active substance has been defined as any substance or mixture of substances intended to be used in the manufacture of a veterinary medicinal product that, when used in its production, becomes an active ingredient of that product.
IAO_0000117: Michael Rubinigg
IAO_0000118: TAM Wirkstoff @de
IAO_0000118: VMP active substance
IAO_0000118: Wirkstoff des Tierarzneimittels @de
IAO_0000118: veterinary medicinal product active substance
id: EUPH:2933

Axiom
annotated source: veterinary medicinal product active substance
annotated property: IAO_0000115
annotated target: A veterinary medicinal product active substance has been defined as any substance or mixture of substances intended to be used in the manufacture of a veterinary medicinal product that, when used in its production, becomes an active ingredient of that product.
source: https://eur-lex.europa.eu/eli/reg/2019/6/2022-01-28

veterinary medicinal product name
type: Class
subclass of: identifier of veterinary entities
subclass of: Restriction
  on property: quality of
  some values from: veterinary medicinal product (VMP)
IAO_0000115: A veterinary medicinal product name is the brand name of a veterinary medicinal product under which it is marketed in a given territory during a given period.
IAO_0000117: Michael Rubinigg
IAO_0000118: Name des Tierarzneimittels @de
IAO_0000118: TAM Name @de
IAO_0000118: VMP name
IAO_0000118: veterinary medicinal product name
id: EUPH:2934

veterinary medicinal product application
type: Class
subclass of: function in veterinary medicine
subclass of: Restriction
  on property: function of
  some values from: veterinary medicinal product (VMP)
IAO_0000115: A veterinary medicinal product application is the type of use intended for a veterinary medicinal product according to the package leaflet.
IAO_0000117: Michael Rubinigg
IAO_0000118: Anwendung des Tierarzneimittels @de
IAO_0000118: TAM Anwendung @de
IAO_0000118: VMP application
IAO_0000118: veterinary medicinal product application
id: EUPH:2935

oxalic acid vaporizer
type: Class
subclass of: honey bee disease control eqipment
subclass of: Restriction
  on property: capable of inhibiting or preventing pathological process
  some values from: varroosis of honey bees
IAO_0000115: A deviced used to vaporize certain veterinary medicinal products containing active substance oxalic acid dehydrate powder to control the parasite Varroa destructor.
IAO_0000117: Michael Rubinigg
IAO_0000118: Oxalsäureverdampfer @de
IAO_0000118: oxalic acid vaporizer
id: EUPH:2936

honey pail
type: Class
subclass of: honey processing equipment
subclass of: Restriction
  on property: involved in
  some values from: honey processing
IAO_0000115: A bucket made of food grade plastic used to store honey.
IAO_0000117: Michael Rubinigg
IAO_0000118: Honigeimer @de
IAO_0000118: honey pail
id: EUPH:2937

honey refractometer
type: Class
subclass of: honey processing equipment
subclass of: Restriction
  on property: involved in
  some values from: hive product quality management
IAO_0000115: A device for the measurement of an index of refraction, which is calculated from the observed refraction angle using Snell's law. For mixtures of specific substances, the index of refraction allows to determine the concentration using pre-defined mixing rules.
IAO_0000117: Michael Rubinigg
IAO_0000118: Honigrefraktometer @de
IAO_0000118: honey refractometer
id: EUPH:2938

honey bottling
type: Class
subclass of: honey processing
subclass of: Restriction
  on property: occurrent part of
  some values from: honey processing
IAO_0000115: Transferring honey from storage tanks into jars, which will eventually be marketed.
IAO_0000117: Michael Rubinigg
IAO_0000118: Honigabfüllung @de
IAO_0000118: honey bottling
id: EUPH:2939

grafting equipment
type: Class
subclass of: queen breeding and rearing equipment
IAO_0000115: A grafting equipment is any device used to transfer young female larvae of the honey bee from cells of brood frames to artificially produced queen cups with the intention of producing queens.
IAO_0000117: Michael Rubinigg
IAO_0000118: Umlarvwerkzeug @de
IAO_0000118: grafting equipment
id: EUPH:2940

brood frame
type: Class
subclass of: frame of drawn comb
subclass of: Restriction
  on property: surrounds
  some values from: https://w3id.org/euph/803
IAO_0000115: A frame of brood comb.
IAO_0000117: Michael Rubinigg
IAO_0000118: Brutrahmen @de
IAO_0000118: Bruträhmchen @de
IAO_0000118: broedraam @nl
IAO_0000118: brood frame
IAO_0000118: cadre à couvain @fr
IAO_0000118: cuadro de cría @es
IAO_0000118: cuadro de pollo @es
IAO_0000118: quadro de cria @pt
IAO_0000118: quadro de criação @pt
IAO_0000118: ramă cu puiet @ro
IAO_0000118: ramă de puiet @ro
IAO_0000118: yngelram @sv
IAO_0000118: yngelramme @da
IAO_0000118: yngeltavle @no
id: EUPH:2941

queen mailing cage
type: Class
subclass of: queen breeding and rearing equipment
subclass of: Restriction
  on property: involved in
  some values from: introducing
IAO_0000115: A small cage made of wood and/or plastic containing a small amount of candy sugar, which is used for shipping honey bee queens and usually a few companion worker bees.
IAO_0000117: Michael Rubinigg
IAO_0000118: Versandkäfig @de
IAO_0000118: cage d'expédition @fr
IAO_0000118: cuşcă de expediţie @ro
IAO_0000118: cuşcă de transport @ro
IAO_0000118: forsendelsesbur @da
IAO_0000118: försändningsbur @sv
IAO_0000118: gabbietta da spedizione @it
IAO_0000118: gaiola de expedição @pt
IAO_0000118: gaiola de transporte @pt
IAO_0000118: jaula de expedición @es
IAO_0000118: queen mailing cage
IAO_0000118: sendebur @no
IAO_0000118: transportbur @no
IAO_0000118: travelling cage
IAO_0000118: verzendkooitje @nl
id: EUPH:2942

queen marking pen
type: Class
subclass of: queen breeding and rearing equipment
IAO_0000115: A marker pen used to apply permanent coloured markings on a honey bee queen.
IAO_0000117: Michael Rubinigg
IAO_0000118: Königinnen-Zeichenstift @de
IAO_0000118: queen marking pen
id: EUPH:2943

queen marking number
type: Class
subclass of: queen breeding and rearing equipment
IAO_0000115: Coloured tags provided with a number or a matrix barcode, which are glued on the dorsal part of a honey bee thorax in order to easier find her and/or to uniquely identify her.
IAO_0000117: Michael Rubinigg
IAO_0000118: Königinnen-Zeichenplättchen @de
IAO_0000118: queen marking number
id: EUPH:2944

queen rearing frame
type: Class
subclass of: queen breeding and rearing equipment
IAO_0000115: A frame containing several queen cupulae with grafted female larvae, which is used to rear honey bee queens.
IAO_0000117: Michael Rubinigg
IAO_0000118: Zuchtrahmen @de
IAO_0000118: queen rearing frame
id: EUPH:2945

queen cell bar
type: Class
subclass of: queen breeding and rearing equipment component
IAO_0000115: A bar with queen cups attached to it, which is fixed in a breeding frame.
IAO_0000117: Michael Rubinigg
IAO_0000118: Zuchtlatte @de
IAO_0000118: queen cell bar
id: EUPH:2946

cup supports
type: Class
subclass of: queen breeding and rearing equipment component
subclass of: Restriction
  on property: connected to
  some values from: queen cell bar
IAO_0000115: An object firmly attached to a queen cell bar, which carries a cup holder.
IAO_0000117: Michael Rubinigg
IAO_0000118: Napfhalter @de
IAO_0000118: cup supports
id: EUPH:2947

cup holder
type: Class
subclass of: queen breeding and rearing equipment component
subclass of: Restriction
  on property: connected to
  some values from: cup supports
IAO_0000115: An object put on a cup support, which carries a queen cupula.
IAO_0000117: Michael Rubinigg
IAO_0000118: Sockelhalter @de
IAO_0000118: cup holder
id: EUPH:2948

queen cupula
type: Class
subclass of: queen breeding and rearing equipment component
subclass of: Restriction
  on property: connected to
  some values from: cup holder
IAO_0000115: An object produced or purchased by beekeepers, which is made of plastic or beeswax, has the shape of a queen cup, in which young female larvae are transferred in order to rear honey bee queens.
IAO_0000117: Michael Rubinigg
IAO_0000118: Weiselnäpfchen @de
IAO_0000118: botcă artificială @ro
IAO_0000118: cellkopp @sv
IAO_0000118: copa celda @es
IAO_0000118: cupolino @it
IAO_0000118: cupule @fr
IAO_0000118: cúpula @es
IAO_0000118: cúpula de célula real artificial @pt
IAO_0000118: fondino @it
IAO_0000118: konstgjord visecell @sv
IAO_0000118: kunstig cellekop @da
IAO_0000118: kunstig cellekopp @no
IAO_0000118: kunstmatig napje @nl
IAO_0000118: künstliche Weiselzelle @de
IAO_0000118: queen cupula
IAO_0000118: queen-cell cup
id: EUPH:2949

mating nuc
type: Class
subclass of: nucleus colony
IAO_0000115: A mating nuc is a nucleus colony produced for the sole purpose of mating of queens.
IAO_0000117: Michael Rubinigg
IAO_0000118: Begattungsableger @de
IAO_0000118: Begattungsvölkchen @de
IAO_0000118: bevruchtingsvolkje @nl
IAO_0000118: mating nuc
IAO_0000118: mating nucleus
IAO_0000118: miniatyrfolk @no
IAO_0000118: nucleo di fecondazione @it
IAO_0000118: nucleu de împerechere @ro
IAO_0000118: nucléus de fecondation @fr
IAO_0000118: núcleo de fecundación @es
IAO_0000118: núcleo de fecundação @pt
IAO_0000118: parefolk @no
IAO_0000118: parningssamhälle @sv
IAO_0000118: parrefolk @da
id: EUPH:2950

mating nuc box
type: Class
subclass of: nuc box
subclass of: Restriction
  on property: location of
  some values from: mating nuc
IAO_0000115: A mating nuc box is a small beehive housing a mating nuc.
IAO_0000117: Michael Rubinigg
IAO_0000118: mating nuc box
id: EUPH:2951

general beekeeping equipment
type: Class
subclass of: beekeeping equipment
IAO_0000115: General beekeeping equipment is any beekeeping equipment that cannot be associated to one specific process in beekeeping, such as hive management, hive product harvesting, hive product processing, queen breeding and rearing.
IAO_0000117: Michael Rubinigg
IAO_0000118: allgemeine Imkereigerätschaft @de
IAO_0000118: general beekeeping equipment
id: EUPH:2952

honey harvesting equipment
type: Class
subclass of: hive product harvesting equipment
subclass of: Restriction
  on property: involved in
  some values from: honey harvesting
IAO_0000115: Any equipment specifically used for honey harvest.
IAO_0000117: Michael Rubinigg
IAO_0000118: Honigerntegerät @de
IAO_0000118: honey harvesting equipment
id: EUPH:2953

pollen harvesting equipment
type: Class
subclass of: hive product harvesting equipment
subclass of: Restriction
  on property: involved in
  some values from: pollen harvesting
IAO_0000115: Any equipment specifically used for pollen harvest.
IAO_0000117: Michael Rubinigg
IAO_0000118: Pollenerntegerät @de
IAO_0000118: pollen harvesting equipment
id: EUPH:2954

general hive product processing equipment
type: Class
subclass of: hive product processing equipment
IAO_0000115: Any equipment that cannot be associated to the processing of one specific hive product such as mead production, pollen processing, honey processing, wax processing.
IAO_0000117: Michael Rubinigg
IAO_0000118: allgemeine Geräte für die Verarbeitung von Bienenprodukten @de
IAO_0000118: general hive product processing equipment
id: EUPH:2955

hive product harvesting equipment
type: Class
subclass of: beekeeping equipment
IAO_0000115: Hive product harvesting equipment is any beekeeping equipment used to harvest hive products.
IAO_0000117: Michael Rubinigg
IAO_0000118: Gerät für die Ernte von Bienenprodukten @de
IAO_0000118: hive product harvesting equipment
id: EUPH:2956

royal jelly harvesting equipment
type: Class
subclass of: hive product harvesting equipment
subclass of: Restriction
  on property: involved in
  some values from: royal jelly harvesting
IAO_0000115: Any equipment used specifically for the harvest of royal jelly.
IAO_0000117: Michael Rubinigg
IAO_0000118: Gerät zur Ernte von Gelée Royale @de
IAO_0000118: royal jelly harvesting equipment
id: EUPH:2957

propolis harvesting equipment
type: Class
subclass of: hive product harvesting equipment
subclass of: Restriction
  on property: involved in
  some values from: propolis harvesting
IAO_0000115: Any equipment used specifically for the harvest of propolis.
IAO_0000117: Michael Rubinigg
IAO_0000118: Propoliserntegerät @de
IAO_0000118: propolis harvesting equipment
id: EUPH:2958

pollen trap
type: Class
subclass of: pollen harvesting equipment
subclass of: Restriction
  on property: involved in
  some values from: pollen harvesting
IAO_0000115: A device mounted at the hive entrance, outside or inside the hive, which forces worker bees to pass through narrow holes, causing the loss of pollen pellets stored on the hind legs of worker bees foraging for pollen. The lost pollen pellets are stored in a tray and periodically collected by the beekeeper.
IAO_0000117: Michael Rubinigg
IAO_0000118: Pollenfalle @de
IAO_0000118: armadilha captapólen @pt
IAO_0000118: caçador de pólen @pt
IAO_0000118: colector de polen @ro
IAO_0000118: coletor de pólen @pt
IAO_0000118: pollen trap
IAO_0000118: pollenfelle @no
IAO_0000118: pollenfälla @sv
IAO_0000118: pollenfælde @da
IAO_0000118: stuifmeelval @nl
IAO_0000118: trampa de polen @es
IAO_0000118: trappe pollen @fr
IAO_0000118: trappola da polline @it
id: EUPH:2959

propolis trap
type: Class
subclass of: propolis harvesting equipment
IAO_0000115: An perforated object such as a sheet with a small mesh size made of food grade plastic, that is placed on top of the upper bar of the uppermost hive body, causing draft. The bees would close the holes of the object with a mixture of wax and propolis.
IAO_0000117: Michael Rubinigg
IAO_0000118: Propolisgitter @de
IAO_0000118: propolis trap
id: EUPH:2960

feral honey bee colony
type: Class
subclass of: honey bee colony
IAO_0000115: A feral honey bee colony.
IAO_0000117: Michael Rubinigg
IAO_0000118: colonia salvaje @es
IAO_0000118: colonie sauvage @fr
IAO_0000118: colonie sălbatică @ro
IAO_0000118: colónia selvagem @pt
IAO_0000118: colónia silvestre @pt
IAO_0000118: famiglia selvatica @it
IAO_0000118: feral colony
IAO_0000118: forvillet bifolk @no
IAO_0000118: vild familie @da
IAO_0000118: vildsvärm @sv
IAO_0000118: wild bijenvolk @nl
IAO_0000118: wild colony
IAO_0000118: wild lebendes Bienenvolk @de
id: EUPH:2966

Apis mellifera carnica
type: Class
subclass of: subspecies of Apis mellifera
IAO_0000115: The subspecies Apis mellifera carnica Pollmann occurring south of the Alps, and west into the Balkans.
IAO_0000117: Michael Rubinigg
IAO_0000118: Apis mellifera carnica @da
IAO_0000118: Carnica @de
IAO_0000118: Carnica bij @nl
IAO_0000118: Carniolan Honey Bee
IAO_0000118: Krainer Biene @de
IAO_0000118: Krainer bij @nl
IAO_0000118: abeille carniolienne @fr
IAO_0000118: abeja carniola @es
IAO_0000118: abelha carnica @pt
IAO_0000118: abelha carniola @pt
IAO_0000118: albină carnica @ro
IAO_0000118: ape carnica @it
IAO_0000118: carnica bi @sv
IAO_0000118: krainer bi @da
id: EUPH:2967

Apis mellifera mellifera
type: Class
subclass of: subspecies of Apis mellifera
IAO_0000115: The subspecies Apis mellifera mellifera Linnaeus, occurring throughout Central Europe morth of the Alps, as far as south as southern France in the west, southern Sweden in the north, central Russia in the east, and on the British Isles. In the Ukraine there is a transition over the steppe region to A. mellifera sossimai.
IAO_0000117: Michael Rubinigg
IAO_0000118: Ape nera @it
IAO_0000118: Apis mellifera mellifera
IAO_0000118: Dunkle Biene @de
IAO_0000118: European Honey Bee
IAO_0000118: European dark bee
id: EUPH:2968

entity in animal breeding
type: Class
subclass of: animal production
IAO_0000115: An entity in animal breeding is an entity in the animal production domain that has been defined as [...] the deliberate selection and directed mating of animals in a breeding population with the intention of producing offspring that, on average, are closer in their characteristics to a defined breeding objective than the parent generation.
IAO_0000117: Michael Rubinigg
IAO_0000118: Tierzucht @de
IAO_0000118: animal breeding
IAO_0000118: sélection des animaux domestiques @fr
IAO_0000118: élevage sélectif des animaux @fr
id: EUPH:2969

Axiom
annotated source: entity in animal breeding
annotated property: IAO_0000115
annotated target: An entity in animal breeding is an entity in the animal production domain that has been defined as [...] the deliberate selection and directed mating of animals in a breeding population with the intention of producing offspring that, on average, are closer in their characteristics to a defined breeding objective than the parent generation.
has db xref: ISBN:978-3-8252-4805-5
source: http://purl.obolibrary.org/obo/BFO_0000001

animal breed
type: Class
subclass of: object aggregate in animal breeding
IAO_0000115: [..] a breed is a group of domesticated animals of the same species that are similar in morphological, physiological and ethological characteristics, i.e. in appearance or exterior (lat. exterior; on the outside), performance and behaviour, and have a common breeding history.
IAO_0000117: Michael Rubinigg
IAO_0000118: Rasse @de
IAO_0000118: breed
IAO_0000118: race @da
IAO_0000118: ras @nl
IAO_0000118: rase @no
IAO_0000118: rasă @ro
IAO_0000118: raza @es
IAO_0000118: razza @it
IAO_0000118: raça @pt
id: EUPH:2970

Axiom
annotated source: animal breed
annotated property: IAO_0000115
annotated target: [..] a breed is a group of domesticated animals of the same species that are similar in morphological, physiological and ethological characteristics, i.e. in appearance or exterior (lat. exterior; on the outside), performance and behaviour, and have a common breeding history.
has db xref: ISBN:978-3-8252-4805-5

Carnica
type: Class
subclass of: honey bee breed
subclass of: Restriction
  on property: artificially selected from
  some values from: Apis mellifera carnica
IAO_0000115: Carnica is a honey bee breed originating from the subspecies Apis mellifera carnica.
IAO_0000117: Michael Rubinigg
IAO_0000118: Carnica @de
IAO_0000118: Carnica bij @nl
IAO_0000118: Carniolan
IAO_0000118: Carniolan honey bee
IAO_0000118: Krainer Biene @de
IAO_0000118: Krainer bij @nl
IAO_0000118: abeille carniolienne @fr
IAO_0000118: abeja carniola @es
IAO_0000118: abelha carnica @pt
IAO_0000118: abelha carniola @pt
IAO_0000118: albină carnica @ro
IAO_0000118: ape carnica @it
IAO_0000118: carnica bi @sv
IAO_0000118: krainer bi @da
id: EUPH:2971

Axiom
annotated source: Carnica
annotated property: IAO_0000115
annotated target: Carnica is a honey bee breed originating from the subspecies Apis mellifera carnica.
source: https://www.bienenzucht.info/
source: https://www2.hu-berlin.de/beebreed/ZWS/

Mellifera
type: Class
subclass of: honey bee breed
subclass of: Restriction
  on property: artificially selected from
  some values from: Apis mellifera mellifera
IAO_0000115: Mellifera is a honey bee breed originating from the subspecies Apis mellifera mellifera.
IAO_0000117: Michael Rubinigg
IAO_0000118: Dark Bee
IAO_0000118: Dunkle Biene @de
IAO_0000118: Mellifera
id: EUPH:2972

Axiom
annotated source: Mellifera
annotated property: IAO_0000115
annotated target: Mellifera is a honey bee breed originating from the subspecies Apis mellifera mellifera.
source: https://www.bienenzucht.info/
source: https://www.sicamm.org
source: https://www2.hu-berlin.de/beebreed/ZWS/

breeding population
type: Class
subclass of: object aggregate in animal breeding
subclass of: Restriction
  on property: part of
  some values from: animal breed
IAO_0000115: A breeding population is equal to or a part of an animal breed and is defined as [...] a group of animals of the same species that forms a mating community and represents a common gene pool.
IAO_0000117: Michael Rubinigg
IAO_0000118: Zuchtpopulation @de
IAO_0000118: breeding population
IAO_0000118: población de selección @es
id: EUPH:2973

Axiom
annotated source: breeding population
annotated property: IAO_0000115
annotated target: A breeding population is equal to or a part of an animal breed and is defined as [...] a group of animals of the same species that forms a mating community and represents a common gene pool.
has db xref: ISBN:978-3-8252-4805-5

plant protection product
type: Class
subclass of: pesticide
IAO_0000115: [...] Products, in the form in which they are supplied to the user, consisting of or containing active substances, safeners or synergists, and intended for one of the following uses: (a) protecting plants or plant products against all harmful organisms or preventing the action of such organisms, unless the main purpose of these products is considered to be for reasons of hygiene rather than for the protection of plants or plant products; (b) influencing the life processes of plants, such as substances influencing their growth, other than as a nutrient; (c) preserving plant products, in so far as such substances or products are not subject to special Community provisions on preservatives; (d) destroying undesired plants or parts of plants, except algae unless the products are applied on soil or water to protect plants; (e) checking or preventing undesired growth of plants, except algae unless the products are applied on soil or water to protect plants. These products are referred to as ‘plant protection products’.
IAO_0000117: Michael Rubinigg
IAO_0000118: Pflanzenschutzmittel @de
IAO_0000118: plant protection product
id: EUPH:2974

Axiom
annotated source: plant protection product
annotated property: IAO_0000115
annotated target: [...] Products, in the form in which they are supplied to the user, consisting of or containing active substances, safeners or synergists, and intended for one of the following uses: (a) protecting plants or plant products against all harmful organisms or preventing the action of such organisms, unless the main purpose of these products is considered to be for reasons of hygiene rather than for the protection of plants or plant products; (b) influencing the life processes of plants, such as substances influencing their growth, other than as a nutrient; (c) preserving plant products, in so far as such substances or products are not subject to special Community provisions on preservatives; (d) destroying undesired plants or parts of plants, except algae unless the products are applied on soil or water to protect plants; (e) checking or preventing undesired growth of plants, except algae unless the products are applied on soil or water to protect plants. These products are referred to as ‘plant protection products’.
source: https://eur-lex.europa.eu/eli/reg/2009/1107/oj

spring
type: Class
subclass of: season
IAO_0000115: period between the vernal equinox and the summer solstice
IAO_0000117: Michael Rubinigg
IAO_0000118: Frühjahr @de
IAO_0000118: Frühling @de
IAO_0000118: lente @nl
IAO_0000118: primavera @it
IAO_0000118: printemps @fr
IAO_0000118: spring
IAO_0000118: voorjaar @nl
id: EUPH:2976

summer
type: Class
subclass of: season
IAO_0000115: period between the summer solstice and the autumnal equinox
IAO_0000117: Michael Rubinigg
IAO_0000118: Sommer @de
IAO_0000118: estate @it
IAO_0000118: summer
IAO_0000118: zomer @nl
IAO_0000118: été @fr
id: EUPH:2977

fall
type: Class
subclass of: season
IAO_0000115: period between the autumnal equinox and the winter solstice
IAO_0000117: Michael Rubinigg
IAO_0000118: Herbst @de
IAO_0000118: automne @fr
IAO_0000118: autumn
IAO_0000118: autunno @it
IAO_0000118: fall
IAO_0000118: herfst @nl
id: EUPH:2978

winter
type: Class
subclass of: season
IAO_0000115: period between the winter solstice and the vernal equinox
IAO_0000117: Michael Rubinigg
IAO_0000118: Winter @de
IAO_0000118: hiver @fr
IAO_0000118: inverno @it
IAO_0000118: winter
id: EUPH:2979

entity in biology
type: Class
subclass of: biological sciences
IAO_0000115: An entity in biology is an entity in the biological sciences domain that contains all classes related to aspects of pollinators and pollination studied in biology, i.e. the scientific study of living organisms.
IAO_0000117: Michael Rubinigg
IAO_0000118: Biologie @de
IAO_0000118: biologia @it
IAO_0000118: biologie @fr
IAO_0000118: biology
id: EUPH:2980

Axiom
annotated source: entity in biology
annotated property: IAO_0000115
annotated target: An entity in biology is an entity in the biological sciences domain that contains all classes related to aspects of pollinators and pollination studied in biology, i.e. the scientific study of living organisms.
source: http://purl.obolibrary.org/obo/BFO_0000001
source: https://ncit.nci.nih.gov/ncitbrowser/pages/home.jsf

sealed
type: Class
subclass of: quality of combs
subclass of: Restriction
  on property: quality of
  some values from: capped cell
IAO_0000115: A condition related to the isolation of the distal part of one or more cells of a comb from its surroundings by a cap of beeswax, which is applied when the cap completely covers each cell.
IAO_0000117: Michael Rubinigg
IAO_0000118: capped
IAO_0000118: căpăcit @ro
IAO_0000118: dekket @no
IAO_0000118: forseglet @da
IAO_0000118: gedekseld @nl
IAO_0000118: geschlossen @de
IAO_0000118: gesloten @nl
IAO_0000118: opercolato @it
IAO_0000118: operculado @es
IAO_0000118: operculé @fr
IAO_0000118: sealed
IAO_0000118: selado @pt
IAO_0000118: täckt @sv
IAO_0000118: verdeckelt @de
IAO_0000118: versegeld @nl
id: EUPH:2981

information content entity in biology
type: Class
subclass of: generically dependent continuant in biology
IAO_0000115: An information content entity in biology is a generically dependent continuant im the biology domain that is about some thing.
IAO_0000117: Michael Rubinigg
IAO_0000118: information content entity in biology
id: EUPH:2982

Axiom
annotated source: information content entity in biology
annotated property: IAO_0000115
annotated target: An information content entity in biology is a generically dependent continuant im the biology domain that is about some thing.
source: http://purl.obolibrary.org/obo/IAO_0000030

member of honey bee colony
type: Class
subclass of: fiat object part in beekeeping
subclass of: Restriction
  on property: part of
  some values from: honey bee colony
IAO_0000115: A member of a honey bee colony is an individual honey bee or a group of honey bees, also referred to as a caste, that live together in the colony.
IAO_0000117: Michael Rubinigg
IAO_0000118: Mitglied eines Honigbienenvolkes @de
IAO_0000118: member of honey bee colony
id: EUPH:2983

mutualism
type: Class
subclass of: ecological function
subclass of: Restriction
  on property: function of
  some values from: organism
IAO_0000115: Mutualism is an interaction between two or more species in which each species has a benefit.
IAO_0000117: Michael Rubinigg
IAO_0000118: mutualism
id: EUPH:2984

pollination
type: Class
subclass of: reproductive process
IAO_0000115: Pollination is the cascade of biological processes starting when pollen leaves the site of pollen production and continuing up to, but not including fertilisation, i.e. the fusion of sperm and egg. In this process, biotic agents such as insects, birds and mammals, or abiotic agents such as water or wind, or no agent in the case of self-pollination, may be involved.
IAO_0000117: Michael Rubinigg
IAO_0000118: Bestäubung @de
IAO_0000118: bestuiving @nl
IAO_0000118: bestøvning @da
IAO_0000118: impollinazione @it
IAO_0000118: polenizare @ro
IAO_0000118: polinización @es
IAO_0000118: polinização @pt
IAO_0000118: pollination
IAO_0000118: pollinering @da
IAO_0000118: pollinisation @fr
IAO_0000118: pollinization
IAO_0000118: επικονίαση @el
id: EUPH:2985

Buckfast
type: Class
subclass of: honey bee breed
subclass of: Restriction
  on property: artificially selected from
  some values from: https://www.gbif.org/species/1341976
IAO_0000115: Buckfast is a honey bee breed originating from various subspecies of Apis mellifera.
IAO_0000117: Michael Rubinigg
IAO_0000118: Buckfast
id: EUPH:2986

Axiom
annotated source: Buckfast
annotated property: IAO_0000115
annotated target: Buckfast is a honey bee breed originating from various subspecies of Apis mellifera.
source: https://www2.hu-berlin.de/beebreed/ZWS/

beekeeper
type: Class
subclass of: object in beekeeping
subclass of: Restriction
  on property: subject participant in
  some values from: apicultural production process
subclass of: Restriction
  on property: subject participant in
  some values from: colony management
subclass of: Restriction
  on property: subject participant in
  some values from: https://w3id.org/euph/7927
subclass of: Restriction
  on property: subject participant in
  some values from: https://w3id.org/euph/8156
subclass of: Restriction
  on property: subject participant in
  some values from: https://w3id.org/euph/839
subclass of: Restriction
  on property: biotically interacts with
  some values from: https://www.gbif.org/species/1341976
subclass of: Restriction
  on property: biotically interacts with
  some values from: https://www.gbif.org/species/1341979
IAO_0000115: A beekeeper is a person managing honey bee colonies.
IAO_0000117: Michael Rubinigg
IAO_0000118: Bienenhalter @de
IAO_0000118: Bienenhalterin @de
IAO_0000118: Bienenzüchter @de
IAO_0000118: Bienenzüchterin @de
IAO_0000118: Imker @de
IAO_0000118: Imkerin @de
IAO_0000118: abejero @es
IAO_0000118: apiarist
IAO_0000118: apicoltore @it
IAO_0000118: apiculteur @fr
IAO_0000118: apicultor @es
IAO_0000118: beekeeper
IAO_0000118: beeman
IAO_0000118: biavler @da
IAO_0000118: bijenhouder @nl
IAO_0000118: biodlare @sv
IAO_0000118: birøkter @no
IAO_0000118: comenero @es
IAO_0000118: crescător de albine @ro
IAO_0000118: imker @nl
IAO_0000118: stupar @ro
id: EUPH:2987

great
type: Class
subclass of: https://w3id.org/euph/8149
IAO_0000115: of much more than ordinary size, extent, volume, etc.
IAO_0000117: Michael Rubinigg
IAO_0000118: great
IAO_0000118: groß @de
id: EUPH:2988

Axiom
annotated source: great
annotated property: IAO_0000115
annotated target: of much more than ordinary size, extent, volume, etc.
has db xref: ISBN:0-13-947169-3

little
type: Class
subclass of: https://w3id.org/euph/8149
IAO_0000115: small in size; not big, large, or great
IAO_0000117: Michael Rubinigg
IAO_0000118: gering @de
IAO_0000118: little
id: EUPH:2989

Axiom
annotated source: little
annotated property: IAO_0000115
annotated target: small in size; not big, large, or great
has db xref: ISBN:0-13-947169-3

modest
type: Class
subclass of: https://w3id.org/euph/8149
IAO_0000115: Moderate or reasonable, not extreme
IAO_0000117: Michael Rubinigg
IAO_0000118: modest
IAO_0000118: mäßig @de
id: EUPH:2990

Axiom
annotated source: modest
annotated property: IAO_0000115
annotated target: Moderate or reasonable, not extreme
has db xref: ISBN:0-13-947169-3

essential
type: Class
subclass of: qualitative attribute
IAO_0000115: of or constituting the intrinsic, fundamental nature of something
IAO_0000117: Michael Rubinigg
IAO_0000118: essential
IAO_0000118: essenziell @de
id: EUPH:2991

no increase
type: Class
subclass of: https://w3id.org/euph/8149
IAO_0000115: A parameter not becoming greater in size, amount, degree, etc.
IAO_0000117: Michael Rubinigg
IAO_0000118: keine Zunahme @de
IAO_0000118: no increase
id: EUPH:2992

increase
type: Class
subclass of: https://w3id.org/euph/8149
IAO_0000115: A parameter becoming greater in size, amount, degree, etc.
IAO_0000117: Michael Rubinigg
IAO_0000118: Zunahme @de
IAO_0000118: increase
id: EUPH:2993

unknown
type: Class
subclass of: general qualifier
IAO_0000115: not known; specif., a) not in the knowledge, understanding, or acquaintance of someone; unfamiliar (to) b) not discovered, identified, determined, explored, etc.
IAO_0000117: Michael Rubinigg
IAO_0000118: unbekannt @de
IAO_0000118: unknown
id: EUPH:2994

selection index
type: Class
subclass of: statistic in animal breeding
subclass of: Restriction
  on property: generically depends on
  some values from: https://w3id.org/euph/7868
IAO_0000115: The selection index of an animal is a statistic in animal breeding that provides an estimate of the aggregate breeding value for multiple traits, weighted according to their relative (usually economic) contribution to the overall breeding goal.
IAO_0000117: Michael Rubinigg
IAO_0000118: Selektions-Index @de
IAO_0000118: geschätzter Gesamtzuchtwert @de
IAO_0000118: indice aggregato @it
IAO_0000118: selection index
id: EUPH:2995

Axiom
annotated source: selection index
annotated property: IAO_0000115
annotated target: The selection index of an animal is a statistic in animal breeding that provides an estimate of the aggregate breeding value for multiple traits, weighted according to their relative (usually economic) contribution to the overall breeding goal.
has db xref: ISBN:0-632-03126-3
has db xref: ISBN:978-3-8252-4805-5

index selection
type: Class
subclass of: https://w3id.org/euph/812
IAO_0000115: Index selection is a selection method for multiple objective selection in which multiple traits are combined according to a specific weighting to form an index value that is decisive for selection.
IAO_0000117: Michael Rubinigg
IAO_0000118: Indexselektion @de
IAO_0000118: index selection
id: EUPH:2996

Axiom
annotated source: index selection
annotated property: IAO_0000115
annotated target: Index selection is a selection method for multiple objective selection in which multiple traits are combined according to a specific weighting to form an index value that is decisive for selection.
has db xref: ISBN:0-632-03126-3
has db xref: ISBN:978-3-8252-4805-5

coefficient of inbreeding
type: Class
subclass of: statistic in animal breeding
subclass of: Restriction
  on property: generically depends on
  some values from: https://w3id.org/euph/7868
IAO_0000115: The coefficient of inbreeding is a measure of the degree of homozygosity in an individual and corresponds to the probability that both alleles at a randomly selected gene locus are of the same origin.
IAO_0000117: Michael Rubinigg
IAO_0000118: Inzuchtkoeffizient @de
IAO_0000118: coefficient of inbreeding
id: EUPH:2997

Axiom
annotated source: coefficient of inbreeding
annotated property: IAO_0000115
annotated target: The coefficient of inbreeding is a measure of the degree of homozygosity in an individual and corresponds to the probability that both alleles at a randomly selected gene locus are of the same origin.
has db xref: ISBN:0-632-03126-3
has db xref: ISBN:978-3-8252-4805-5

breeding value
type: Class
subclass of: disposition in animal breeding
subclass of: Restriction
  on property: disposition of
  some values from: https://w3id.org/euph/7868
IAO_0000115: The breeding value of an animal is that part of its genotypic value (i.e., the sum of all allele effects at all gene loci) that is based on additive allele effects and can be passed on to offspring.
IAO_0000117: Michael Rubinigg
IAO_0000118: Zuchtwert @de
IAO_0000118: breeding value
IAO_0000118: valore genetico @it
id: EUPH:2999

Axiom
annotated source: breeding value
annotated property: IAO_0000115
annotated target: The breeding value of an animal is that part of its genotypic value (i.e., the sum of all allele effects at all gene loci) that is based on additive allele effects and can be passed on to offspring.
has db xref: ISBN:978-3-8252-4805-5

drone bee
type: Class
subclass of: member of honey bee colony
subclass of: Restriction
  on property: has role
  some values from: caste
IAO_0000115: A drone bee is a member of honey bee colony that is male honey bee and serves only in reproductive capacity, has no sting, and does not work.
IAO_0000117: Michael Rubinigg
IAO_0000118: Drohn @de
IAO_0000118: abejón @es
IAO_0000118: bourdon @fr
IAO_0000118: dar @nl
IAO_0000118: drone @da
IAO_0000118: drönare @sv
IAO_0000118: faux-bourdon @fr
IAO_0000118: fuco @it
IAO_0000118: macho @es
IAO_0000118: maschio @it
IAO_0000118: mâle @fr
IAO_0000118: trîntor @ro
IAO_0000118: zangão @pt
IAO_0000118: zángano @es
IAO_0000118: zângão @pt
id: EUPH:30

aggregate breeding value
type: Class
subclass of: disposition in animal breeding
subclass of: Restriction
  on property: disposition of
  some values from: https://w3id.org/euph/7868
IAO_0000115: The aggregate breeding value of an animal is the true breeding value for all traits of interest.
IAO_0000117: Michael Rubinigg
IAO_0000118: Gesamtzuchtwert @de
IAO_0000118: VEG @fr
IAO_0000118: VGT @it
IAO_0000118: aggregate breeding value
IAO_0000118: totaalfokwaarde @nl
IAO_0000118: totaalindex @nl
IAO_0000118: valeur d'élevage globale @fr
IAO_0000118: valeur génétique globale @fr
IAO_0000118: valor genético total @es
IAO_0000118: valore genetico totale @it
id: EUPH:3000

Axiom
annotated source: aggregate breeding value
annotated property: IAO_0000115
annotated target: The aggregate breeding value of an animal is the true breeding value for all traits of interest.
has db xref: ISBN:978-3-8252-4805-5

parent
type: Class
subclass of: role in animal breeding
subclass of: Restriction
  on property: role of
  some values from: https://w3id.org/euph/7868
IAO_0000115: A parent is the progenitor of an offspring.
IAO_0000117: Michael Rubinigg
IAO_0000118: Eltern @de
IAO_0000118: Elternteil @de
IAO_0000118: parent
IAO_0000118: parents
id: EUPH:3001

additive genetic correlation
type: Class
subclass of: https://w3id.org/euph/8236
subclass of: Restriction
  on property: part of
  some values from: genetic correlation
IAO_0000115: An additive genetic correlation is a component of a genetic correlation that considers only additive genetic effects and neglects non-additive genetic effects such as dominance and epistasis.
IAO_0000117: Michael Rubinigg
IAO_0000118: additiv genetische Korrelation @de
IAO_0000118: additive genetic correlation
id: EUPH:3002

Axiom
annotated source: additive genetic correlation
annotated property: IAO_0000115
annotated target: An additive genetic correlation is a component of a genetic correlation that considers only additive genetic effects and neglects non-additive genetic effects such as dominance and epistasis.
has db xref: ISBN:978-3-8252-4805-5

genetic variance
type: Class
subclass of: https://w3id.org/euph/8236
subclass of: Restriction
  on property: part of
  some values from: phenotypic variance
IAO_0000115: Genetic variance is a component of the phenotypic variance and is a measure for the genetic variation of a trait in a population.
IAO_0000117: Michael Rubinigg
IAO_0000118: genetic variance
IAO_0000118: genetische Varianz @de
id: EUPH:3003

Axiom
annotated source: genetic variance
annotated property: IAO_0000115
annotated target: Genetic variance is a component of the phenotypic variance and is a measure for the genetic variation of a trait in a population.
has db xref: ISBN:0-632-03126-3
has db xref: ISBN:978-3-8252-4805-5

honey bee dam
type: Class
subclass of: breeder queen
subclass of: Restriction
  on property: role of
  some values from: mated queen
IAO_0000115: A honey bee dam is a breeder queen, commonly abbreviated to 2a, which in honey bee breeding programs refers to the queen from which the unmated queens descend that are mated with drones descending from a honey bee sire.
IAO_0000117: Michael Rubinigg
IAO_0000118: 2a @de
IAO_0000118: Mutter @de
IAO_0000118: Zuchtmutter @de
IAO_0000118: dam
id: EUPH:3004

phenotypic variance
type: Class
subclass of: https://w3id.org/euph/8236
IAO_0000115: Phenotypic variance is the variance of a phenotypic trait within a population.
IAO_0000117: Michael Rubinigg
IAO_0000118: phenotypic variance
IAO_0000118: phänotypische Varianz @de
id: EUPH:3005

Axiom
annotated source: phenotypic variance
annotated property: IAO_0000115
annotated target: Phenotypic variance is the variance of a phenotypic trait within a population.
has db xref: ISBN:0-632-03126-3
has db xref: ISBN:978-3-8252-4805-5

additive genetic variance
type: Class
subclass of: https://w3id.org/euph/8236
subclass of: Restriction
  on property: part of
  some values from: genetic variance
IAO_0000115: Additive genetic variance is a component of the genetic variance that considers only additive genetic effects and neglects non-additive genetic effects such as dominance and epistasis.
IAO_0000117: Michael Rubinigg
IAO_0000118: additiv genetische Varianz @de
IAO_0000118: additive genetic variance
id: EUPH:3006

Axiom
annotated source: additive genetic variance
annotated property: IAO_0000115
annotated target: Additive genetic variance is a component of the genetic variance that considers only additive genetic effects and neglects non-additive genetic effects such as dominance and epistasis.
has db xref: ISBN:0-632-03126-3
has db xref: ISBN:978-3-8252-4805-5

phenotypic correlation
type: Class
subclass of: https://w3id.org/euph/8236
IAO_0000115: A phenotypic correlation is a correlation between phenotypic traits of individuals in a population.
IAO_0000117: Michael Rubinigg
IAO_0000118: phenotypic correlation
IAO_0000118: phänotypische Korrelation @de
id: EUPH:3007

Axiom
annotated source: phenotypic correlation
annotated property: IAO_0000115
annotated target: A phenotypic correlation is a correlation between phenotypic traits of individuals in a population.
has db xref: ISBN:0-632-03126-3
has db xref: ISBN:978-3-8252-4805-5

genetic correlation
type: Class
subclass of: https://w3id.org/euph/8236
subclass of: Restriction
  on property: part of
  some values from: phenotypic correlation
IAO_0000115: A genetic correlation is a component of a phenotypic correlation and describes the genetic relationship between traits in a population.
IAO_0000117: Michael Rubinigg
IAO_0000118: genetic correlation
IAO_0000118: genetische Korrelation @de
id: EUPH:3008

Axiom
annotated source: genetic correlation
annotated property: IAO_0000115
annotated target: A genetic correlation is a component of a phenotypic correlation and describes the genetic relationship between traits in a population.
has db xref: ISBN:0-632-03126-3
has db xref: ISBN:978-3-8252-4805-5

fungicides and bactericides [PES_F]
type: Class
subclass of: harmonised classification of substances major groups
IAO_0000115: The major group 'fungicides and bactericides' (harmonised classification of substances code PES_F or Euro SDMX registry code F) of the harmonised classification of substances in annex III of Regulation (EU) 2017/269 concerning statistics on pesticides in the EU.
IAO_0000117: Michael Rubinigg
IAO_0000118: Fungizide und Bakterizide @de
IAO_0000118: fungicidas y bactericidas @es
IAO_0000118: fungicides and bactericides
IAO_0000118: Фунгициди и бактерициди @bg
id: EUPH:3009
denoted by: //app.pollinatorhub.eu/vocabulary/classes/8244) F) of the harmonised classification of substances in annex III of Regulation (EU) 2017/269 concerning statistics on pesticides in the EU.

Axiom
annotated source: fungicides and bactericides [PES_F]
annotated property: IAO_0000115
annotated target: The major group 'fungicides and bactericides' (harmonised classification of substances code PES_F or Euro SDMX registry code F) of the harmonised classification of substances in annex III of Regulation (EU) 2017/269 concerning statistics on pesticides in the EU.
source: https://eur-lex.europa.eu/eli/reg/2017/269/oj

Axiom
annotated source: fungicides and bactericides [PES_F]
annotated property: denoted by
annotated target: //app.pollinatorhub.eu/vocabulary/classes/8244) F) of the harmonised classification of substances in annex III of Regulation (EU) 2017/269 concerning statistics on pesticides in the EU.
has db xref: harmonised classification of substances code

inorganic fungicides [F01]
type: Class
subclass of: harmonised classification of substances categories of products
subclass of: Restriction
  on property: member of
  some values from: fungicides and bactericides [PES_F]
IAO_0000115: The category of products 'inorganic fungicides' (harmonised classification of substances code F01), a member of the major group 'fungicides and bactericides' in the harmonised classification of substances of annex III of Regulation (EU) 2017/269 concerning statistics on pesticides in the EU.
IAO_0000117: Michael Rubinigg
IAO_0000118: anorganische Fungizide @de
IAO_0000118: inorganic fungicides
id: EUPH:3010
denoted by: //app.pollinatorhub.eu/vocabulary/classes/8165) the major group 'fungicides and bactericides' in the harmonised classification of substances of annex III of Regulation (EU) 2017/269 concerning statistics on pesticides in the EU.

Axiom
annotated source: inorganic fungicides [F01]
annotated property: IAO_0000115
annotated target: The category of products 'inorganic fungicides' (harmonised classification of substances code F01), a member of the major group 'fungicides and bactericides' in the harmonised classification of substances of annex III of Regulation (EU) 2017/269 concerning statistics on pesticides in the EU.
source: https://eur-lex.europa.eu/eli/reg/2017/269/oj

Axiom
annotated source: inorganic fungicides [F01]
annotated property: denoted by
annotated target: //app.pollinatorhub.eu/vocabulary/classes/8165) the major group 'fungicides and bactericides' in the harmonised classification of substances of annex III of Regulation (EU) 2017/269 concerning statistics on pesticides in the EU.
has db xref: harmonised classification of substances code

copper compounds [F01_01]
type: Class
subclass of: harmonised classification of substances chemical class
subclass of: Restriction
  on property: member of
  some values from: inorganic fungicides [F01]
IAO_0000115: The chemical class 'copper compounds' (harmonised classification of substances code F01_01), a member of the category of products 'inorganic fungicides' in the harmonised classification of substances of annex III of Regulation (EU) 2017/269 concerning statistics on pesticides in the EU.
IAO_0000117: Michael Rubinigg
IAO_0000118: Kupferverbindungen @de
IAO_0000118: copper compounds
id: EUPH:3011
denoted by: //app.pollinatorhub.eu/vocabulary/classes/8165) the category of products 'inorganic fungicides' in the harmonised classification of substances of annex III of Regulation (EU) 2017/269 concerning statistics on pesticides in the EU.

Axiom
annotated source: copper compounds [F01_01]
annotated property: IAO_0000115
annotated target: The chemical class 'copper compounds' (harmonised classification of substances code F01_01), a member of the category of products 'inorganic fungicides' in the harmonised classification of substances of annex III of Regulation (EU) 2017/269 concerning statistics on pesticides in the EU.
source: https://eur-lex.europa.eu/eli/reg/2017/269/oj

Axiom
annotated source: copper compounds [F01_01]
annotated property: denoted by
annotated target: //app.pollinatorhub.eu/vocabulary/classes/8165) the category of products 'inorganic fungicides' in the harmonised classification of substances of annex III of Regulation (EU) 2017/269 concerning statistics on pesticides in the EU.
has db xref: harmonised classification of substances code

inorganic sulfur [F01_02]
type: Class
subclass of: harmonised classification of substances chemical class
subclass of: Restriction
  on property: member of
  some values from: inorganic fungicides [F01]
IAO_0000115: The chemical class 'inorganic sulfur' (harmonised classification of substances code F01_02), a member of the category of products 'inorganic fungicides' in the harmonised classification of substances of annex III of Regulation (EU) 2017/269 concerning statistics on pesticides in the EU.
IAO_0000117: Michael Rubinigg
IAO_0000118: anorganischer Schwefel @de
IAO_0000118: inorganic sulfur
id: EUPH:3012
denoted by: //app.pollinatorhub.eu/vocabulary/classes/8165) the category of products 'inorganic fungicides' in the harmonised classification of substances of annex III of Regulation (EU) 2017/269 concerning statistics on pesticides in the EU.

Axiom
annotated source: inorganic sulfur [F01_02]
annotated property: IAO_0000115
annotated target: The chemical class 'inorganic sulfur' (harmonised classification of substances code F01_02), a member of the category of products 'inorganic fungicides' in the harmonised classification of substances of annex III of Regulation (EU) 2017/269 concerning statistics on pesticides in the EU.
source: https://eur-lex.europa.eu/eli/reg/2017/269/oj

Axiom
annotated source: inorganic sulfur [F01_02]
annotated property: denoted by
annotated target: //app.pollinatorhub.eu/vocabulary/classes/8165) the category of products 'inorganic fungicides' in the harmonised classification of substances of annex III of Regulation (EU) 2017/269 concerning statistics on pesticides in the EU.
has db xref: harmonised classification of substances code

other inorganic fungicides [F01_99]
type: Class
subclass of: harmonised classification of substances chemical class
subclass of: Restriction
  on property: member of
  some values from: inorganic fungicides [F01]
IAO_0000115: The chemical class 'other inorganic fungicides' (harmonised classification of substances code F01_99), a member of the category of products 'inorganic fungicides' in the harmonised classification of substances of annex III of Regulation (EU) 2017/269 concerning statistics on pesticides in the EU.
IAO_0000117: Michael Rubinigg
IAO_0000118: other inorganic fungicides
IAO_0000118: sonstige anorganische Fungizide @de
id: EUPH:3013
denoted by: //app.pollinatorhub.eu/vocabulary/classes/8165) the category of products 'inorganic fungicides' in the harmonised classification of substances of annex III of Regulation (EU) 2017/269 concerning statistics on pesticides in the EU.

Axiom
annotated source: other inorganic fungicides [F01_99]
annotated property: IAO_0000115
annotated target: The chemical class 'other inorganic fungicides' (harmonised classification of substances code F01_99), a member of the category of products 'inorganic fungicides' in the harmonised classification of substances of annex III of Regulation (EU) 2017/269 concerning statistics on pesticides in the EU.
source: https://eur-lex.europa.eu/eli/reg/2017/269/oj

Axiom
annotated source: other inorganic fungicides [F01_99]
annotated property: denoted by
annotated target: //app.pollinatorhub.eu/vocabulary/classes/8165) the category of products 'inorganic fungicides' in the harmonised classification of substances of annex III of Regulation (EU) 2017/269 concerning statistics on pesticides in the EU.
has db xref: harmonised classification of substances code

fungicides based on carbamates and dithiocarbamates [F02]
type: Class
subclass of: harmonised classification of substances categories of products
subclass of: Restriction
  on property: member of
  some values from: fungicides and bactericides [PES_F]
IAO_0000115: The category of products 'fungicides based on carbamates and dithiocarbamates' (harmonised classification of substances code F02), a member of the major group 'fungicides and bactericides' in the harmonised classification of substances of annex III of Regulation (EU) 2017/269 concerning statistics on pesticides in the EU.
IAO_0000117: Michael Rubinigg
IAO_0000118: fungicides based on carbamates and dithiocarbamates
IAO_0000118: von Carbamaten und Dithiocarbamaten abgeleitete Fungizide @de
id: EUPH:3014
denoted by: //app.pollinatorhub.eu/vocabulary/classes/8165) the major group 'fungicides and bactericides' in the harmonised classification of substances of annex III of Regulation (EU) 2017/269 concerning statistics on pesticides in the EU.

Axiom
annotated source: fungicides based on carbamates and dithiocarbamates [F02]
annotated property: IAO_0000115
annotated target: The category of products 'fungicides based on carbamates and dithiocarbamates' (harmonised classification of substances code F02), a member of the major group 'fungicides and bactericides' in the harmonised classification of substances of annex III of Regulation (EU) 2017/269 concerning statistics on pesticides in the EU.
source: https://eur-lex.europa.eu/eli/reg/2017/269/oj

Axiom
annotated source: fungicides based on carbamates and dithiocarbamates [F02]
annotated property: denoted by
annotated target: //app.pollinatorhub.eu/vocabulary/classes/8165) the major group 'fungicides and bactericides' in the harmonised classification of substances of annex III of Regulation (EU) 2017/269 concerning statistics on pesticides in the EU.
has db xref: harmonised classification of substances code

carbanilate fungicides [F02_01]
type: Class
subclass of: harmonised classification of substances chemical class
subclass of: Restriction
  on property: member of
  some values from: fungicides based on carbamates and dithiocarbamates [F02]
IAO_0000115: The chemical class 'carbanilate fungicides' (harmonised classification of substances code F02_01), a member of the category of products 'fungicides based on carbamates and dithiocarbamates' in the harmonised classification of substances of annex III of Regulation (EU) 2017/269 concerning statistics on pesticides in the EU.
IAO_0000117: Michael Rubinigg
IAO_0000118: Carbanilat-Fungizide @de
IAO_0000118: carbanilate fungicides
id: EUPH:3015
denoted by: //app.pollinatorhub.eu/vocabulary/classes/8165) the category of products 'fungicides based on carbamates and dithiocarbamates' in the harmonised classification of substances of annex III of Regulation (EU) 2017/269 concerning statistics on pesticides in the EU.

Axiom
annotated source: carbanilate fungicides [F02_01]
annotated property: IAO_0000115
annotated target: The chemical class 'carbanilate fungicides' (harmonised classification of substances code F02_01), a member of the category of products 'fungicides based on carbamates and dithiocarbamates' in the harmonised classification of substances of annex III of Regulation (EU) 2017/269 concerning statistics on pesticides in the EU.
source: https://eur-lex.europa.eu/eli/reg/2017/269/oj

Axiom
annotated source: carbanilate fungicides [F02_01]
annotated property: denoted by
annotated target: //app.pollinatorhub.eu/vocabulary/classes/8165) the category of products 'fungicides based on carbamates and dithiocarbamates' in the harmonised classification of substances of annex III of Regulation (EU) 2017/269 concerning statistics on pesticides in the EU.
has db xref: harmonised classification of substances code

carbamate fungicides [F02_02]
type: Class
subclass of: harmonised classification of substances chemical class
subclass of: Restriction
  on property: member of
  some values from: fungicides based on carbamates and dithiocarbamates [F02]
IAO_0000115: The chemical class 'carbamate fungicides' (harmonised classification of substances code F02_02), a member of the category of products 'fungicides based on carbamates and dithiocarbamates' in the harmonised classification of substances of annex III of Regulation (EU) 2017/269 concerning statistics on pesticides in the EU.
IAO_0000117: Michael Rubinigg
IAO_0000118: Carbamat-Fungizide @de
IAO_0000118: carbamate fungicides
id: EUPH:3016
denoted by: //app.pollinatorhub.eu/vocabulary/classes/8165) the category of products 'fungicides based on carbamates and dithiocarbamates' in the harmonised classification of substances of annex III of Regulation (EU) 2017/269 concerning statistics on pesticides in the EU.

Axiom
annotated source: carbamate fungicides [F02_02]
annotated property: IAO_0000115
annotated target: The chemical class 'carbamate fungicides' (harmonised classification of substances code F02_02), a member of the category of products 'fungicides based on carbamates and dithiocarbamates' in the harmonised classification of substances of annex III of Regulation (EU) 2017/269 concerning statistics on pesticides in the EU.
source: https://eur-lex.europa.eu/eli/reg/2017/269/oj

Axiom
annotated source: carbamate fungicides [F02_02]
annotated property: denoted by
annotated target: //app.pollinatorhub.eu/vocabulary/classes/8165) the category of products 'fungicides based on carbamates and dithiocarbamates' in the harmonised classification of substances of annex III of Regulation (EU) 2017/269 concerning statistics on pesticides in the EU.
has db xref: harmonised classification of substances code

dithiocarbamate fungicides [F02_03]
type: Class
subclass of: harmonised classification of substances chemical class
subclass of: Restriction
  on property: member of
  some values from: fungicides based on carbamates and dithiocarbamates [F02]
IAO_0000115: The chemical class 'dithiocarbamate fungicides' (harmonised classification of substances code F02_03), a member of the category of products 'fungicides based on carbamates and dithiocarbamates' in the harmonised classification of substances of annex III of Regulation (EU) 2017/269 concerning statistics on pesticides in the EU.
IAO_0000117: Michael Rubinigg
IAO_0000118: Dithiocarbamat-Fungizide @de
IAO_0000118: dithiocarbamate fungicides
id: EUPH:3017
denoted by: //app.pollinatorhub.eu/vocabulary/classes/8165) the category of products 'fungicides based on carbamates and dithiocarbamates' in the harmonised classification of substances of annex III of Regulation (EU) 2017/269 concerning statistics on pesticides in the EU.

Axiom
annotated source: dithiocarbamate fungicides [F02_03]
annotated property: IAO_0000115
annotated target: The chemical class 'dithiocarbamate fungicides' (harmonised classification of substances code F02_03), a member of the category of products 'fungicides based on carbamates and dithiocarbamates' in the harmonised classification of substances of annex III of Regulation (EU) 2017/269 concerning statistics on pesticides in the EU.
source: https://eur-lex.europa.eu/eli/reg/2017/269/oj

Axiom
annotated source: dithiocarbamate fungicides [F02_03]
annotated property: denoted by
annotated target: //app.pollinatorhub.eu/vocabulary/classes/8165) the category of products 'fungicides based on carbamates and dithiocarbamates' in the harmonised classification of substances of annex III of Regulation (EU) 2017/269 concerning statistics on pesticides in the EU.
has db xref: harmonised classification of substances code

other fungicides based on carbamates and dithiocarbamates [F02_99]
type: Class
subclass of: harmonised classification of substances chemical class
subclass of: Restriction
  on property: member of
  some values from: fungicides based on carbamates and dithiocarbamates [F02]
IAO_0000115: The chemical class 'other fungicides based on carbamates and dithiocarbamates' (harmonised classification of substances code F02_99), a member of the category of products 'fungicides based on carbamates and dithiocarbamates' in the harmonised classification of substances of annex III of Regulation (EU) 2017/269 concerning statistics on pesticides in the EU.
IAO_0000117: Michael Rubinigg
IAO_0000118: other fungicides based on carbamates and dithiocarbamates
IAO_0000118: sonstige von Carbamaten und Dithiocarbamaten abgeleitete Fungizide @de
id: EUPH:3018
denoted by: //app.pollinatorhub.eu/vocabulary/classes/8165) the category of products 'fungicides based on carbamates and dithiocarbamates' in the harmonised classification of substances of annex III of Regulation (EU) 2017/269 concerning statistics on pesticides in the EU.

Axiom
annotated source: other fungicides based on carbamates and dithiocarbamates [F02_99]
annotated property: IAO_0000115
annotated target: The chemical class 'other fungicides based on carbamates and dithiocarbamates' (harmonised classification of substances code F02_99), a member of the category of products 'fungicides based on carbamates and dithiocarbamates' in the harmonised classification of substances of annex III of Regulation (EU) 2017/269 concerning statistics on pesticides in the EU.
source: https://eur-lex.europa.eu/eli/reg/2017/269/oj

Axiom
annotated source: other fungicides based on carbamates and dithiocarbamates [F02_99]
annotated property: denoted by
annotated target: //app.pollinatorhub.eu/vocabulary/classes/8165) the category of products 'fungicides based on carbamates and dithiocarbamates' in the harmonised classification of substances of annex III of Regulation (EU) 2017/269 concerning statistics on pesticides in the EU.
has db xref: harmonised classification of substances code

fungicides based on benzimidazoles [F03]
type: Class
subclass of: harmonised classification of substances categories of products
subclass of: Restriction
  on property: member of
  some values from: fungicides and bactericides [PES_F]
IAO_0000115: The category of products 'fungicides based on benzimidazoles' (harmonised classification of substances code F03), a member of the major group 'fungicides and bactericides' in the harmonised classification of substances of annex III of Regulation (EU) 2017/269 concerning statistics on pesticides in the EU.
IAO_0000117: Michael Rubinigg
IAO_0000118: fungicides based on benzimidazoles
IAO_0000118: von Benzimidazolen abgeleitete Fungizide @de
id: EUPH:3019
denoted by: //app.pollinatorhub.eu/vocabulary/classes/8165) the major group 'fungicides and bactericides' in the harmonised classification of substances of annex III of Regulation (EU) 2017/269 concerning statistics on pesticides in the EU.

Axiom
annotated source: fungicides based on benzimidazoles [F03]
annotated property: IAO_0000115
annotated target: The category of products 'fungicides based on benzimidazoles' (harmonised classification of substances code F03), a member of the major group 'fungicides and bactericides' in the harmonised classification of substances of annex III of Regulation (EU) 2017/269 concerning statistics on pesticides in the EU.
source: https://eur-lex.europa.eu/eli/reg/2017/269/oj

Axiom
annotated source: fungicides based on benzimidazoles [F03]
annotated property: denoted by
annotated target: //app.pollinatorhub.eu/vocabulary/classes/8165) the major group 'fungicides and bactericides' in the harmonised classification of substances of annex III of Regulation (EU) 2017/269 concerning statistics on pesticides in the EU.
has db xref: harmonised classification of substances code

benzimidazole fungicides [F03_01]
type: Class
subclass of: harmonised classification of substances chemical class
subclass of: Restriction
  on property: member of
  some values from: fungicides based on benzimidazoles [F03]
IAO_0000115: The chemical class 'benzimidazole fungicides' (harmonised classification of substances code F03_01), a member of the category of products 'fungicides based on benzimidazoles' in the harmonised classification of substances of annex III of Regulation (EU) 2017/269 concerning statistics on pesticides in the EU.
IAO_0000117: Michael Rubinigg
IAO_0000118: Benzimidazol-Fungizide @de
IAO_0000118: benzimidazole fungicides
id: EUPH:3020
denoted by: //app.pollinatorhub.eu/vocabulary/classes/8165) the category of products 'fungicides based on benzimidazoles' in the harmonised classification of substances of annex III of Regulation (EU) 2017/269 concerning statistics on pesticides in the EU.

Axiom
annotated source: benzimidazole fungicides [F03_01]
annotated property: IAO_0000115
annotated target: The chemical class 'benzimidazole fungicides' (harmonised classification of substances code F03_01), a member of the category of products 'fungicides based on benzimidazoles' in the harmonised classification of substances of annex III of Regulation (EU) 2017/269 concerning statistics on pesticides in the EU.
source: https://eur-lex.europa.eu/eli/reg/2017/269/oj

Axiom
annotated source: benzimidazole fungicides [F03_01]
annotated property: denoted by
annotated target: //app.pollinatorhub.eu/vocabulary/classes/8165) the category of products 'fungicides based on benzimidazoles' in the harmonised classification of substances of annex III of Regulation (EU) 2017/269 concerning statistics on pesticides in the EU.
has db xref: harmonised classification of substances code

other fungicides based on benzimidazoles [F03_99]
type: Class
subclass of: harmonised classification of substances chemical class
subclass of: Restriction
  on property: member of
  some values from: fungicides based on benzimidazoles [F03]
IAO_0000115: The chemical class 'other fungicides based on benzimidazoles' (harmonised classification of substances code F03_99), a member of the category of products 'fungicides based on benzimidazoles' in the harmonised classification of substances of annex III of Regulation (EU) 2017/269 concerning statistics on pesticides in the EU.
IAO_0000117: Michael Rubinigg
IAO_0000118: other fungicides based on benzimidazoles
IAO_0000118: sonstige von Benzimidazolen abgeleitete Fungizide @de
id: EUPH:3021
denoted by: //app.pollinatorhub.eu/vocabulary/classes/8165) the category of products 'fungicides based on benzimidazoles' in the harmonised classification of substances of annex III of Regulation (EU) 2017/269 concerning statistics on pesticides in the EU.

Axiom
annotated source: other fungicides based on benzimidazoles [F03_99]
annotated property: IAO_0000115
annotated target: The chemical class 'other fungicides based on benzimidazoles' (harmonised classification of substances code F03_99), a member of the category of products 'fungicides based on benzimidazoles' in the harmonised classification of substances of annex III of Regulation (EU) 2017/269 concerning statistics on pesticides in the EU.
source: https://eur-lex.europa.eu/eli/reg/2017/269/oj

Axiom
annotated source: other fungicides based on benzimidazoles [F03_99]
annotated property: denoted by
annotated target: //app.pollinatorhub.eu/vocabulary/classes/8165) the category of products 'fungicides based on benzimidazoles' in the harmonised classification of substances of annex III of Regulation (EU) 2017/269 concerning statistics on pesticides in the EU.
has db xref: harmonised classification of substances code

fungicides based on imidazoles and triazoles [F04]
type: Class
subclass of: harmonised classification of substances categories of products
subclass of: Restriction
  on property: member of
  some values from: fungicides and bactericides [PES_F]
IAO_0000115: The category of products 'fungicides based on imidazoles and triazoles' (harmonised classification of substances code F04), a member of the major group 'fungicides and bactericides' in the harmonised classification of substances of annex III of Regulation (EU) 2017/269 concerning statistics on pesticides in the EU.
IAO_0000117: Michael Rubinigg
IAO_0000118: fungicides based on imidazoles and triazoles
IAO_0000118: von Imidazolen und Triazolen abgeleitete Fungizide @de
id: EUPH:3022
denoted by: //app.pollinatorhub.eu/vocabulary/classes/8165) the major group 'fungicides and bactericides' in the harmonised classification of substances of annex III of Regulation (EU) 2017/269 concerning statistics on pesticides in the EU.

Axiom
annotated source: fungicides based on imidazoles and triazoles [F04]
annotated property: IAO_0000115
annotated target: The category of products 'fungicides based on imidazoles and triazoles' (harmonised classification of substances code F04), a member of the major group 'fungicides and bactericides' in the harmonised classification of substances of annex III of Regulation (EU) 2017/269 concerning statistics on pesticides in the EU.
source: https://eur-lex.europa.eu/eli/reg/2017/269/oj

Axiom
annotated source: fungicides based on imidazoles and triazoles [F04]
annotated property: denoted by
annotated target: //app.pollinatorhub.eu/vocabulary/classes/8165) the major group 'fungicides and bactericides' in the harmonised classification of substances of annex III of Regulation (EU) 2017/269 concerning statistics on pesticides in the EU.
has db xref: harmonised classification of substances code

conazole fungicides [F04_01]
type: Class
subclass of: harmonised classification of substances chemical class
subclass of: Restriction
  on property: member of
  some values from: fungicides based on imidazoles and triazoles [F04]
IAO_0000115: The chemical class 'conazole fungicides' (harmonised classification of substances code F04_01), a member of the category of products 'fungicides based on imidazoles and triazoles' in the harmonised classification of substances of annex III of Regulation (EU) 2017/269 concerning statistics on pesticides in the EU.
IAO_0000117: Michael Rubinigg
IAO_0000118: Conazol-Fungizide @de
IAO_0000118: conazole fungicides
id: EUPH:3023
denoted by: //app.pollinatorhub.eu/vocabulary/classes/8165) the category of products 'fungicides based on imidazoles and triazoles' in the harmonised classification of substances of annex III of Regulation (EU) 2017/269 concerning statistics on pesticides in the EU.

Axiom
annotated source: conazole fungicides [F04_01]
annotated property: IAO_0000115
annotated target: The chemical class 'conazole fungicides' (harmonised classification of substances code F04_01), a member of the category of products 'fungicides based on imidazoles and triazoles' in the harmonised classification of substances of annex III of Regulation (EU) 2017/269 concerning statistics on pesticides in the EU.
source: https://eur-lex.europa.eu/eli/reg/2017/269/oj

Axiom
annotated source: conazole fungicides [F04_01]
annotated property: denoted by
annotated target: //app.pollinatorhub.eu/vocabulary/classes/8165) the category of products 'fungicides based on imidazoles and triazoles' in the harmonised classification of substances of annex III of Regulation (EU) 2017/269 concerning statistics on pesticides in the EU.
has db xref: harmonised classification of substances code

imidazole fungicides [F04_02]
type: Class
subclass of: harmonised classification of substances chemical class
subclass of: Restriction
  on property: member of
  some values from: fungicides based on imidazoles and triazoles [F04]
IAO_0000115: [Chemical class](The chemical class) 'imidazole fungicides' (harmonised classification of substances code F04_02), a member of the category of products 'fungicides based on imidazoles and triazoles' in the harmonised classification of substances of annex III of Regulation (EU) 2017/269 concerning statistics on pesticides in the EU.
IAO_0000117: Michael Rubinigg
IAO_0000118: Imidazol-Fungizide @de
IAO_0000118: imidazole fungicides
id: EUPH:3024
denoted by: //app.pollinatorhub.eu/vocabulary/classes/8165) the category of products 'fungicides based on imidazoles and triazoles' in the harmonised classification of substances of annex III of Regulation (EU) 2017/269 concerning statistics on pesticides in the EU.

Axiom
annotated source: imidazole fungicides [F04_02]
annotated property: IAO_0000115
annotated target: [Chemical class](The chemical class) 'imidazole fungicides' (harmonised classification of substances code F04_02), a member of the category of products 'fungicides based on imidazoles and triazoles' in the harmonised classification of substances of annex III of Regulation (EU) 2017/269 concerning statistics on pesticides in the EU.
source: https://eur-lex.europa.eu/eli/reg/2017/269/oj

Axiom
annotated source: imidazole fungicides [F04_02]
annotated property: denoted by
annotated target: //app.pollinatorhub.eu/vocabulary/classes/8165) the category of products 'fungicides based on imidazoles and triazoles' in the harmonised classification of substances of annex III of Regulation (EU) 2017/269 concerning statistics on pesticides in the EU.
has db xref: harmonised classification of substances code

other fungicides based on imidazoles and triazoles [F04_99]
type: Class
subclass of: harmonised classification of substances chemical class
subclass of: Restriction
  on property: member of
  some values from: fungicides based on imidazoles and triazoles [F04]
IAO_0000115: [Chemical class](The chemical class) 'other fungicides based on imidazoles and triazoles' (harmonised classification of substances code F04_99), a member of the category of products 'fungicides based on imidazoles and triazoles' in the harmonised classification of substances of annex III of Regulation (EU) 2017/269 concerning statistics on pesticides in the EU.
IAO_0000117: Michael Rubinigg
IAO_0000118: other fungicides based on imidazoles and triazoles
IAO_0000118: sonstige von Imidazolen und Triazolen abgeleitete Fungizide @de
id: EUPH:3025
denoted by: //app.pollinatorhub.eu/vocabulary/classes/8165) the category of products 'fungicides based on imidazoles and triazoles' in the harmonised classification of substances of annex III of Regulation (EU) 2017/269 concerning statistics on pesticides in the EU.

Axiom
annotated source: other fungicides based on imidazoles and triazoles [F04_99]
annotated property: IAO_0000115
annotated target: [Chemical class](The chemical class) 'other fungicides based on imidazoles and triazoles' (harmonised classification of substances code F04_99), a member of the category of products 'fungicides based on imidazoles and triazoles' in the harmonised classification of substances of annex III of Regulation (EU) 2017/269 concerning statistics on pesticides in the EU.
source: https://eur-lex.europa.eu/eli/reg/2017/269/oj

Axiom
annotated source: other fungicides based on imidazoles and triazoles [F04_99]
annotated property: denoted by
annotated target: //app.pollinatorhub.eu/vocabulary/classes/8165) the category of products 'fungicides based on imidazoles and triazoles' in the harmonised classification of substances of annex III of Regulation (EU) 2017/269 concerning statistics on pesticides in the EU.
has db xref: harmonised classification of substances code

fungicides based on morpholines [F05]
type: Class
subclass of: harmonised classification of substances categories of products
subclass of: Restriction
  on property: member of
  some values from: fungicides and bactericides [PES_F]
IAO_0000115: The category of products 'fungicides based on morpholines' (harmonised classification of substances code F05), a member of the major group 'fungicides and bactericides' in the harmonised classification of substances of annex III of Regulation (EU) 2017/269 concerning statistics on pesticides in the EU.
IAO_0000117: Michael Rubinigg
IAO_0000118: fungicides based on morpholines
IAO_0000118: von Morpholinen abgeleitete Fungizide @de
id: EUPH:3026
denoted by: //app.pollinatorhub.eu/vocabulary/classes/8165) the major group 'fungicides and bactericides' in the harmonised classification of substances of annex III of Regulation (EU) 2017/269 concerning statistics on pesticides in the EU.

Axiom
annotated source: fungicides based on morpholines [F05]
annotated property: IAO_0000115
annotated target: The category of products 'fungicides based on morpholines' (harmonised classification of substances code F05), a member of the major group 'fungicides and bactericides' in the harmonised classification of substances of annex III of Regulation (EU) 2017/269 concerning statistics on pesticides in the EU.
source: https://eur-lex.europa.eu/eli/reg/2017/269/oj

Axiom
annotated source: fungicides based on morpholines [F05]
annotated property: denoted by
annotated target: //app.pollinatorhub.eu/vocabulary/classes/8165) the major group 'fungicides and bactericides' in the harmonised classification of substances of annex III of Regulation (EU) 2017/269 concerning statistics on pesticides in the EU.
has db xref: harmonised classification of substances code

morpholine fungicides [F05_01]
type: Class
subclass of: harmonised classification of substances chemical class
subclass of: Restriction
  on property: member of
  some values from: fungicides based on morpholines [F05]
IAO_0000115: The chemical class 'morpholine fungicides' (harmonised classification of substances code F05_01), a member of the category of products 'fungicides based on morpholines' in the harmonised classification of substances of annex III of Regulation (EU) 2017/269 concerning statistics on pesticides in the EU.
IAO_0000117: Michael Rubinigg
IAO_0000118: Morpholin-Fungizide @de
IAO_0000118: morpholine fungicides
id: EUPH:3027
denoted by: //app.pollinatorhub.eu/vocabulary/classes/8165) the category of products 'fungicides based on morpholines' in the harmonised classification of substances of annex III of Regulation (EU) 2017/269 concerning statistics on pesticides in the EU.

Axiom
annotated source: morpholine fungicides [F05_01]
annotated property: IAO_0000115
annotated target: The chemical class 'morpholine fungicides' (harmonised classification of substances code F05_01), a member of the category of products 'fungicides based on morpholines' in the harmonised classification of substances of annex III of Regulation (EU) 2017/269 concerning statistics on pesticides in the EU.
source: https://eur-lex.europa.eu/eli/reg/2017/269/oj

Axiom
annotated source: morpholine fungicides [F05_01]
annotated property: denoted by
annotated target: //app.pollinatorhub.eu/vocabulary/classes/8165) the category of products 'fungicides based on morpholines' in the harmonised classification of substances of annex III of Regulation (EU) 2017/269 concerning statistics on pesticides in the EU.
has db xref: harmonised classification of substances code

other fungicides based on morpholines [F05_99]
type: Class
subclass of: harmonised classification of substances chemical class
subclass of: Restriction
  on property: member of
  some values from: fungicides based on morpholines [F05]
IAO_0000115: The chemical class 'other fungicides based on morpholines' (harmonised classification of substances code F05_99), a member of the category of products 'fungicides based on morpholines' in the harmonised classification of substances of annex III of Regulation (EU) 2017/269 concerning statistics on pesticides in the EU.
IAO_0000117: Michael Rubinigg
IAO_0000118: other fungicides based on morpholines
IAO_0000118: sonstige von Morpholinen abgeleitete Fungizide @de
id: EUPH:3028
denoted by: //app.pollinatorhub.eu/vocabulary/classes/8165) the category of products 'fungicides based on morpholines' in the harmonised classification of substances of annex III of Regulation (EU) 2017/269 concerning statistics on pesticides in the EU.

Axiom
annotated source: other fungicides based on morpholines [F05_99]
annotated property: IAO_0000115
annotated target: The chemical class 'other fungicides based on morpholines' (harmonised classification of substances code F05_99), a member of the category of products 'fungicides based on morpholines' in the harmonised classification of substances of annex III of Regulation (EU) 2017/269 concerning statistics on pesticides in the EU.
source: https://eur-lex.europa.eu/eli/reg/2017/269/oj

Axiom
annotated source: other fungicides based on morpholines [F05_99]
annotated property: denoted by
annotated target: //app.pollinatorhub.eu/vocabulary/classes/8165) the category of products 'fungicides based on morpholines' in the harmonised classification of substances of annex III of Regulation (EU) 2017/269 concerning statistics on pesticides in the EU.
has db xref: harmonised classification of substances code

fungicides of microbiological or botanical origin [F06]
type: Class
subclass of: harmonised classification of substances categories of products
subclass of: Restriction
  on property: member of
  some values from: fungicides and bactericides [PES_F]
IAO_0000115: The category of products 'fungicides of microbiological or botanical origin' (harmonised classification of substances code F06), a member of the major group 'fungicides and bactericides' in the harmonised classification of substances of annex III of Regulation (EU) 2017/269 concerning statistics on pesticides in the EU.
IAO_0000117: Michael Rubinigg
IAO_0000118: Fungizide mikrobiologischen oder pflanzlichen Ursprungs @de
IAO_0000118: fungicides of microbiological or botanical origin
id: EUPH:3029
denoted by: //app.pollinatorhub.eu/vocabulary/classes/8165) the major group 'fungicides and bactericides' in the harmonised classification of substances of annex III of Regulation (EU) 2017/269 concerning statistics on pesticides in the EU.

Axiom
annotated source: fungicides of microbiological or botanical origin [F06]
annotated property: IAO_0000115
annotated target: The category of products 'fungicides of microbiological or botanical origin' (harmonised classification of substances code F06), a member of the major group 'fungicides and bactericides' in the harmonised classification of substances of annex III of Regulation (EU) 2017/269 concerning statistics on pesticides in the EU.
source: https://eur-lex.europa.eu/eli/reg/2017/269/oj

Axiom
annotated source: fungicides of microbiological or botanical origin [F06]
annotated property: denoted by
annotated target: //app.pollinatorhub.eu/vocabulary/classes/8165) the major group 'fungicides and bactericides' in the harmonised classification of substances of annex III of Regulation (EU) 2017/269 concerning statistics on pesticides in the EU.
has db xref: harmonised classification of substances code

microbiological fungicides [F06_01]
type: Class
subclass of: harmonised classification of substances chemical class
subclass of: Restriction
  on property: member of
  some values from: fungicides of microbiological or botanical origin [F06]
IAO_0000115: [Chemical class](The chemical class) 'microbiological fungicides' (harmonised classification of substances code F06_01), a member of the category of products 'fungicides of microbiological or botanical origin' in the harmonised classification of substances of annex III of Regulation (EU) 2017/269 concerning statistics on pesticides in the EU.
IAO_0000117: Michael Rubinigg
IAO_0000118: microbiological fungicides
IAO_0000118: mikrobiologische Fungizide @de
id: EUPH:3030
denoted by: //app.pollinatorhub.eu/vocabulary/classes/8165) the category of products 'fungicides of microbiological or botanical origin' in the harmonised classification of substances of annex III of Regulation (EU) 2017/269 concerning statistics on pesticides in the EU.

Axiom
annotated source: microbiological fungicides [F06_01]
annotated property: IAO_0000115
annotated target: [Chemical class](The chemical class) 'microbiological fungicides' (harmonised classification of substances code F06_01), a member of the category of products 'fungicides of microbiological or botanical origin' in the harmonised classification of substances of annex III of Regulation (EU) 2017/269 concerning statistics on pesticides in the EU.
source: https://eur-lex.europa.eu/eli/reg/2017/269/oj

Axiom
annotated source: microbiological fungicides [F06_01]
annotated property: denoted by
annotated target: //app.pollinatorhub.eu/vocabulary/classes/8165) the category of products 'fungicides of microbiological or botanical origin' in the harmonised classification of substances of annex III of Regulation (EU) 2017/269 concerning statistics on pesticides in the EU.
has db xref: harmonised classification of substances code

botanical fungicides [F06_02]
type: Class
subclass of: harmonised classification of substances chemical class
subclass of: Restriction
  on property: member of
  some values from: fungicides of microbiological or botanical origin [F06]
IAO_0000115: [Chemical class](The chemical class) 'botanical fungicides' (harmonised classification of substances code F06_02), a member of the category of products 'fungicides of microbiological or botanical origin' in the harmonised classification of substances of annex III of Regulation (EU) 2017/269 concerning statistics on pesticides in the EU.
IAO_0000117: Michael Rubinigg
IAO_0000118: botanical fungicides
IAO_0000118: pflanzliche Fungizide @de
id: EUPH:3031
denoted by: //app.pollinatorhub.eu/vocabulary/classes/8165) the category of products 'fungicides of microbiological or botanical origin' in the harmonised classification of substances of annex III of Regulation (EU) 2017/269 concerning statistics on pesticides in the EU.

Axiom
annotated source: botanical fungicides [F06_02]
annotated property: IAO_0000115
annotated target: [Chemical class](The chemical class) 'botanical fungicides' (harmonised classification of substances code F06_02), a member of the category of products 'fungicides of microbiological or botanical origin' in the harmonised classification of substances of annex III of Regulation (EU) 2017/269 concerning statistics on pesticides in the EU.
source: https://eur-lex.europa.eu/eli/reg/2017/269/oj

Axiom
annotated source: botanical fungicides [F06_02]
annotated property: denoted by
annotated target: //app.pollinatorhub.eu/vocabulary/classes/8165) the category of products 'fungicides of microbiological or botanical origin' in the harmonised classification of substances of annex III of Regulation (EU) 2017/269 concerning statistics on pesticides in the EU.
has db xref: harmonised classification of substances code

other fungicides of microbiological origin [F06_99]
type: Class
subclass of: harmonised classification of substances chemical class
subclass of: Restriction
  on property: member of
  some values from: fungicides of microbiological or botanical origin [F06]
IAO_0000115: The chemical class 'other fungicides of microbiological origin' (harmonised classification of substances code F06_99), a member of the category of products 'fungicides of microbiological or botanical origin' in the harmonised classification of substances of annex III of Regulation (EU) 2017/269 concerning statistics on pesticides in the EU.
IAO_0000117: Michael Rubinigg
IAO_0000118: other fungicides of microbiological origin
IAO_0000118: sonstige Fungizide mikrobiologischen oder pflanzlichen Ursprungs @de
id: EUPH:3032
denoted by: //app.pollinatorhub.eu/vocabulary/classes/8165) the category of products 'fungicides of microbiological or botanical origin' in the harmonised classification of substances of annex III of Regulation (EU) 2017/269 concerning statistics on pesticides in the EU.

Axiom
annotated source: other fungicides of microbiological origin [F06_99]
annotated property: IAO_0000115
annotated target: The chemical class 'other fungicides of microbiological origin' (harmonised classification of substances code F06_99), a member of the category of products 'fungicides of microbiological or botanical origin' in the harmonised classification of substances of annex III of Regulation (EU) 2017/269 concerning statistics on pesticides in the EU.
source: https://eur-lex.europa.eu/eli/reg/2017/269/oj

Axiom
annotated source: other fungicides of microbiological origin [F06_99]
annotated property: denoted by
annotated target: //app.pollinatorhub.eu/vocabulary/classes/8165) the category of products 'fungicides of microbiological or botanical origin' in the harmonised classification of substances of annex III of Regulation (EU) 2017/269 concerning statistics on pesticides in the EU.
has db xref: harmonised classification of substances code

bactericides [F07]
type: Class
subclass of: harmonised classification of substances categories of products
subclass of: Restriction
  on property: member of
  some values from: fungicides and bactericides [PES_F]
IAO_0000115: The category of products 'bactericides' (harmonised classification of substances code F07), a member of the major group 'fungicides and bactericides' in the harmonised classification of substances of annex III of Regulation (EU) 2017/269 concerning statistics on pesticides in the EU.
IAO_0000117: Michael Rubinigg
IAO_0000118: Bakterizide @de
IAO_0000118: bactericides
id: EUPH:3033
denoted by: //app.pollinatorhub.eu/vocabulary/classes/8165) the major group 'fungicides and bactericides' in the harmonised classification of substances of annex III of Regulation (EU) 2017/269 concerning statistics on pesticides in the EU.

Axiom
annotated source: bactericides [F07]
annotated property: IAO_0000115
annotated target: The category of products 'bactericides' (harmonised classification of substances code F07), a member of the major group 'fungicides and bactericides' in the harmonised classification of substances of annex III of Regulation (EU) 2017/269 concerning statistics on pesticides in the EU.
source: https://eur-lex.europa.eu/eli/reg/2017/269/oj

Axiom
annotated source: bactericides [F07]
annotated property: denoted by
annotated target: //app.pollinatorhub.eu/vocabulary/classes/8165) the major group 'fungicides and bactericides' in the harmonised classification of substances of annex III of Regulation (EU) 2017/269 concerning statistics on pesticides in the EU.
has db xref: harmonised classification of substances code

inorganic bactericides [F07_01]
type: Class
subclass of: harmonised classification of substances chemical class
subclass of: Restriction
  on property: member of
  some values from: bactericides [F07]
IAO_0000115: The chemical class 'inorganic bactericides' (harmonised classification of substances code F07_01), a member of the category of products 'bactericides' in the harmonised classification of substances of annex III of Regulation (EU) 2017/269 concerning statistics on pesticides in the EU.
IAO_0000117: Michael Rubinigg
IAO_0000118: anorganische Bakterizide @de
IAO_0000118: inorganic bactericides
id: EUPH:3034
denoted by: //app.pollinatorhub.eu/vocabulary/classes/8165) the category of products 'bactericides' in the harmonised classification of substances of annex III of Regulation (EU) 2017/269 concerning statistics on pesticides in the EU.

Axiom
annotated source: inorganic bactericides [F07_01]
annotated property: IAO_0000115
annotated target: The chemical class 'inorganic bactericides' (harmonised classification of substances code F07_01), a member of the category of products 'bactericides' in the harmonised classification of substances of annex III of Regulation (EU) 2017/269 concerning statistics on pesticides in the EU.
source: https://eur-lex.europa.eu/eli/reg/2017/269/oj

Axiom
annotated source: inorganic bactericides [F07_01]
annotated property: denoted by
annotated target: //app.pollinatorhub.eu/vocabulary/classes/8165) the category of products 'bactericides' in the harmonised classification of substances of annex III of Regulation (EU) 2017/269 concerning statistics on pesticides in the EU.
has db xref: harmonised classification of substances code

other bactericides [F07_99]
type: Class
subclass of: harmonised classification of substances chemical class
subclass of: Restriction
  on property: member of
  some values from: bactericides [F07]
IAO_0000115: The chemical class 'other bactericides' (harmonised classification of substances code F07_99), a member of the category of products 'bactericides' in the harmonised classification of substances of annex III of Regulation (EU) 2017/269 concerning statistics on pesticides in the EU.
IAO_0000117: Michael Rubinigg
IAO_0000118: other bactericides
IAO_0000118: sonstige Bakterizide @de
id: EUPH:3035
denoted by: //app.pollinatorhub.eu/vocabulary/classes/8165) the category of products 'bactericides' in the harmonised classification of substances of annex III of Regulation (EU) 2017/269 concerning statistics on pesticides in the EU.

Axiom
annotated source: other bactericides [F07_99]
annotated property: IAO_0000115
annotated target: The chemical class 'other bactericides' (harmonised classification of substances code F07_99), a member of the category of products 'bactericides' in the harmonised classification of substances of annex III of Regulation (EU) 2017/269 concerning statistics on pesticides in the EU.
source: https://eur-lex.europa.eu/eli/reg/2017/269/oj

Axiom
annotated source: other bactericides [F07_99]
annotated property: denoted by
annotated target: //app.pollinatorhub.eu/vocabulary/classes/8165) the category of products 'bactericides' in the harmonised classification of substances of annex III of Regulation (EU) 2017/269 concerning statistics on pesticides in the EU.
has db xref: harmonised classification of substances code

other fungicides and bactericides [F99]
type: Class
subclass of: harmonised classification of substances categories of products
subclass of: Restriction
  on property: member of
  some values from: fungicides and bactericides [PES_F]
IAO_0000115: The category of products 'other fungicides and bactericides' (harmonised classification of substances code F99), a member of the major group 'fungicides and bactericides' in the harmonised classification of substances of annex III of Regulation (EU) 2017/269 concerning statistics on pesticides in the EU.
IAO_0000117: Michael Rubinigg
IAO_0000118: other fungicides and bactericides
IAO_0000118: sonstige Fungizide und Bakterizide @de
id: EUPH:3036
denoted by: //app.pollinatorhub.eu/vocabulary/classes/8165) the major group 'fungicides and bactericides' in the harmonised classification of substances of annex III of Regulation (EU) 2017/269 concerning statistics on pesticides in the EU.

Axiom
annotated source: other fungicides and bactericides [F99]
annotated property: IAO_0000115
annotated target: The category of products 'other fungicides and bactericides' (harmonised classification of substances code F99), a member of the major group 'fungicides and bactericides' in the harmonised classification of substances of annex III of Regulation (EU) 2017/269 concerning statistics on pesticides in the EU.
source: https://eur-lex.europa.eu/eli/reg/2017/269/oj

Axiom
annotated source: other fungicides and bactericides [F99]
annotated property: denoted by
annotated target: //app.pollinatorhub.eu/vocabulary/classes/8165) the major group 'fungicides and bactericides' in the harmonised classification of substances of annex III of Regulation (EU) 2017/269 concerning statistics on pesticides in the EU.
has db xref: harmonised classification of substances code

aliphatic nitrogen fungicides [F99_01]
type: Class
subclass of: harmonised classification of substances chemical class
subclass of: Restriction
  on property: member of
  some values from: other fungicides and bactericides [F99]
IAO_0000115: The chemical class 'aliphatic nitrogen fungicides' (harmonised classification of substances code F99_01), a member of the category of products 'other fungicides and bactericides' in the harmonised classification of substances of annex III of Regulation (EU) 2017/269 concerning statistics on pesticides in the EU.
IAO_0000117: Michael Rubinigg
IAO_0000118: Aliphatische Stickstoffffungizide @de
IAO_0000118: aliphatic nitrogen fungicides
id: EUPH:3037
denoted by: //app.pollinatorhub.eu/vocabulary/classes/8165) the category of products 'other fungicides and bactericides' in the harmonised classification of substances of annex III of Regulation (EU) 2017/269 concerning statistics on pesticides in the EU.

Axiom
annotated source: aliphatic nitrogen fungicides [F99_01]
annotated property: IAO_0000115
annotated target: The chemical class 'aliphatic nitrogen fungicides' (harmonised classification of substances code F99_01), a member of the category of products 'other fungicides and bactericides' in the harmonised classification of substances of annex III of Regulation (EU) 2017/269 concerning statistics on pesticides in the EU.
source: https://eur-lex.europa.eu/eli/reg/2017/269/oj

Axiom
annotated source: aliphatic nitrogen fungicides [F99_01]
annotated property: denoted by
annotated target: //app.pollinatorhub.eu/vocabulary/classes/8165) the category of products 'other fungicides and bactericides' in the harmonised classification of substances of annex III of Regulation (EU) 2017/269 concerning statistics on pesticides in the EU.
has db xref: harmonised classification of substances code

amide fungicides [F99_02]
type: Class
subclass of: harmonised classification of substances chemical class
subclass of: Restriction
  on property: member of
  some values from: other fungicides and bactericides [F99]
IAO_0000115: The chemical class 'amide fungicides' (harmonised classification of substances code F99_02), a member of the category of products 'other fungicides and bactericides' in the harmonised classification of substances of annex III of Regulation (EU) 2017/269 concerning statistics on pesticides in the EU.
IAO_0000117: Michael Rubinigg
IAO_0000118: Amidfungizide @de
IAO_0000118: amide fungicides
id: EUPH:3038
denoted by: //app.pollinatorhub.eu/vocabulary/classes/8165) the category of products 'other fungicides and bactericides' in the harmonised classification of substances of annex III of Regulation (EU) 2017/269 concerning statistics on pesticides in the EU.

Axiom
annotated source: amide fungicides [F99_02]
annotated property: IAO_0000115
annotated target: The chemical class 'amide fungicides' (harmonised classification of substances code F99_02), a member of the category of products 'other fungicides and bactericides' in the harmonised classification of substances of annex III of Regulation (EU) 2017/269 concerning statistics on pesticides in the EU.
source: https://eur-lex.europa.eu/eli/reg/2017/269/oj

Axiom
annotated source: amide fungicides [F99_02]
annotated property: denoted by
annotated target: //app.pollinatorhub.eu/vocabulary/classes/8165) the category of products 'other fungicides and bactericides' in the harmonised classification of substances of annex III of Regulation (EU) 2017/269 concerning statistics on pesticides in the EU.
has db xref: harmonised classification of substances code

anilide fungicides [F99_03]
type: Class
subclass of: harmonised classification of substances chemical class
subclass of: Restriction
  on property: member of
  some values from: other fungicides and bactericides [F99]
IAO_0000115: The chemical class 'anilide fungicides' (harmonised classification of substances code F99_03), a member of the category of products 'other fungicides and bactericides' in the harmonised classification of substances of annex III of Regulation (EU) 2017/269 concerning statistics on pesticides in the EU.
IAO_0000117: Michael Rubinigg
IAO_0000118: Anilid-Fungizide @de
IAO_0000118: anilide fungicides
id: EUPH:3039
denoted by: //app.pollinatorhub.eu/vocabulary/classes/8165) the category of products 'other fungicides and bactericides' in the harmonised classification of substances of annex III of Regulation (EU) 2017/269 concerning statistics on pesticides in the EU.

Axiom
annotated source: anilide fungicides [F99_03]
annotated property: IAO_0000115
annotated target: The chemical class 'anilide fungicides' (harmonised classification of substances code F99_03), a member of the category of products 'other fungicides and bactericides' in the harmonised classification of substances of annex III of Regulation (EU) 2017/269 concerning statistics on pesticides in the EU.
source: https://eur-lex.europa.eu/eli/reg/2017/269/oj

Axiom
annotated source: anilide fungicides [F99_03]
annotated property: denoted by
annotated target: //app.pollinatorhub.eu/vocabulary/classes/8165) the category of products 'other fungicides and bactericides' in the harmonised classification of substances of annex III of Regulation (EU) 2017/269 concerning statistics on pesticides in the EU.
has db xref: harmonised classification of substances code

aromatic fungicides [F99_05]
type: Class
subclass of: harmonised classification of substances chemical class
subclass of: Restriction
  on property: member of
  some values from: other fungicides and bactericides [F99]
IAO_0000115: The chemical class 'aromatic fungicides' (harmonised classification of substances code F99_05), a member of the category of products 'other fungicides and bactericides' in the harmonised classification of substances of annex III of Regulation (EU) 2017/269 concerning statistics on pesticides in the EU.
IAO_0000117: Michael Rubinigg
IAO_0000118: Aromatische Fungizide @de
IAO_0000118: aromatic fungicides
id: EUPH:3040
denoted by: //app.pollinatorhub.eu/vocabulary/classes/8165) the category of products 'other fungicides and bactericides' in the harmonised classification of substances of annex III of Regulation (EU) 2017/269 concerning statistics on pesticides in the EU.

Axiom
annotated source: aromatic fungicides [F99_05]
annotated property: IAO_0000115
annotated target: The chemical class 'aromatic fungicides' (harmonised classification of substances code F99_05), a member of the category of products 'other fungicides and bactericides' in the harmonised classification of substances of annex III of Regulation (EU) 2017/269 concerning statistics on pesticides in the EU.
source: https://eur-lex.europa.eu/eli/reg/2017/269/oj

Axiom
annotated source: aromatic fungicides [F99_05]
annotated property: denoted by
annotated target: //app.pollinatorhub.eu/vocabulary/classes/8165) the category of products 'other fungicides and bactericides' in the harmonised classification of substances of annex III of Regulation (EU) 2017/269 concerning statistics on pesticides in the EU.
has db xref: harmonised classification of substances code

dicarboximide fungicides [F99_06]
type: Class
subclass of: harmonised classification of substances chemical class
subclass of: Restriction
  on property: member of
  some values from: other fungicides and bactericides [F99]
IAO_0000115: The chemical class 'dicarboximide fungicides' (harmonised classification of substances code F99_06), a member of the category of products 'other fungicides and bactericides' in the harmonised classification of substances of annex III of Regulation (EU) 2017/269 concerning statistics on pesticides in the EU.
IAO_0000117: Michael Rubinigg
IAO_0000118: Dicarboximid-Fungizide @de
IAO_0000118: dicarboximide fungicides
id: EUPH:3041
denoted by: //app.pollinatorhub.eu/vocabulary/classes/8165) the category of products 'other fungicides and bactericides' in the harmonised classification of substances of annex III of Regulation (EU) 2017/269 concerning statistics on pesticides in the EU.

Axiom
annotated source: dicarboximide fungicides [F99_06]
annotated property: IAO_0000115
annotated target: The chemical class 'dicarboximide fungicides' (harmonised classification of substances code F99_06), a member of the category of products 'other fungicides and bactericides' in the harmonised classification of substances of annex III of Regulation (EU) 2017/269 concerning statistics on pesticides in the EU.
source: https://eur-lex.europa.eu/eli/reg/2017/269/oj

Axiom
annotated source: dicarboximide fungicides [F99_06]
annotated property: denoted by
annotated target: //app.pollinatorhub.eu/vocabulary/classes/8165) the category of products 'other fungicides and bactericides' in the harmonised classification of substances of annex III of Regulation (EU) 2017/269 concerning statistics on pesticides in the EU.
has db xref: harmonised classification of substances code

dinitroaniline fungicides [F99_07]
type: Class
subclass of: harmonised classification of substances chemical class
subclass of: Restriction
  on property: member of
  some values from: other fungicides and bactericides [F99]
IAO_0000115: The chemical class 'dinitroaniline fungicides' (harmonised classification of substances code F99_07), a member of the category of products 'other fungicides and bactericides' in the harmonised classification of substances of annex III of Regulation (EU) 2017/269 concerning statistics on pesticides in the EU.
IAO_0000117: Michael Rubinigg
IAO_0000118: Dinitroanilin-Fungizide @de
IAO_0000118: dinitroaniline fungicides
id: EUPH:3042
denoted by: //app.pollinatorhub.eu/vocabulary/classes/8165) the category of products 'other fungicides and bactericides' in the harmonised classification of substances of annex III of Regulation (EU) 2017/269 concerning statistics on pesticides in the EU.

Axiom
annotated source: dinitroaniline fungicides [F99_07]
annotated property: IAO_0000115
annotated target: The chemical class 'dinitroaniline fungicides' (harmonised classification of substances code F99_07), a member of the category of products 'other fungicides and bactericides' in the harmonised classification of substances of annex III of Regulation (EU) 2017/269 concerning statistics on pesticides in the EU.
source: https://eur-lex.europa.eu/eli/reg/2017/269/oj

Axiom
annotated source: dinitroaniline fungicides [F99_07]
annotated property: denoted by
annotated target: //app.pollinatorhub.eu/vocabulary/classes/8165) the category of products 'other fungicides and bactericides' in the harmonised classification of substances of annex III of Regulation (EU) 2017/269 concerning statistics on pesticides in the EU.
has db xref: harmonised classification of substances code

dinitrophenol fungicides [F99_08]
type: Class
subclass of: harmonised classification of substances chemical class
subclass of: Restriction
  on property: member of
  some values from: other fungicides and bactericides [F99]
IAO_0000115: The chemical class 'dinitrophenol fungicides' (harmonised classification of substances code F99_08), a member of the category of products 'other fungicides and bactericides' in the harmonised classification of substances of annex III of Regulation (EU) 2017/269 concerning statistics on pesticides in the EU.
IAO_0000117: Michael Rubinigg
IAO_0000118: Dinitrophenol-Fungizide @de
IAO_0000118: dinitrophenol fungicides
id: EUPH:3043
denoted by: //app.pollinatorhub.eu/vocabulary/classes/8165) the category of products 'other fungicides and bactericides' in the harmonised classification of substances of annex III of Regulation (EU) 2017/269 concerning statistics on pesticides in the EU.

Axiom
annotated source: dinitrophenol fungicides [F99_08]
annotated property: IAO_0000115
annotated target: The chemical class 'dinitrophenol fungicides' (harmonised classification of substances code F99_08), a member of the category of products 'other fungicides and bactericides' in the harmonised classification of substances of annex III of Regulation (EU) 2017/269 concerning statistics on pesticides in the EU.
source: https://eur-lex.europa.eu/eli/reg/2017/269/oj

Axiom
annotated source: dinitrophenol fungicides [F99_08]
annotated property: denoted by
annotated target: //app.pollinatorhub.eu/vocabulary/classes/8165) the category of products 'other fungicides and bactericides' in the harmonised classification of substances of annex III of Regulation (EU) 2017/269 concerning statistics on pesticides in the EU.
has db xref: harmonised classification of substances code

organophosphorus fungicides [F99_09]
type: Class
subclass of: harmonised classification of substances chemical class
subclass of: Restriction
  on property: member of
  some values from: other fungicides and bactericides [F99]
IAO_0000115: The chemical class 'organophosphorus fungicides' (harmonised classification of substances code F99_09), a member of the category of products 'other fungicides and bactericides' in the harmonised classification of substances of annex III of Regulation (EU) 2017/269 concerning statistics on pesticides in the EU.
IAO_0000117: Michael Rubinigg
IAO_0000118: Organophosphor-Fungizide @de
IAO_0000118: organophosphorus fungicides
id: EUPH:3044
denoted by: //app.pollinatorhub.eu/vocabulary/classes/8165) the category of products 'other fungicides and bactericides' in the harmonised classification of substances of annex III of Regulation (EU) 2017/269 concerning statistics on pesticides in the EU.

Axiom
annotated source: organophosphorus fungicides [F99_09]
annotated property: IAO_0000115
annotated target: The chemical class 'organophosphorus fungicides' (harmonised classification of substances code F99_09), a member of the category of products 'other fungicides and bactericides' in the harmonised classification of substances of annex III of Regulation (EU) 2017/269 concerning statistics on pesticides in the EU.
source: https://eur-lex.europa.eu/eli/reg/2017/269/oj

Axiom
annotated source: organophosphorus fungicides [F99_09]
annotated property: denoted by
annotated target: //app.pollinatorhub.eu/vocabulary/classes/8165) the category of products 'other fungicides and bactericides' in the harmonised classification of substances of annex III of Regulation (EU) 2017/269 concerning statistics on pesticides in the EU.
has db xref: harmonised classification of substances code

oxazole fungicides [F99_10]
type: Class
subclass of: harmonised classification of substances chemical class
subclass of: Restriction
  on property: member of
  some values from: other fungicides and bactericides [F99]
IAO_0000115: The chemical class 'oxazole fungicides' (harmonised classification of substances code F99_10), a member of the category of products 'other fungicides and bactericides' in the harmonised classification of substances of annex III of Regulation (EU) 2017/269 concerning statistics on pesticides in the EU.
IAO_0000117: Michael Rubinigg
IAO_0000118: Oxazol-Fungizide @de
IAO_0000118: oxazole fungicides
id: EUPH:3045
denoted by: //app.pollinatorhub.eu/vocabulary/classes/8165) the category of products 'other fungicides and bactericides' in the harmonised classification of substances of annex III of Regulation (EU) 2017/269 concerning statistics on pesticides in the EU.

Axiom
annotated source: oxazole fungicides [F99_10]
annotated property: IAO_0000115
annotated target: The chemical class 'oxazole fungicides' (harmonised classification of substances code F99_10), a member of the category of products 'other fungicides and bactericides' in the harmonised classification of substances of annex III of Regulation (EU) 2017/269 concerning statistics on pesticides in the EU.
source: https://eur-lex.europa.eu/eli/reg/2017/269/oj

Axiom
annotated source: oxazole fungicides [F99_10]
annotated property: denoted by
annotated target: //app.pollinatorhub.eu/vocabulary/classes/8165) the category of products 'other fungicides and bactericides' in the harmonised classification of substances of annex III of Regulation (EU) 2017/269 concerning statistics on pesticides in the EU.
has db xref: harmonised classification of substances code

phenylpyrrole fungicides [F99_11]
type: Class
subclass of: harmonised classification of substances chemical class
subclass of: Restriction
  on property: member of
  some values from: other fungicides and bactericides [F99]
IAO_0000115: The chemical class 'phenylpyrrole fungicides' (harmonised classification of substances code F99_11), a member of the category of products 'other fungicides and bactericides' in the harmonised classification of substances of annex III of Regulation (EU) 2017/269 concerning statistics on pesticides in the EU.
IAO_0000117: Michael Rubinigg
IAO_0000118: Phenylpyrrol-Fungizide @de
IAO_0000118: phenylpyrrole fungicides
id: EUPH:3046
denoted by: //app.pollinatorhub.eu/vocabulary/classes/8165) the category of products 'other fungicides and bactericides' in the harmonised classification of substances of annex III of Regulation (EU) 2017/269 concerning statistics on pesticides in the EU.

Axiom
annotated source: phenylpyrrole fungicides [F99_11]
annotated property: IAO_0000115
annotated target: The chemical class 'phenylpyrrole fungicides' (harmonised classification of substances code F99_11), a member of the category of products 'other fungicides and bactericides' in the harmonised classification of substances of annex III of Regulation (EU) 2017/269 concerning statistics on pesticides in the EU.
source: https://eur-lex.europa.eu/eli/reg/2017/269/oj

Axiom
annotated source: phenylpyrrole fungicides [F99_11]
annotated property: denoted by
annotated target: //app.pollinatorhub.eu/vocabulary/classes/8165) the category of products 'other fungicides and bactericides' in the harmonised classification of substances of annex III of Regulation (EU) 2017/269 concerning statistics on pesticides in the EU.
has db xref: harmonised classification of substances code

phthalimide fungicides [F99_12]
type: Class
subclass of: harmonised classification of substances chemical class
subclass of: Restriction
  on property: member of
  some values from: other fungicides and bactericides [F99]
IAO_0000115: The chemical class 'phthalimide fungicides' (harmonised classification of substances code F99_12), a member of the category of products 'other fungicides and bactericides' in the harmonised classification of substances of annex III of Regulation (EU) 2017/269 concerning statistics on pesticides in the EU.
IAO_0000117: Michael Rubinigg
IAO_0000118: Phthalimid-Fungizide @de
IAO_0000118: phthalimide fungicides
id: EUPH:3047
denoted by: //app.pollinatorhub.eu/vocabulary/classes/8165) the category of products 'other fungicides and bactericides' in the harmonised classification of substances of annex III of Regulation (EU) 2017/269 concerning statistics on pesticides in the EU.

Axiom
annotated source: phthalimide fungicides [F99_12]
annotated property: IAO_0000115
annotated target: The chemical class 'phthalimide fungicides' (harmonised classification of substances code F99_12), a member of the category of products 'other fungicides and bactericides' in the harmonised classification of substances of annex III of Regulation (EU) 2017/269 concerning statistics on pesticides in the EU.
source: https://eur-lex.europa.eu/eli/reg/2017/269/oj

Axiom
annotated source: phthalimide fungicides [F99_12]
annotated property: denoted by
annotated target: //app.pollinatorhub.eu/vocabulary/classes/8165) the category of products 'other fungicides and bactericides' in the harmonised classification of substances of annex III of Regulation (EU) 2017/269 concerning statistics on pesticides in the EU.
has db xref: harmonised classification of substances code

pyrimidine fungicides [F99_13]
type: Class
subclass of: harmonised classification of substances chemical class
subclass of: Restriction
  on property: member of
  some values from: other fungicides and bactericides [F99]
IAO_0000115: The chemical class 'pyrimidine fungicides' (harmonised classification of substances code F99_13), a member of the category of products 'other fungicides and bactericides' in the harmonised classification of substances of annex III of Regulation (EU) 2017/269 concerning statistics on pesticides in the EU.
IAO_0000117: Michael Rubinigg
IAO_0000118: Pyrimidin-Fungizide @de
IAO_0000118: pyrimidine fungicides
id: EUPH:3048
denoted by: //app.pollinatorhub.eu/vocabulary/classes/8165) the category of products 'other fungicides and bactericides' in the harmonised classification of substances of annex III of Regulation (EU) 2017/269 concerning statistics on pesticides in the EU.

Axiom
annotated source: pyrimidine fungicides [F99_13]
annotated property: IAO_0000115
annotated target: The chemical class 'pyrimidine fungicides' (harmonised classification of substances code F99_13), a member of the category of products 'other fungicides and bactericides' in the harmonised classification of substances of annex III of Regulation (EU) 2017/269 concerning statistics on pesticides in the EU.
source: https://eur-lex.europa.eu/eli/reg/2017/269/oj

Axiom
annotated source: pyrimidine fungicides [F99_13]
annotated property: denoted by
annotated target: //app.pollinatorhub.eu/vocabulary/classes/8165) the category of products 'other fungicides and bactericides' in the harmonised classification of substances of annex III of Regulation (EU) 2017/269 concerning statistics on pesticides in the EU.
has db xref: harmonised classification of substances code

quinoline fungicides [F99_14]
type: Class
subclass of: harmonised classification of substances chemical class
subclass of: Restriction
  on property: member of
  some values from: other fungicides and bactericides [F99]
IAO_0000115: The chemical class 'quinoline fungicides' (harmonised classification of substances code F99_14), a member of the category of products 'other fungicides and bactericides' in the harmonised classification of substances of annex III of Regulation (EU) 2017/269 concerning statistics on pesticides in the EU.
IAO_0000117: Michael Rubinigg
IAO_0000118: Chinolin-Fungizide @de
IAO_0000118: quinoline fungicides
id: EUPH:3049
denoted by: //app.pollinatorhub.eu/vocabulary/classes/8165) the category of products 'other fungicides and bactericides' in the harmonised classification of substances of annex III of Regulation (EU) 2017/269 concerning statistics on pesticides in the EU.

Axiom
annotated source: quinoline fungicides [F99_14]
annotated property: IAO_0000115
annotated target: The chemical class 'quinoline fungicides' (harmonised classification of substances code F99_14), a member of the category of products 'other fungicides and bactericides' in the harmonised classification of substances of annex III of Regulation (EU) 2017/269 concerning statistics on pesticides in the EU.
source: https://eur-lex.europa.eu/eli/reg/2017/269/oj

Axiom
annotated source: quinoline fungicides [F99_14]
annotated property: denoted by
annotated target: //app.pollinatorhub.eu/vocabulary/classes/8165) the category of products 'other fungicides and bactericides' in the harmonised classification of substances of annex III of Regulation (EU) 2017/269 concerning statistics on pesticides in the EU.
has db xref: harmonised classification of substances code

quinone fungicides [F99_15]
type: Class
subclass of: harmonised classification of substances chemical class
subclass of: Restriction
  on property: member of
  some values from: other fungicides and bactericides [F99]
IAO_0000115: The chemical class 'quinone fungicides' (harmonised classification of substances code F99_15), a member of the category of products 'other fungicides and bactericides' in the harmonised classification of substances of annex III of Regulation (EU) 2017/269 concerning statistics on pesticides in the EU.
IAO_0000117: Michael Rubinigg
IAO_0000118: Chinon-Fungizide @de
IAO_0000118: quinone fungicides
id: EUPH:3050
denoted by: //app.pollinatorhub.eu/vocabulary/classes/8165) the category of products 'other fungicides and bactericides' in the harmonised classification of substances of annex III of Regulation (EU) 2017/269 concerning statistics on pesticides in the EU.

Axiom
annotated source: quinone fungicides [F99_15]
annotated property: IAO_0000115
annotated target: The chemical class 'quinone fungicides' (harmonised classification of substances code F99_15), a member of the category of products 'other fungicides and bactericides' in the harmonised classification of substances of annex III of Regulation (EU) 2017/269 concerning statistics on pesticides in the EU.
source: https://eur-lex.europa.eu/eli/reg/2017/269/oj

Axiom
annotated source: quinone fungicides [F99_15]
annotated property: denoted by
annotated target: //app.pollinatorhub.eu/vocabulary/classes/8165) the category of products 'other fungicides and bactericides' in the harmonised classification of substances of annex III of Regulation (EU) 2017/269 concerning statistics on pesticides in the EU.
has db xref: harmonised classification of substances code

strobilurine fungicides [F99_16]
type: Class
subclass of: harmonised classification of substances chemical class
subclass of: Restriction
  on property: member of
  some values from: other fungicides and bactericides [F99]
IAO_0000115: The chemical class 'strobilurine fungicides' (harmonised classification of substances code F99_16), a member of the category of products 'other fungicides and bactericides' in the harmonised classification of substances of annex III of Regulation (EU) 2017/269 concerning statistics on pesticides in the EU.
IAO_0000117: Michael Rubinigg
IAO_0000118: Strobilurin-Fungizide @de
IAO_0000118: strobilurine fungicides
id: EUPH:3051
denoted by: //app.pollinatorhub.eu/vocabulary/classes/8165) the category of products 'other fungicides and bactericides' in the harmonised classification of substances of annex III of Regulation (EU) 2017/269 concerning statistics on pesticides in the EU.

Axiom
annotated source: strobilurine fungicides [F99_16]
annotated property: IAO_0000115
annotated target: The chemical class 'strobilurine fungicides' (harmonised classification of substances code F99_16), a member of the category of products 'other fungicides and bactericides' in the harmonised classification of substances of annex III of Regulation (EU) 2017/269 concerning statistics on pesticides in the EU.
source: https://eur-lex.europa.eu/eli/reg/2017/269/oj

Axiom
annotated source: strobilurine fungicides [F99_16]
annotated property: denoted by
annotated target: //app.pollinatorhub.eu/vocabulary/classes/8165) the category of products 'other fungicides and bactericides' in the harmonised classification of substances of annex III of Regulation (EU) 2017/269 concerning statistics on pesticides in the EU.
has db xref: harmonised classification of substances code

urea fungicides [F99_17]
type: Class
subclass of: harmonised classification of substances chemical class
subclass of: Restriction
  on property: member of
  some values from: other fungicides and bactericides [F99]
IAO_0000115: The chemical class 'urea fungicides' (harmonised classification of substances code F99_17), a member of the category of products 'other fungicides and bactericides' in the harmonised classification of substances of annex III of Regulation (EU) 2017/269 concerning statistics on pesticides in the EU.
IAO_0000117: Michael Rubinigg
IAO_0000118: Harnstoff-Fungizide @de
IAO_0000118: urea fungicides
id: EUPH:3052
denoted by: //app.pollinatorhub.eu/vocabulary/classes/8165) the category of products 'other fungicides and bactericides' in the harmonised classification of substances of annex III of Regulation (EU) 2017/269 concerning statistics on pesticides in the EU.

Axiom
annotated source: urea fungicides [F99_17]
annotated property: IAO_0000115
annotated target: The chemical class 'urea fungicides' (harmonised classification of substances code F99_17), a member of the category of products 'other fungicides and bactericides' in the harmonised classification of substances of annex III of Regulation (EU) 2017/269 concerning statistics on pesticides in the EU.
source: https://eur-lex.europa.eu/eli/reg/2017/269/oj

Axiom
annotated source: urea fungicides [F99_17]
annotated property: denoted by
annotated target: //app.pollinatorhub.eu/vocabulary/classes/8165) the category of products 'other fungicides and bactericides' in the harmonised classification of substances of annex III of Regulation (EU) 2017/269 concerning statistics on pesticides in the EU.
has db xref: harmonised classification of substances code

unclassified fungicides [F99_99]
type: Class
subclass of: harmonised classification of substances chemical class
subclass of: Restriction
  on property: member of
  some values from: other fungicides and bactericides [F99]
IAO_0000115: The chemical class 'unclassified fungicides' (harmonised classification of substances code F99_99), a member of the category of products 'other fungicides and bactericides' in the harmonised classification of substances of annex III of Regulation (EU) 2017/269 concerning statistics on pesticides in the EU.
IAO_0000117: Michael Rubinigg
IAO_0000118: nicht zugeordnete Fungizide @de
IAO_0000118: unclassified fungicides
id: EUPH:3053
denoted by: //app.pollinatorhub.eu/vocabulary/classes/8165) the category of products 'other fungicides and bactericides' in the harmonised classification of substances of annex III of Regulation (EU) 2017/269 concerning statistics on pesticides in the EU.

Axiom
annotated source: unclassified fungicides [F99_99]
annotated property: IAO_0000115
annotated target: The chemical class 'unclassified fungicides' (harmonised classification of substances code F99_99), a member of the category of products 'other fungicides and bactericides' in the harmonised classification of substances of annex III of Regulation (EU) 2017/269 concerning statistics on pesticides in the EU.
source: https://eur-lex.europa.eu/eli/reg/2017/269/oj

Axiom
annotated source: unclassified fungicides [F99_99]
annotated property: denoted by
annotated target: //app.pollinatorhub.eu/vocabulary/classes/8165) the category of products 'other fungicides and bactericides' in the harmonised classification of substances of annex III of Regulation (EU) 2017/269 concerning statistics on pesticides in the EU.
has db xref: harmonised classification of substances code

herbicides, haulm destructors and moss killers [PES_H]
type: Class
subclass of: harmonised classification of substances major groups
IAO_0000115: The major group 'herbicides, haulm destructors and moss killers' (harmonised classification of substances code PES_H or Euro SDMX registry code H) of the harmonised classification of substances in annex III of Regulation (EU) 2017/269 concerning statistics on pesticides in the EU.
IAO_0000117: Michael Rubinigg
IAO_0000118: Herbizide, krautabtötende Mittel und Moosvernichter @de
IAO_0000118: herbicides, haulm destructors and moss killers
id: EUPH:3054
denoted by: //app.pollinatorhub.eu/vocabulary/classes/8244) H) of the harmonised classification of substances in annex III of Regulation (EU) 2017/269 concerning statistics on pesticides in the EU.

Axiom
annotated source: herbicides, haulm destructors and moss killers [PES_H]
annotated property: IAO_0000115
annotated target: The major group 'herbicides, haulm destructors and moss killers' (harmonised classification of substances code PES_H or Euro SDMX registry code H) of the harmonised classification of substances in annex III of Regulation (EU) 2017/269 concerning statistics on pesticides in the EU.
source: https://eur-lex.europa.eu/eli/reg/2017/269/oj

Axiom
annotated source: herbicides, haulm destructors and moss killers [PES_H]
annotated property: denoted by
annotated target: //app.pollinatorhub.eu/vocabulary/classes/8244) H) of the harmonised classification of substances in annex III of Regulation (EU) 2017/269 concerning statistics on pesticides in the EU.
has db xref: harmonised classification of substances code

herbicides based on phenoxy-phytohormones [H01]
type: Class
subclass of: harmonised classification of substances categories of products
subclass of: Restriction
  on property: member of
  some values from: herbicides, haulm destructors and moss killers [PES_H]
IAO_0000115: The category of products 'herbicides based on phenoxy-phytohormones' (harmonised classification of substances code H01), a member of the major group 'herbicides, haulm destructors and moss killers' in the harmonised classification of substances of annex III of Regulation (EU) 2017/269 concerning statistics on pesticides in the EU.
IAO_0000117: Michael Rubinigg
IAO_0000118: herbicides based on phenoxy-phytohormones
IAO_0000118: von Phenoxy-Phytohormonen abgeleitete Herbizide @de
id: EUPH:3055
denoted by: //app.pollinatorhub.eu/vocabulary/classes/8165) the major group 'herbicides, haulm destructors and moss killers' in the harmonised classification of substances of annex III of Regulation (EU) 2017/269 concerning statistics on pesticides in the EU.

Axiom
annotated source: herbicides based on phenoxy-phytohormones [H01]
annotated property: IAO_0000115
annotated target: The category of products 'herbicides based on phenoxy-phytohormones' (harmonised classification of substances code H01), a member of the major group 'herbicides, haulm destructors and moss killers' in the harmonised classification of substances of annex III of Regulation (EU) 2017/269 concerning statistics on pesticides in the EU.
source: https://eur-lex.europa.eu/eli/reg/2017/269/oj

Axiom
annotated source: herbicides based on phenoxy-phytohormones [H01]
annotated property: denoted by
annotated target: //app.pollinatorhub.eu/vocabulary/classes/8165) the major group 'herbicides, haulm destructors and moss killers' in the harmonised classification of substances of annex III of Regulation (EU) 2017/269 concerning statistics on pesticides in the EU.
has db xref: harmonised classification of substances code

phenoxy herbicides [H01_01]
type: Class
subclass of: harmonised classification of substances chemical class
subclass of: Restriction
  on property: member of
  some values from: herbicides based on phenoxy-phytohormones [H01]
IAO_0000115: The chemical class 'phenoxy herbicides' (harmonised classification of substances code H01_01), a member of the category of products 'herbicides based on phenoxy-phytohormones' in the harmonised classification of substances of annex III of Regulation (EU) 2017/269 concerning statistics on pesticides in the EU.
IAO_0000117: Michael Rubinigg
IAO_0000118: Phenoxy-Herbizide @de
IAO_0000118: phenoxy herbicides
id: EUPH:3056
denoted by: //app.pollinatorhub.eu/vocabulary/classes/8165) the category of products 'herbicides based on phenoxy-phytohormones' in the harmonised classification of substances of annex III of Regulation (EU) 2017/269 concerning statistics on pesticides in the EU.

Axiom
annotated source: phenoxy herbicides [H01_01]
annotated property: IAO_0000115
annotated target: The chemical class 'phenoxy herbicides' (harmonised classification of substances code H01_01), a member of the category of products 'herbicides based on phenoxy-phytohormones' in the harmonised classification of substances of annex III of Regulation (EU) 2017/269 concerning statistics on pesticides in the EU.
source: https://eur-lex.europa.eu/eli/reg/2017/269/oj

Axiom
annotated source: phenoxy herbicides [H01_01]
annotated property: denoted by
annotated target: //app.pollinatorhub.eu/vocabulary/classes/8165) the category of products 'herbicides based on phenoxy-phytohormones' in the harmonised classification of substances of annex III of Regulation (EU) 2017/269 concerning statistics on pesticides in the EU.
has db xref: harmonised classification of substances code

other herbicides based on phenoxy-phytohormones [H01_99]
type: Class
subclass of: harmonised classification of substances chemical class
subclass of: Restriction
  on property: member of
  some values from: herbicides based on phenoxy-phytohormones [H01]
IAO_0000115: The chemical class 'other herbicides based on phenoxy-phytohormones' (harmonised classification of substances code H01_99), a member of the category of products 'herbicides based on phenoxy-phytohormones' in the harmonised classification of substances of annex III of Regulation (EU) 2017/269 concerning statistics on pesticides in the EU.
IAO_0000117: Michael Rubinigg
IAO_0000118: other herbicides based on phenoxy-phytohormones
IAO_0000118: sonstige von phenoxy-Phytohormonen abgeleitete Herbizide @de
id: EUPH:3057
denoted by: //app.pollinatorhub.eu/vocabulary/classes/8165) the category of products 'herbicides based on phenoxy-phytohormones' in the harmonised classification of substances of annex III of Regulation (EU) 2017/269 concerning statistics on pesticides in the EU.

Axiom
annotated source: other herbicides based on phenoxy-phytohormones [H01_99]
annotated property: IAO_0000115
annotated target: The chemical class 'other herbicides based on phenoxy-phytohormones' (harmonised classification of substances code H01_99), a member of the category of products 'herbicides based on phenoxy-phytohormones' in the harmonised classification of substances of annex III of Regulation (EU) 2017/269 concerning statistics on pesticides in the EU.
source: https://eur-lex.europa.eu/eli/reg/2017/269/oj

Axiom
annotated source: other herbicides based on phenoxy-phytohormones [H01_99]
annotated property: denoted by
annotated target: //app.pollinatorhub.eu/vocabulary/classes/8165) the category of products 'herbicides based on phenoxy-phytohormones' in the harmonised classification of substances of annex III of Regulation (EU) 2017/269 concerning statistics on pesticides in the EU.
has db xref: harmonised classification of substances code

herbicides based on triazines and triazinones [H02]
type: Class
subclass of: harmonised classification of substances categories of products
subclass of: Restriction
  on property: member of
  some values from: herbicides, haulm destructors and moss killers [PES_H]
IAO_0000115: The category of products 'herbicides based on triazines and triazinones' (harmonised classification of substances code H02), a member of the major group 'herbicides, haulm destructors and moss killers' in the harmonised classification of substances of annex III of Regulation (EU) 2017/269 concerning statistics on pesticides in the EU.
IAO_0000117: Michael Rubinigg
IAO_0000118: herbicides based on triazines and triazinones
IAO_0000118: von Triazinen und Triazinonen abgeleitete Herbizide @de
id: EUPH:3058
denoted by: //app.pollinatorhub.eu/vocabulary/classes/8165) the major group 'herbicides, haulm destructors and moss killers' in the harmonised classification of substances of annex III of Regulation (EU) 2017/269 concerning statistics on pesticides in the EU.

Axiom
annotated source: herbicides based on triazines and triazinones [H02]
annotated property: IAO_0000115
annotated target: The category of products 'herbicides based on triazines and triazinones' (harmonised classification of substances code H02), a member of the major group 'herbicides, haulm destructors and moss killers' in the harmonised classification of substances of annex III of Regulation (EU) 2017/269 concerning statistics on pesticides in the EU.
source: https://eur-lex.europa.eu/eli/reg/2017/269/oj

Axiom
annotated source: herbicides based on triazines and triazinones [H02]
annotated property: denoted by
annotated target: //app.pollinatorhub.eu/vocabulary/classes/8165) the major group 'herbicides, haulm destructors and moss killers' in the harmonised classification of substances of annex III of Regulation (EU) 2017/269 concerning statistics on pesticides in the EU.
has db xref: harmonised classification of substances code

triazine herbicides [H02_02]
type: Class
subclass of: harmonised classification of substances chemical class
subclass of: Restriction
  on property: member of
  some values from: herbicides based on triazines and triazinones [H02]
IAO_0000115: The chemical class 'triazine herbicides' (harmonised classification of substances code H02_02), a member of the category of products 'herbicides based on triazines and triazinones' in the harmonised classification of substances of annex III of Regulation (EU) 2017/269 concerning statistics on pesticides in the EU.
IAO_0000117: Michael Rubinigg
IAO_0000118: Triazin-Herbizide @de
IAO_0000118: triazine herbicides
id: EUPH:3059
denoted by: //app.pollinatorhub.eu/vocabulary/classes/8165) the category of products 'herbicides based on triazines and triazinones' in the harmonised classification of substances of annex III of Regulation (EU) 2017/269 concerning statistics on pesticides in the EU.

Axiom
annotated source: triazine herbicides [H02_02]
annotated property: IAO_0000115
annotated target: The chemical class 'triazine herbicides' (harmonised classification of substances code H02_02), a member of the category of products 'herbicides based on triazines and triazinones' in the harmonised classification of substances of annex III of Regulation (EU) 2017/269 concerning statistics on pesticides in the EU.
source: https://eur-lex.europa.eu/eli/reg/2017/269/oj

Axiom
annotated source: triazine herbicides [H02_02]
annotated property: denoted by
annotated target: //app.pollinatorhub.eu/vocabulary/classes/8165) the category of products 'herbicides based on triazines and triazinones' in the harmonised classification of substances of annex III of Regulation (EU) 2017/269 concerning statistics on pesticides in the EU.
has db xref: harmonised classification of substances code

triazinone herbicides [H02_03]
type: Class
subclass of: harmonised classification of substances chemical class
subclass of: Restriction
  on property: member of
  some values from: herbicides based on triazines and triazinones [H02]
IAO_0000115: The chemical class 'triazinone herbicides' (harmonised classification of substances code H02_03), a member of the category of products 'herbicides based on triazines and triazinones' in the harmonised classification of substances of annex III of Regulation (EU) 2017/269 concerning statistics on pesticides in the EU.
IAO_0000117: Michael Rubinigg
IAO_0000118: Triazinon-Herbizide @de
IAO_0000118: triazinone herbicides
id: EUPH:3060
denoted by: //app.pollinatorhub.eu/vocabulary/classes/8165) the category of products 'herbicides based on triazines and triazinones' in the harmonised classification of substances of annex III of Regulation (EU) 2017/269 concerning statistics on pesticides in the EU.

Axiom
annotated source: triazinone herbicides [H02_03]
annotated property: IAO_0000115
annotated target: The chemical class 'triazinone herbicides' (harmonised classification of substances code H02_03), a member of the category of products 'herbicides based on triazines and triazinones' in the harmonised classification of substances of annex III of Regulation (EU) 2017/269 concerning statistics on pesticides in the EU.
source: https://eur-lex.europa.eu/eli/reg/2017/269/oj

Axiom
annotated source: triazinone herbicides [H02_03]
annotated property: denoted by
annotated target: //app.pollinatorhub.eu/vocabulary/classes/8165) the category of products 'herbicides based on triazines and triazinones' in the harmonised classification of substances of annex III of Regulation (EU) 2017/269 concerning statistics on pesticides in the EU.
has db xref: harmonised classification of substances code

other herbicides based on triazines and triazinones [H02_99]
type: Class
subclass of: harmonised classification of substances chemical class
subclass of: Restriction
  on property: member of
  some values from: herbicides based on triazines and triazinones [H02]
IAO_0000115: The chemical class 'other herbicides based on triazines and triazinones' (harmonised classification of substances code H02_99), a member of the category of products 'herbicides based on triazines and triazinones' in the harmonised classification of substances of annex III of Regulation (EU) 2017/269 concerning statistics on pesticides in the EU.
IAO_0000117: Michael Rubinigg
IAO_0000118: other herbicides based on triazines and triazinones
IAO_0000118: sonstige von Triazinen und Triazinonen abgeleitete Herbizide @de
id: EUPH:3061
denoted by: //app.pollinatorhub.eu/vocabulary/classes/8165) the category of products 'herbicides based on triazines and triazinones' in the harmonised classification of substances of annex III of Regulation (EU) 2017/269 concerning statistics on pesticides in the EU.

Axiom
annotated source: other herbicides based on triazines and triazinones [H02_99]
annotated property: IAO_0000115
annotated target: The chemical class 'other herbicides based on triazines and triazinones' (harmonised classification of substances code H02_99), a member of the category of products 'herbicides based on triazines and triazinones' in the harmonised classification of substances of annex III of Regulation (EU) 2017/269 concerning statistics on pesticides in the EU.
source: https://eur-lex.europa.eu/eli/reg/2017/269/oj

Axiom
annotated source: other herbicides based on triazines and triazinones [H02_99]
annotated property: denoted by
annotated target: //app.pollinatorhub.eu/vocabulary/classes/8165) the category of products 'herbicides based on triazines and triazinones' in the harmonised classification of substances of annex III of Regulation (EU) 2017/269 concerning statistics on pesticides in the EU.
has db xref: harmonised classification of substances code

herbicides based on amides and anilides [H03]
type: Class
subclass of: harmonised classification of substances categories of products
subclass of: Restriction
  on property: member of
  some values from: herbicides, haulm destructors and moss killers [PES_H]
IAO_0000115: The category of products 'herbicides based on amides and anilides' (harmonised classification of substances code H03), a member of the major group 'herbicides, haulm destructors and moss killers' in the harmonised classification of substances of annex III of Regulation (EU) 2017/269 concerning statistics on pesticides in the EU.
IAO_0000117: Michael Rubinigg
IAO_0000118: herbicides based on amides and anilides
IAO_0000118: von Amiden und Aniliden abgeleitete Herbizide @de
id: EUPH:3062
denoted by: //app.pollinatorhub.eu/vocabulary/classes/8165) the major group 'herbicides, haulm destructors and moss killers' in the harmonised classification of substances of annex III of Regulation (EU) 2017/269 concerning statistics on pesticides in the EU.

Axiom
annotated source: herbicides based on amides and anilides [H03]
annotated property: IAO_0000115
annotated target: The category of products 'herbicides based on amides and anilides' (harmonised classification of substances code H03), a member of the major group 'herbicides, haulm destructors and moss killers' in the harmonised classification of substances of annex III of Regulation (EU) 2017/269 concerning statistics on pesticides in the EU.
source: https://eur-lex.europa.eu/eli/reg/2017/269/oj

Axiom
annotated source: herbicides based on amides and anilides [H03]
annotated property: denoted by
annotated target: //app.pollinatorhub.eu/vocabulary/classes/8165) the major group 'herbicides, haulm destructors and moss killers' in the harmonised classification of substances of annex III of Regulation (EU) 2017/269 concerning statistics on pesticides in the EU.
has db xref: harmonised classification of substances code

amide herbicides [H03_01]
type: Class
subclass of: harmonised classification of substances chemical class
subclass of: Restriction
  on property: member of
  some values from: herbicides based on amides and anilides [H03]
IAO_0000115: The chemical class 'amide herbicides' (harmonised classification of substances code H03_01), a member of the category of products 'herbicides based on amides and anilides' in the harmonised classification of substances of annex III of Regulation (EU) 2017/269 concerning statistics on pesticides in the EU.
IAO_0000117: Michael Rubinigg
IAO_0000118: Amid-Herbizide @de
IAO_0000118: amide herbicides
id: EUPH:3063
denoted by: //app.pollinatorhub.eu/vocabulary/classes/8165) the category of products 'herbicides based on amides and anilides' in the harmonised classification of substances of annex III of Regulation (EU) 2017/269 concerning statistics on pesticides in the EU.

Axiom
annotated source: amide herbicides [H03_01]
annotated property: IAO_0000115
annotated target: The chemical class 'amide herbicides' (harmonised classification of substances code H03_01), a member of the category of products 'herbicides based on amides and anilides' in the harmonised classification of substances of annex III of Regulation (EU) 2017/269 concerning statistics on pesticides in the EU.
source: https://eur-lex.europa.eu/eli/reg/2017/269/oj

Axiom
annotated source: amide herbicides [H03_01]
annotated property: denoted by
annotated target: //app.pollinatorhub.eu/vocabulary/classes/8165) the category of products 'herbicides based on amides and anilides' in the harmonised classification of substances of annex III of Regulation (EU) 2017/269 concerning statistics on pesticides in the EU.
has db xref: harmonised classification of substances code

anilide herbicides [H03_02]
type: Class
subclass of: harmonised classification of substances chemical class
subclass of: Restriction
  on property: member of
  some values from: herbicides based on amides and anilides [H03]
IAO_0000115: The chemical class 'anilide herbicides' (harmonised classification of substances code H03_02), a member of the category of products 'herbicides based on amides and anilides' in the harmonised classification of substances of annex III of Regulation (EU) 2017/269 concerning statistics on pesticides in the EU.
IAO_0000117: Michael Rubinigg
IAO_0000118: Anilid-Herbizide @de
IAO_0000118: anilide herbicides
id: EUPH:3064
denoted by: //app.pollinatorhub.eu/vocabulary/classes/8165) the category of products 'herbicides based on amides and anilides' in the harmonised classification of substances of annex III of Regulation (EU) 2017/269 concerning statistics on pesticides in the EU.

Axiom
annotated source: anilide herbicides [H03_02]
annotated property: IAO_0000115
annotated target: The chemical class 'anilide herbicides' (harmonised classification of substances code H03_02), a member of the category of products 'herbicides based on amides and anilides' in the harmonised classification of substances of annex III of Regulation (EU) 2017/269 concerning statistics on pesticides in the EU.
source: https://eur-lex.europa.eu/eli/reg/2017/269/oj

Axiom
annotated source: anilide herbicides [H03_02]
annotated property: denoted by
annotated target: //app.pollinatorhub.eu/vocabulary/classes/8165) the category of products 'herbicides based on amides and anilides' in the harmonised classification of substances of annex III of Regulation (EU) 2017/269 concerning statistics on pesticides in the EU.
has db xref: harmonised classification of substances code

chloroacetanilide herbicides [H03_03]
type: Class
subclass of: harmonised classification of substances chemical class
subclass of: Restriction
  on property: member of
  some values from: herbicides based on amides and anilides [H03]
IAO_0000115: The chemical class 'chloroacetanilide herbicides' (harmonised classification of substances code H03_03), a member of the category of products 'herbicides based on amides and anilides' in the harmonised classification of substances of annex III of Regulation (EU) 2017/269 concerning statistics on pesticides in the EU.
IAO_0000117: Michael Rubinigg
IAO_0000118: Chloracetanilid-Herbizide @de
IAO_0000118: chloroacetanilide herbicides
id: EUPH:3065
denoted by: //app.pollinatorhub.eu/vocabulary/classes/8165) the category of products 'herbicides based on amides and anilides' in the harmonised classification of substances of annex III of Regulation (EU) 2017/269 concerning statistics on pesticides in the EU.

Axiom
annotated source: chloroacetanilide herbicides [H03_03]
annotated property: IAO_0000115
annotated target: The chemical class 'chloroacetanilide herbicides' (harmonised classification of substances code H03_03), a member of the category of products 'herbicides based on amides and anilides' in the harmonised classification of substances of annex III of Regulation (EU) 2017/269 concerning statistics on pesticides in the EU.
source: https://eur-lex.europa.eu/eli/reg/2017/269/oj

Axiom
annotated source: chloroacetanilide herbicides [H03_03]
annotated property: denoted by
annotated target: //app.pollinatorhub.eu/vocabulary/classes/8165) the category of products 'herbicides based on amides and anilides' in the harmonised classification of substances of annex III of Regulation (EU) 2017/269 concerning statistics on pesticides in the EU.
has db xref: harmonised classification of substances code

other herbicides based on amides and anilides [H03_99]
type: Class
subclass of: harmonised classification of substances chemical class
subclass of: Restriction
  on property: member of
  some values from: herbicides based on amides and anilides [H03]
IAO_0000115: The chemical class 'other herbicides based on amides and anilides' (harmonised classification of substances code H03_99), a member of the category of products 'herbicides based on amides and anilides' in the harmonised classification of substances of annex III of Regulation (EU) 2017/269 concerning statistics on pesticides in the EU.
IAO_0000117: Michael Rubinigg
IAO_0000118: other herbicides based on amides and anilides
IAO_0000118: sonstige von Amiden und Aniliden abgeleitete Herbizide @de
id: EUPH:3066
denoted by: //app.pollinatorhub.eu/vocabulary/classes/8165) the category of products 'herbicides based on amides and anilides' in the harmonised classification of substances of annex III of Regulation (EU) 2017/269 concerning statistics on pesticides in the EU.

Axiom
annotated source: other herbicides based on amides and anilides [H03_99]
annotated property: IAO_0000115
annotated target: The chemical class 'other herbicides based on amides and anilides' (harmonised classification of substances code H03_99), a member of the category of products 'herbicides based on amides and anilides' in the harmonised classification of substances of annex III of Regulation (EU) 2017/269 concerning statistics on pesticides in the EU.
source: https://eur-lex.europa.eu/eli/reg/2017/269/oj

Axiom
annotated source: other herbicides based on amides and anilides [H03_99]
annotated property: denoted by
annotated target: //app.pollinatorhub.eu/vocabulary/classes/8165) the category of products 'herbicides based on amides and anilides' in the harmonised classification of substances of annex III of Regulation (EU) 2017/269 concerning statistics on pesticides in the EU.
has db xref: harmonised classification of substances code

herbicides based on carbamates and bis-carbamates [H04]
type: Class
subclass of: harmonised classification of substances categories of products
subclass of: Restriction
  on property: member of
  some values from: herbicides, haulm destructors and moss killers [PES_H]
IAO_0000115: The category of products 'herbicides based on carbamates and bis-carbamates' (harmonised classification of substances code H04), a member of the major group 'herbicides, haulm destructors and moss killers' in the harmonised classification of substances of annex III of Regulation (EU) 2017/269 concerning statistics on pesticides in the EU.
IAO_0000117: Michael Rubinigg
IAO_0000118: herbicides based on carbamates and bis-carbamates
IAO_0000118: von Carbamaten und Biscarbamaten abgeleitete Herbizide @de
id: EUPH:3067
denoted by: //app.pollinatorhub.eu/vocabulary/classes/8165) the major group 'herbicides, haulm destructors and moss killers' in the harmonised classification of substances of annex III of Regulation (EU) 2017/269 concerning statistics on pesticides in the EU.

Axiom
annotated source: herbicides based on carbamates and bis-carbamates [H04]
annotated property: IAO_0000115
annotated target: The category of products 'herbicides based on carbamates and bis-carbamates' (harmonised classification of substances code H04), a member of the major group 'herbicides, haulm destructors and moss killers' in the harmonised classification of substances of annex III of Regulation (EU) 2017/269 concerning statistics on pesticides in the EU.
source: https://eur-lex.europa.eu/eli/reg/2017/269/oj

Axiom
annotated source: herbicides based on carbamates and bis-carbamates [H04]
annotated property: denoted by
annotated target: //app.pollinatorhub.eu/vocabulary/classes/8165) the major group 'herbicides, haulm destructors and moss killers' in the harmonised classification of substances of annex III of Regulation (EU) 2017/269 concerning statistics on pesticides in the EU.
has db xref: harmonised classification of substances code

bis-carbamate herbicides [H04_01]
type: Class
subclass of: harmonised classification of substances chemical class
subclass of: Restriction
  on property: member of
  some values from: herbicides based on carbamates and bis-carbamates [H04]
IAO_0000115: The chemical class 'bis-carbamate herbicides' (harmonised classification of substances code H04_01), a member of the category of products 'herbicides based on carbamates and bis-carbamates' in the harmonised classification of substances of annex III of Regulation (EU) 2017/269 concerning statistics on pesticides in the EU.
IAO_0000117: Michael Rubinigg
IAO_0000118: Biscarbamat-Herbizide @de
IAO_0000118: bis-carbamate herbicides
id: EUPH:3068
denoted by: //app.pollinatorhub.eu/vocabulary/classes/8165) the category of products 'herbicides based on carbamates and bis-carbamates' in the harmonised classification of substances of annex III of Regulation (EU) 2017/269 concerning statistics on pesticides in the EU.

Axiom
annotated source: bis-carbamate herbicides [H04_01]
annotated property: IAO_0000115
annotated target: The chemical class 'bis-carbamate herbicides' (harmonised classification of substances code H04_01), a member of the category of products 'herbicides based on carbamates and bis-carbamates' in the harmonised classification of substances of annex III of Regulation (EU) 2017/269 concerning statistics on pesticides in the EU.
source: https://eur-lex.europa.eu/eli/reg/2017/269/oj

Axiom
annotated source: bis-carbamate herbicides [H04_01]
annotated property: denoted by
annotated target: //app.pollinatorhub.eu/vocabulary/classes/8165) the category of products 'herbicides based on carbamates and bis-carbamates' in the harmonised classification of substances of annex III of Regulation (EU) 2017/269 concerning statistics on pesticides in the EU.
has db xref: harmonised classification of substances code

carbamate herbicides [H04_02]
type: Class
subclass of: harmonised classification of substances chemical class
subclass of: Restriction
  on property: member of
  some values from: herbicides based on carbamates and bis-carbamates [H04]
IAO_0000115: The chemical class 'carbamate herbicides' (harmonised classification of substances code H04_02), a member of the category of products 'herbicides based on carbamates and bis-carbamates' in the harmonised classification of substances of annex III of Regulation (EU) 2017/269 concerning statistics on pesticides in the EU.
IAO_0000117: Michael Rubinigg
IAO_0000118: Carbamat-Herbizide @de
IAO_0000118: carbamate herbicides
id: EUPH:3069
denoted by: //app.pollinatorhub.eu/vocabulary/classes/8165) the category of products 'herbicides based on carbamates and bis-carbamates' in the harmonised classification of substances of annex III of Regulation (EU) 2017/269 concerning statistics on pesticides in the EU.

Axiom
annotated source: carbamate herbicides [H04_02]
annotated property: IAO_0000115
annotated target: The chemical class 'carbamate herbicides' (harmonised classification of substances code H04_02), a member of the category of products 'herbicides based on carbamates and bis-carbamates' in the harmonised classification of substances of annex III of Regulation (EU) 2017/269 concerning statistics on pesticides in the EU.
source: https://eur-lex.europa.eu/eli/reg/2017/269/oj

Axiom
annotated source: carbamate herbicides [H04_02]
annotated property: denoted by
annotated target: //app.pollinatorhub.eu/vocabulary/classes/8165) the category of products 'herbicides based on carbamates and bis-carbamates' in the harmonised classification of substances of annex III of Regulation (EU) 2017/269 concerning statistics on pesticides in the EU.
has db xref: harmonised classification of substances code

other herbicides based on carbamates and bis-carbamates [H04_99]
type: Class
subclass of: harmonised classification of substances chemical class
subclass of: Restriction
  on property: member of
  some values from: herbicides based on carbamates and bis-carbamates [H04]
IAO_0000115: The chemical class 'other herbicides based on carbamates and bis-carbamates' (harmonised classification of substances code H04_99), a member of the category of products 'herbicides based on carbamates and bis-carbamates' in the harmonised classification of substances of annex III of Regulation (EU) 2017/269 concerning statistics on pesticides in the EU.
IAO_0000117: Michael Rubinigg
IAO_0000118: other herbicides based on carbamates and bis-carbamates
IAO_0000118: sonstige von Carbamaten und Biscarbamaten abgeleitete Herbizide @de
id: EUPH:3070
denoted by: //app.pollinatorhub.eu/vocabulary/classes/8165) the category of products 'herbicides based on carbamates and bis-carbamates' in the harmonised classification of substances of annex III of Regulation (EU) 2017/269 concerning statistics on pesticides in the EU.

Axiom
annotated source: other herbicides based on carbamates and bis-carbamates [H04_99]
annotated property: IAO_0000115
annotated target: The chemical class 'other herbicides based on carbamates and bis-carbamates' (harmonised classification of substances code H04_99), a member of the category of products 'herbicides based on carbamates and bis-carbamates' in the harmonised classification of substances of annex III of Regulation (EU) 2017/269 concerning statistics on pesticides in the EU.
source: https://eur-lex.europa.eu/eli/reg/2017/269/oj

Axiom
annotated source: other herbicides based on carbamates and bis-carbamates [H04_99]
annotated property: denoted by
annotated target: //app.pollinatorhub.eu/vocabulary/classes/8165) the category of products 'herbicides based on carbamates and bis-carbamates' in the harmonised classification of substances of annex III of Regulation (EU) 2017/269 concerning statistics on pesticides in the EU.
has db xref: harmonised classification of substances code

herbicides based on dinitroaniline derivatives [H05]
type: Class
subclass of: harmonised classification of substances categories of products
subclass of: Restriction
  on property: member of
  some values from: herbicides, haulm destructors and moss killers [PES_H]
IAO_0000115: The category of products 'herbicides based on dinitroaniline derivatives' (harmonised classification of substances code H05), a member of the major group 'herbicides, haulm destructors and moss killers' in the harmonised classification of substances of annex III of Regulation (EU) 2017/269 concerning statistics on pesticides in the EU.
IAO_0000117: Michael Rubinigg
IAO_0000118: herbicides based on dinitroaniline derivatives
IAO_0000118: von Dinitroanilinderivaten abgeleitete Herbizide @de
id: EUPH:3071
denoted by: //app.pollinatorhub.eu/vocabulary/classes/8165) the major group 'herbicides, haulm destructors and moss killers' in the harmonised classification of substances of annex III of Regulation (EU) 2017/269 concerning statistics on pesticides in the EU.

Axiom
annotated source: herbicides based on dinitroaniline derivatives [H05]
annotated property: IAO_0000115
annotated target: The category of products 'herbicides based on dinitroaniline derivatives' (harmonised classification of substances code H05), a member of the major group 'herbicides, haulm destructors and moss killers' in the harmonised classification of substances of annex III of Regulation (EU) 2017/269 concerning statistics on pesticides in the EU.
source: https://eur-lex.europa.eu/eli/reg/2017/269/oj

Axiom
annotated source: herbicides based on dinitroaniline derivatives [H05]
annotated property: denoted by
annotated target: //app.pollinatorhub.eu/vocabulary/classes/8165) the major group 'herbicides, haulm destructors and moss killers' in the harmonised classification of substances of annex III of Regulation (EU) 2017/269 concerning statistics on pesticides in the EU.
has db xref: harmonised classification of substances code

dinitroaniline herbicides [H05_01]
type: Class
subclass of: harmonised classification of substances chemical class
subclass of: Restriction
  on property: member of
  some values from: herbicides based on dinitroaniline derivatives [H05]
IAO_0000115: The chemical class 'dinitroaniline herbicides' (harmonised classification of substances code H05_01), a member of the category of products 'herbicides based on dinitroaniline derivatives' in the harmonised classification of substances of annex III of Regulation (EU) 2017/269 concerning statistics on pesticides in the EU.
IAO_0000117: Michael Rubinigg
IAO_0000118: Dinitroanilin-Herbizide @de
IAO_0000118: dinitroaniline herbicides
id: EUPH:3072
denoted by: //app.pollinatorhub.eu/vocabulary/classes/8165) the category of products 'herbicides based on dinitroaniline derivatives' in the harmonised classification of substances of annex III of Regulation (EU) 2017/269 concerning statistics on pesticides in the EU.

Axiom
annotated source: dinitroaniline herbicides [H05_01]
annotated property: IAO_0000115
annotated target: The chemical class 'dinitroaniline herbicides' (harmonised classification of substances code H05_01), a member of the category of products 'herbicides based on dinitroaniline derivatives' in the harmonised classification of substances of annex III of Regulation (EU) 2017/269 concerning statistics on pesticides in the EU.
source: https://eur-lex.europa.eu/eli/reg/2017/269/oj

Axiom
annotated source: dinitroaniline herbicides [H05_01]
annotated property: denoted by
annotated target: //app.pollinatorhub.eu/vocabulary/classes/8165) the category of products 'herbicides based on dinitroaniline derivatives' in the harmonised classification of substances of annex III of Regulation (EU) 2017/269 concerning statistics on pesticides in the EU.
has db xref: harmonised classification of substances code

other herbicides based on dinitroaniline drivatives [H05_99]
type: Class
subclass of: harmonised classification of substances chemical class
subclass of: Restriction
  on property: member of
  some values from: herbicides based on dinitroaniline derivatives [H05]
IAO_0000115: The chemical class 'other herbicides based on dinitroaniline drivatives' (harmonised classification of substances code H05_99), a member of the category of products 'herbicides based on dinitroaniline derivatives' in the harmonised classification of substances of annex III of Regulation (EU) 2017/269 concerning statistics on pesticides in the EU.
IAO_0000117: Michael Rubinigg
IAO_0000118: andere auf Dinitroanilin-Derivaten basierende Herbizide @de
IAO_0000118: other herbicides based on dinitroaniline drivatives
id: EUPH:3073
denoted by: //app.pollinatorhub.eu/vocabulary/classes/8165) the category of products 'herbicides based on dinitroaniline derivatives' in the harmonised classification of substances of annex III of Regulation (EU) 2017/269 concerning statistics on pesticides in the EU.

Axiom
annotated source: other herbicides based on dinitroaniline drivatives [H05_99]
annotated property: IAO_0000115
annotated target: The chemical class 'other herbicides based on dinitroaniline drivatives' (harmonised classification of substances code H05_99), a member of the category of products 'herbicides based on dinitroaniline derivatives' in the harmonised classification of substances of annex III of Regulation (EU) 2017/269 concerning statistics on pesticides in the EU.
source: https://eur-lex.europa.eu/eli/reg/2017/269/oj

Axiom
annotated source: other herbicides based on dinitroaniline drivatives [H05_99]
annotated property: denoted by
annotated target: //app.pollinatorhub.eu/vocabulary/classes/8165) the category of products 'herbicides based on dinitroaniline derivatives' in the harmonised classification of substances of annex III of Regulation (EU) 2017/269 concerning statistics on pesticides in the EU.
has db xref: harmonised classification of substances code

herbicides based on derivatives of urea, of uracil or of sulfonylurea [H06]
type: Class
subclass of: harmonised classification of substances categories of products
subclass of: Restriction
  on property: member of
  some values from: herbicides, haulm destructors and moss killers [PES_H]
IAO_0000115: The category of products 'herbicides based on derivatives of urea, of uracil or of sulfonylurea' (harmonised classification of substances code H06), a member of the major group 'herbicides, haulm destructors and moss killers' in the harmonised classification of substances of annex III of Regulation (EU) 2017/269 concerning statistics on pesticides in the EU.
IAO_0000117: Michael Rubinigg
IAO_0000118: herbicides based on derivatives of urea, of uracil or of sulfonylurea
IAO_0000118: von Harnstoff-, Uracil- oder Sulfonylharnstoffderivaten abgeleitete Herbizide @de
id: EUPH:3074
denoted by: //app.pollinatorhub.eu/vocabulary/classes/8165) the major group 'herbicides, haulm destructors and moss killers' in the harmonised classification of substances of annex III of Regulation (EU) 2017/269 concerning statistics on pesticides in the EU.

Axiom
annotated source: herbicides based on derivatives of urea, of uracil or of sulfonylurea [H06]
annotated property: IAO_0000115
annotated target: The category of products 'herbicides based on derivatives of urea, of uracil or of sulfonylurea' (harmonised classification of substances code H06), a member of the major group 'herbicides, haulm destructors and moss killers' in the harmonised classification of substances of annex III of Regulation (EU) 2017/269 concerning statistics on pesticides in the EU.
source: https://eur-lex.europa.eu/eli/reg/2017/269/oj

Axiom
annotated source: herbicides based on derivatives of urea, of uracil or of sulfonylurea [H06]
annotated property: denoted by
annotated target: //app.pollinatorhub.eu/vocabulary/classes/8165) the major group 'herbicides, haulm destructors and moss killers' in the harmonised classification of substances of annex III of Regulation (EU) 2017/269 concerning statistics on pesticides in the EU.
has db xref: harmonised classification of substances code

sulfonylurea herbicides [H06_01]
type: Class
subclass of: harmonised classification of substances chemical class
subclass of: Restriction
  on property: member of
  some values from: herbicides based on derivatives of urea, of uracil or of sulfonylurea [H06]
IAO_0000115: The chemical class 'sulfonylurea herbicides' (harmonised classification of substances code H06_01), a member of the category of products 'herbicides based on derivatives of urea, of uracil or of sulfonylurea ' in the harmonised classification of substances of annex III of Regulation (EU) 2017/269 concerning statistics on pesticides in the EU.
IAO_0000117: Michael Rubinigg
IAO_0000118: Sulfonylharnstoff-Herbizide @de
IAO_0000118: erbicidi sulfonilureici @it
IAO_0000118: sulfonylurea herbicides
id: EUPH:3075
denoted by: //app.pollinatorhub.eu/vocabulary/classes/8165) the category of products 'herbicides based on derivatives of urea, of uracil or of sulfonylurea ' in the harmonised classification of substances of annex III of Regulation (EU) 2017/269 concerning statistics on pesticides in the EU.

Axiom
annotated source: sulfonylurea herbicides [H06_01]
annotated property: IAO_0000115
annotated target: The chemical class 'sulfonylurea herbicides' (harmonised classification of substances code H06_01), a member of the category of products 'herbicides based on derivatives of urea, of uracil or of sulfonylurea ' in the harmonised classification of substances of annex III of Regulation (EU) 2017/269 concerning statistics on pesticides in the EU.
source: https://eur-lex.europa.eu/eli/reg/2017/269/oj

Axiom
annotated source: sulfonylurea herbicides [H06_01]
annotated property: denoted by
annotated target: //app.pollinatorhub.eu/vocabulary/classes/8165) the category of products 'herbicides based on derivatives of urea, of uracil or of sulfonylurea ' in the harmonised classification of substances of annex III of Regulation (EU) 2017/269 concerning statistics on pesticides in the EU.
has db xref: harmonised classification of substances code

uracil herbicides [H06_02]
type: Class
subclass of: harmonised classification of substances chemical class
subclass of: Restriction
  on property: member of
  some values from: herbicides based on derivatives of urea, of uracil or of sulfonylurea [H06]
IAO_0000115: The chemical class 'uracil herbicides' (harmonised classification of substances code H06_02), a member of the category of products 'herbicides based on derivatives of urea, of uracil or of sulfonylurea ' in the harmonised classification of substances of annex III of Regulation (EU) 2017/269 concerning statistics on pesticides in the EU.
IAO_0000117: Michael Rubinigg
IAO_0000118: Uracil-Herbizide @de
IAO_0000118: erbicidi uracilici @it
IAO_0000118: uracil herbicides
id: EUPH:3076
denoted by: //app.pollinatorhub.eu/vocabulary/classes/8165) the category of products 'herbicides based on derivatives of urea, of uracil or of sulfonylurea ' in the harmonised classification of substances of annex III of Regulation (EU) 2017/269 concerning statistics on pesticides in the EU.

Axiom
annotated source: uracil herbicides [H06_02]
annotated property: IAO_0000115
annotated target: The chemical class 'uracil herbicides' (harmonised classification of substances code H06_02), a member of the category of products 'herbicides based on derivatives of urea, of uracil or of sulfonylurea ' in the harmonised classification of substances of annex III of Regulation (EU) 2017/269 concerning statistics on pesticides in the EU.
source: https://eur-lex.europa.eu/eli/reg/2017/269/oj

Axiom
annotated source: uracil herbicides [H06_02]
annotated property: denoted by
annotated target: //app.pollinatorhub.eu/vocabulary/classes/8165) the category of products 'herbicides based on derivatives of urea, of uracil or of sulfonylurea ' in the harmonised classification of substances of annex III of Regulation (EU) 2017/269 concerning statistics on pesticides in the EU.
has db xref: harmonised classification of substances code

urea herbicides [H06_03]
type: Class
subclass of: harmonised classification of substances chemical class
subclass of: Restriction
  on property: member of
  some values from: herbicides based on derivatives of urea, of uracil or of sulfonylurea [H06]
IAO_0000115: The chemical class 'urea herbicides' (harmonised classification of substances code H06_03), a member of the category of products 'herbicides based on derivatives of urea, of uracil or of sulfonylurea ' in the harmonised classification of substances of annex III of Regulation (EU) 2017/269 concerning statistics on pesticides in the EU.
IAO_0000117: Michael Rubinigg
IAO_0000118: Harnstoff-Herbizide @de
IAO_0000118: urea herbicides
id: EUPH:3077
denoted by: //app.pollinatorhub.eu/vocabulary/classes/8165) the category of products 'herbicides based on derivatives of urea, of uracil or of sulfonylurea ' in the harmonised classification of substances of annex III of Regulation (EU) 2017/269 concerning statistics on pesticides in the EU.

Axiom
annotated source: urea herbicides [H06_03]
annotated property: IAO_0000115
annotated target: The chemical class 'urea herbicides' (harmonised classification of substances code H06_03), a member of the category of products 'herbicides based on derivatives of urea, of uracil or of sulfonylurea ' in the harmonised classification of substances of annex III of Regulation (EU) 2017/269 concerning statistics on pesticides in the EU.
source: https://eur-lex.europa.eu/eli/reg/2017/269/oj

Axiom
annotated source: urea herbicides [H06_03]
annotated property: denoted by
annotated target: //app.pollinatorhub.eu/vocabulary/classes/8165) the category of products 'herbicides based on derivatives of urea, of uracil or of sulfonylurea ' in the harmonised classification of substances of annex III of Regulation (EU) 2017/269 concerning statistics on pesticides in the EU.
has db xref: harmonised classification of substances code

other herbicides based on derivatives of urea, of uracil or of sulfonylurea [H06_99]
type: Class
subclass of: harmonised classification of substances chemical class
subclass of: Restriction
  on property: member of
  some values from: herbicides based on derivatives of urea, of uracil or of sulfonylurea [H06]
IAO_0000115: The chemical class 'other herbicides based on derivatives of urea, of uracil or of sulfonylurea' (harmonised classification of substances code H06_99), a member of the category of products 'herbicides based on derivatives of urea, of uracil or of sulfonylurea ' in the harmonised classification of substances of annex III of Regulation (EU) 2017/269 concerning statistics on pesticides in the EU.
IAO_0000117: Michael Rubinigg
IAO_0000118: other herbicides based on derivatives of urea, of uracil or of sulfonylurea
IAO_0000118: sonstige von Harnstoff-, Uracil- oder Sulfonyl- Harnstoffderivaten abgeleitete Herbizide @de
id: EUPH:3078
denoted by: //app.pollinatorhub.eu/vocabulary/classes/8165) the category of products 'herbicides based on derivatives of urea, of uracil or of sulfonylurea ' in the harmonised classification of substances of annex III of Regulation (EU) 2017/269 concerning statistics on pesticides in the EU.

Axiom
annotated source: other herbicides based on derivatives of urea, of uracil or of sulfonylurea [H06_99]
annotated property: IAO_0000115
annotated target: The chemical class 'other herbicides based on derivatives of urea, of uracil or of sulfonylurea' (harmonised classification of substances code H06_99), a member of the category of products 'herbicides based on derivatives of urea, of uracil or of sulfonylurea ' in the harmonised classification of substances of annex III of Regulation (EU) 2017/269 concerning statistics on pesticides in the EU.
source: https://eur-lex.europa.eu/eli/reg/2017/269/oj

Axiom
annotated source: other herbicides based on derivatives of urea, of uracil or of sulfonylurea [H06_99]
annotated property: denoted by
annotated target: //app.pollinatorhub.eu/vocabulary/classes/8165) the category of products 'herbicides based on derivatives of urea, of uracil or of sulfonylurea ' in the harmonised classification of substances of annex III of Regulation (EU) 2017/269 concerning statistics on pesticides in the EU.
has db xref: harmonised classification of substances code

other herbicides [H99]
type: Class
subclass of: harmonised classification of substances categories of products
subclass of: Restriction
  on property: member of
  some values from: herbicides, haulm destructors and moss killers [PES_H]
IAO_0000115: The category of products 'other herbicides' (harmonised classification of substances code H99), a member of the major group 'herbicides, haulm destructors and moss killers' in the harmonised classification of substances of annex III of Regulation (EU) 2017/269 concerning statistics on pesticides in the EU.
IAO_0000117: Michael Rubinigg
IAO_0000118: other herbicides
IAO_0000118: sonstige Herbizide @de
id: EUPH:3079
denoted by: //app.pollinatorhub.eu/vocabulary/classes/8165) the major group 'herbicides, haulm destructors and moss killers' in the harmonised classification of substances of annex III of Regulation (EU) 2017/269 concerning statistics on pesticides in the EU.

Axiom
annotated source: other herbicides [H99]
annotated property: IAO_0000115
annotated target: The category of products 'other herbicides' (harmonised classification of substances code H99), a member of the major group 'herbicides, haulm destructors and moss killers' in the harmonised classification of substances of annex III of Regulation (EU) 2017/269 concerning statistics on pesticides in the EU.
source: https://eur-lex.europa.eu/eli/reg/2017/269/oj

Axiom
annotated source: other herbicides [H99]
annotated property: denoted by
annotated target: //app.pollinatorhub.eu/vocabulary/classes/8165) the major group 'herbicides, haulm destructors and moss killers' in the harmonised classification of substances of annex III of Regulation (EU) 2017/269 concerning statistics on pesticides in the EU.
has db xref: harmonised classification of substances code

aryloxyphenoxy-propionic herbicides [H99_01]
type: Class
subclass of: harmonised classification of substances chemical class
subclass of: Restriction
  on property: member of
  some values from: other herbicides [H99]
IAO_0000115: The chemical class 'aryloxyphenoxy-propionic herbicides' (harmonised classification of substances code H99_01), a member of the category of products 'other herbicides' in the harmonised classification of substances of annex III of Regulation (EU) 2017/269 concerning statistics on pesticides in the EU.
IAO_0000117: Michael Rubinigg
IAO_0000118: Aryloxyphenoxypropion-Herbizide @de
IAO_0000118: aryloxyphenoxy-propionic herbicides
id: EUPH:3080
denoted by: //app.pollinatorhub.eu/vocabulary/classes/8165) the category of products 'other herbicides' in the harmonised classification of substances of annex III of Regulation (EU) 2017/269 concerning statistics on pesticides in the EU.

Axiom
annotated source: aryloxyphenoxy-propionic herbicides [H99_01]
annotated property: IAO_0000115
annotated target: The chemical class 'aryloxyphenoxy-propionic herbicides' (harmonised classification of substances code H99_01), a member of the category of products 'other herbicides' in the harmonised classification of substances of annex III of Regulation (EU) 2017/269 concerning statistics on pesticides in the EU.
source: https://eur-lex.europa.eu/eli/reg/2017/269/oj

Axiom
annotated source: aryloxyphenoxy-propionic herbicides [H99_01]
annotated property: denoted by
annotated target: //app.pollinatorhub.eu/vocabulary/classes/8165) the category of products 'other herbicides' in the harmonised classification of substances of annex III of Regulation (EU) 2017/269 concerning statistics on pesticides in the EU.
has db xref: harmonised classification of substances code

benzofurane herbicides [H99_02]
type: Class
subclass of: harmonised classification of substances chemical class
subclass of: Restriction
  on property: member of
  some values from: other herbicides [H99]
IAO_0000115: The chemical class 'benzofurane herbicides' (harmonised classification of substances code H99_02), a member of the category of products 'other herbicides' in the harmonised classification of substances of annex III of Regulation (EU) 2017/269 concerning statistics on pesticides in the EU.
IAO_0000117: Michael Rubinigg
IAO_0000118: Benzofuran-Herbizide @de
IAO_0000118: benzofurane herbicides
id: EUPH:3081
denoted by: //app.pollinatorhub.eu/vocabulary/classes/8165) the category of products 'other herbicides' in the harmonised classification of substances of annex III of Regulation (EU) 2017/269 concerning statistics on pesticides in the EU.

Axiom
annotated source: benzofurane herbicides [H99_02]
annotated property: IAO_0000115
annotated target: The chemical class 'benzofurane herbicides' (harmonised classification of substances code H99_02), a member of the category of products 'other herbicides' in the harmonised classification of substances of annex III of Regulation (EU) 2017/269 concerning statistics on pesticides in the EU.
source: https://eur-lex.europa.eu/eli/reg/2017/269/oj

Axiom
annotated source: benzofurane herbicides [H99_02]
annotated property: denoted by
annotated target: //app.pollinatorhub.eu/vocabulary/classes/8165) the category of products 'other herbicides' in the harmonised classification of substances of annex III of Regulation (EU) 2017/269 concerning statistics on pesticides in the EU.
has db xref: harmonised classification of substances code

benzoic-acid herbicides [H99_03]
type: Class
subclass of: harmonised classification of substances chemical class
subclass of: Restriction
  on property: member of
  some values from: other herbicides [H99]
IAO_0000115: The chemical class 'benzoic-acid herbicides' (harmonised classification of substances code H99_03), a member of the category of products 'other herbicides' in the harmonised classification of substances of annex III of Regulation (EU) 2017/269 concerning statistics on pesticides in the EU.
IAO_0000117: Michael Rubinigg
IAO_0000118: Benzoesäure-Herbizide @de
IAO_0000118: benzoic-acid herbicides
id: EUPH:3082
denoted by: //app.pollinatorhub.eu/vocabulary/classes/8165) the category of products 'other herbicides' in the harmonised classification of substances of annex III of Regulation (EU) 2017/269 concerning statistics on pesticides in the EU.

Axiom
annotated source: benzoic-acid herbicides [H99_03]
annotated property: IAO_0000115
annotated target: The chemical class 'benzoic-acid herbicides' (harmonised classification of substances code H99_03), a member of the category of products 'other herbicides' in the harmonised classification of substances of annex III of Regulation (EU) 2017/269 concerning statistics on pesticides in the EU.
source: https://eur-lex.europa.eu/eli/reg/2017/269/oj

Axiom
annotated source: benzoic-acid herbicides [H99_03]
annotated property: denoted by
annotated target: //app.pollinatorhub.eu/vocabulary/classes/8165) the category of products 'other herbicides' in the harmonised classification of substances of annex III of Regulation (EU) 2017/269 concerning statistics on pesticides in the EU.
has db xref: harmonised classification of substances code

bipyridylium herbicides [H99_04]
type: Class
subclass of: harmonised classification of substances chemical class
subclass of: Restriction
  on property: member of
  some values from: other herbicides [H99]
IAO_0000115: The chemical class 'bipyridylium herbicides' (harmonised classification of substances code H99_04), a member of the category of products 'other herbicides' in the harmonised classification of substances of annex III of Regulation (EU) 2017/269 concerning statistics on pesticides in the EU.
IAO_0000117: Michael Rubinigg
IAO_0000118: Bipyridylium-Herbizide @de
IAO_0000118: bipyridylium herbicides
id: EUPH:3083
denoted by: //app.pollinatorhub.eu/vocabulary/classes/8165) the category of products 'other herbicides' in the harmonised classification of substances of annex III of Regulation (EU) 2017/269 concerning statistics on pesticides in the EU.

Axiom
annotated source: bipyridylium herbicides [H99_04]
annotated property: IAO_0000115
annotated target: The chemical class 'bipyridylium herbicides' (harmonised classification of substances code H99_04), a member of the category of products 'other herbicides' in the harmonised classification of substances of annex III of Regulation (EU) 2017/269 concerning statistics on pesticides in the EU.
source: https://eur-lex.europa.eu/eli/reg/2017/269/oj

Axiom
annotated source: bipyridylium herbicides [H99_04]
annotated property: denoted by
annotated target: //app.pollinatorhub.eu/vocabulary/classes/8165) the category of products 'other herbicides' in the harmonised classification of substances of annex III of Regulation (EU) 2017/269 concerning statistics on pesticides in the EU.
has db xref: harmonised classification of substances code

cyclohexanedione herbicides [H99_05]
type: Class
subclass of: harmonised classification of substances chemical class
subclass of: Restriction
  on property: member of
  some values from: other herbicides [H99]
IAO_0000115: The chemical class 'cyclohexanedione herbicides' (harmonised classification of substances code H99_05), a member of the category of products 'other herbicides' in the harmonised classification of substances of annex III of Regulation (EU) 2017/269 concerning statistics on pesticides in the EU.
IAO_0000117: Michael Rubinigg
IAO_0000118: Cyclohexandion-Herbizide @de
IAO_0000118: cyclohexanedione herbicides
id: EUPH:3084
denoted by: //app.pollinatorhub.eu/vocabulary/classes/8165) the category of products 'other herbicides' in the harmonised classification of substances of annex III of Regulation (EU) 2017/269 concerning statistics on pesticides in the EU.

Axiom
annotated source: cyclohexanedione herbicides [H99_05]
annotated property: IAO_0000115
annotated target: The chemical class 'cyclohexanedione herbicides' (harmonised classification of substances code H99_05), a member of the category of products 'other herbicides' in the harmonised classification of substances of annex III of Regulation (EU) 2017/269 concerning statistics on pesticides in the EU.
source: https://eur-lex.europa.eu/eli/reg/2017/269/oj

Axiom
annotated source: cyclohexanedione herbicides [H99_05]
annotated property: denoted by
annotated target: //app.pollinatorhub.eu/vocabulary/classes/8165) the category of products 'other herbicides' in the harmonised classification of substances of annex III of Regulation (EU) 2017/269 concerning statistics on pesticides in the EU.
has db xref: harmonised classification of substances code

diazine herbicides [H99_06]
type: Class
subclass of: harmonised classification of substances chemical class
subclass of: Restriction
  on property: member of
  some values from: other herbicides [H99]
IAO_0000115: The chemical class 'diazine herbicides' (harmonised classification of substances code H99_06), a member of the category of products 'other herbicides' in the harmonised classification of substances of annex III of Regulation (EU) 2017/269 concerning statistics on pesticides in the EU.
IAO_0000117: Michael Rubinigg
IAO_0000118: Diazin-Herbizide @de
IAO_0000118: diazine herbicides
id: EUPH:3085
denoted by: //app.pollinatorhub.eu/vocabulary/classes/8165) the category of products 'other herbicides' in the harmonised classification of substances of annex III of Regulation (EU) 2017/269 concerning statistics on pesticides in the EU.

Axiom
annotated source: diazine herbicides [H99_06]
annotated property: IAO_0000115
annotated target: The chemical class 'diazine herbicides' (harmonised classification of substances code H99_06), a member of the category of products 'other herbicides' in the harmonised classification of substances of annex III of Regulation (EU) 2017/269 concerning statistics on pesticides in the EU.
source: https://eur-lex.europa.eu/eli/reg/2017/269/oj

Axiom
annotated source: diazine herbicides [H99_06]
annotated property: denoted by
annotated target: //app.pollinatorhub.eu/vocabulary/classes/8165) the category of products 'other herbicides' in the harmonised classification of substances of annex III of Regulation (EU) 2017/269 concerning statistics on pesticides in the EU.
has db xref: harmonised classification of substances code

dicarboximide herbicides [H99_07]
type: Class
subclass of: harmonised classification of substances chemical class
subclass of: Restriction
  on property: member of
  some values from: other herbicides [H99]
IAO_0000115: The chemical class 'dicarboximide herbicides' (harmonised classification of substances code H99_07), a member of the category of products 'other herbicides' in the harmonised classification of substances of annex III of Regulation (EU) 2017/269 concerning statistics on pesticides in the EU.
IAO_0000117: Michael Rubinigg
IAO_0000118: Dicarboximid-Herbizide @de
IAO_0000118: dicarboximide herbicides
id: EUPH:3086
denoted by: //app.pollinatorhub.eu/vocabulary/classes/8165) the category of products 'other herbicides' in the harmonised classification of substances of annex III of Regulation (EU) 2017/269 concerning statistics on pesticides in the EU.

Axiom
annotated source: dicarboximide herbicides [H99_07]
annotated property: IAO_0000115
annotated target: The chemical class 'dicarboximide herbicides' (harmonised classification of substances code H99_07), a member of the category of products 'other herbicides' in the harmonised classification of substances of annex III of Regulation (EU) 2017/269 concerning statistics on pesticides in the EU.
source: https://eur-lex.europa.eu/eli/reg/2017/269/oj

Axiom
annotated source: dicarboximide herbicides [H99_07]
annotated property: denoted by
annotated target: //app.pollinatorhub.eu/vocabulary/classes/8165) the category of products 'other herbicides' in the harmonised classification of substances of annex III of Regulation (EU) 2017/269 concerning statistics on pesticides in the EU.
has db xref: harmonised classification of substances code

diphenyl ether herbicides [H99_08]
type: Class
subclass of: harmonised classification of substances chemical class
subclass of: Restriction
  on property: member of
  some values from: other herbicides [H99]
IAO_0000115: The chemical class 'diphenyl ether herbicides' (harmonised classification of substances code H99_08), a member of the category of products 'other herbicides' in the harmonised classification of substances of annex III of Regulation (EU) 2017/269 concerning statistics on pesticides in the EU.
IAO_0000117: Michael Rubinigg
IAO_0000118: Diphenylether-Herbizide @de
IAO_0000118: diphenyl ether herbicides
id: EUPH:3087
denoted by: //app.pollinatorhub.eu/vocabulary/classes/8165) the category of products 'other herbicides' in the harmonised classification of substances of annex III of Regulation (EU) 2017/269 concerning statistics on pesticides in the EU.

Axiom
annotated source: diphenyl ether herbicides [H99_08]
annotated property: IAO_0000115
annotated target: The chemical class 'diphenyl ether herbicides' (harmonised classification of substances code H99_08), a member of the category of products 'other herbicides' in the harmonised classification of substances of annex III of Regulation (EU) 2017/269 concerning statistics on pesticides in the EU.
source: https://eur-lex.europa.eu/eli/reg/2017/269/oj

Axiom
annotated source: diphenyl ether herbicides [H99_08]
annotated property: denoted by
annotated target: //app.pollinatorhub.eu/vocabulary/classes/8165) the category of products 'other herbicides' in the harmonised classification of substances of annex III of Regulation (EU) 2017/269 concerning statistics on pesticides in the EU.
has db xref: harmonised classification of substances code

imidazolinone herbicides [H99_09]
type: Class
subclass of: harmonised classification of substances chemical class
subclass of: Restriction
  on property: member of
  some values from: other herbicides [H99]
IAO_0000115: The chemical class 'imidazolinone herbicides' (harmonised classification of substances code H99_09), a member of the category of products 'other herbicides' in the harmonised classification of substances of annex III of Regulation (EU) 2017/269 concerning statistics on pesticides in the EU.
IAO_0000117: Michael Rubinigg
IAO_0000118: Imidazolinon-Herbizide @de
IAO_0000118: imidazolinone herbicides
id: EUPH:3088
denoted by: //app.pollinatorhub.eu/vocabulary/classes/8165) the category of products 'other herbicides' in the harmonised classification of substances of annex III of Regulation (EU) 2017/269 concerning statistics on pesticides in the EU.

Axiom
annotated source: imidazolinone herbicides [H99_09]
annotated property: IAO_0000115
annotated target: The chemical class 'imidazolinone herbicides' (harmonised classification of substances code H99_09), a member of the category of products 'other herbicides' in the harmonised classification of substances of annex III of Regulation (EU) 2017/269 concerning statistics on pesticides in the EU.
source: https://eur-lex.europa.eu/eli/reg/2017/269/oj

Axiom
annotated source: imidazolinone herbicides [H99_09]
annotated property: denoted by
annotated target: //app.pollinatorhub.eu/vocabulary/classes/8165) the category of products 'other herbicides' in the harmonised classification of substances of annex III of Regulation (EU) 2017/269 concerning statistics on pesticides in the EU.
has db xref: harmonised classification of substances code

inorganic herbicides [H99_10]
type: Class
subclass of: harmonised classification of substances chemical class
subclass of: Restriction
  on property: member of
  some values from: other herbicides [H99]
IAO_0000115: The chemical class 'inorganic herbicides' (harmonised classification of substances code H99_10), a member of the category of products 'other herbicides' in the harmonised classification of substances of annex III of Regulation (EU) 2017/269 concerning statistics on pesticides in the EU.
IAO_0000117: Michael Rubinigg
IAO_0000118: Anorganische Herbizide @de
IAO_0000118: inorganic herbicides
id: EUPH:3089
denoted by: //app.pollinatorhub.eu/vocabulary/classes/8165) the category of products 'other herbicides' in the harmonised classification of substances of annex III of Regulation (EU) 2017/269 concerning statistics on pesticides in the EU.

Axiom
annotated source: inorganic herbicides [H99_10]
annotated property: IAO_0000115
annotated target: The chemical class 'inorganic herbicides' (harmonised classification of substances code H99_10), a member of the category of products 'other herbicides' in the harmonised classification of substances of annex III of Regulation (EU) 2017/269 concerning statistics on pesticides in the EU.
source: https://eur-lex.europa.eu/eli/reg/2017/269/oj

Axiom
annotated source: inorganic herbicides [H99_10]
annotated property: denoted by
annotated target: //app.pollinatorhub.eu/vocabulary/classes/8165) the category of products 'other herbicides' in the harmonised classification of substances of annex III of Regulation (EU) 2017/269 concerning statistics on pesticides in the EU.
has db xref: harmonised classification of substances code

isoxazole herbicides [H99_11]
type: Class
subclass of: harmonised classification of substances chemical class
subclass of: Restriction
  on property: member of
  some values from: other herbicides [H99]
IAO_0000115: The chemical class 'isoxazole herbicides' (harmonised classification of substances code H99_11), a member of the category of products 'other herbicides' in the harmonised classification of substances of annex III of Regulation (EU) 2017/269 concerning statistics on pesticides in the EU.
IAO_0000117: Michael Rubinigg
IAO_0000118: Isoxazol-Herbizide @de
IAO_0000118: isoxazole herbicides
id: EUPH:3090
denoted by: //app.pollinatorhub.eu/vocabulary/classes/8165) the category of products 'other herbicides' in the harmonised classification of substances of annex III of Regulation (EU) 2017/269 concerning statistics on pesticides in the EU.

Axiom
annotated source: isoxazole herbicides [H99_11]
annotated property: IAO_0000115
annotated target: The chemical class 'isoxazole herbicides' (harmonised classification of substances code H99_11), a member of the category of products 'other herbicides' in the harmonised classification of substances of annex III of Regulation (EU) 2017/269 concerning statistics on pesticides in the EU.
source: https://eur-lex.europa.eu/eli/reg/2017/269/oj

Axiom
annotated source: isoxazole herbicides [H99_11]
annotated property: denoted by
annotated target: //app.pollinatorhub.eu/vocabulary/classes/8165) the category of products 'other herbicides' in the harmonised classification of substances of annex III of Regulation (EU) 2017/269 concerning statistics on pesticides in the EU.
has db xref: harmonised classification of substances code

nitrile herbicides [H99_13]
type: Class
subclass of: harmonised classification of substances chemical class
subclass of: Restriction
  on property: member of
  some values from: other herbicides [H99]
IAO_0000115: The chemical class 'nitrile herbicides' (harmonised classification of substances code H99_13), a member of the category of products 'other herbicides' in the harmonised classification of substances of annex III of Regulation (EU) 2017/269 concerning statistics on pesticides in the EU.
IAO_0000117: Michael Rubinigg
IAO_0000118: Nitril-Herbizide @de
IAO_0000118: nitrile herbicides
id: EUPH:3091
denoted by: //app.pollinatorhub.eu/vocabulary/classes/8165) the category of products 'other herbicides' in the harmonised classification of substances of annex III of Regulation (EU) 2017/269 concerning statistics on pesticides in the EU.

Axiom
annotated source: nitrile herbicides [H99_13]
annotated property: IAO_0000115
annotated target: The chemical class 'nitrile herbicides' (harmonised classification of substances code H99_13), a member of the category of products 'other herbicides' in the harmonised classification of substances of annex III of Regulation (EU) 2017/269 concerning statistics on pesticides in the EU.
source: https://eur-lex.europa.eu/eli/reg/2017/269/oj

Axiom
annotated source: nitrile herbicides [H99_13]
annotated property: denoted by
annotated target: //app.pollinatorhub.eu/vocabulary/classes/8165) the category of products 'other herbicides' in the harmonised classification of substances of annex III of Regulation (EU) 2017/269 concerning statistics on pesticides in the EU.
has db xref: harmonised classification of substances code

organophosphorous herbicides [H99_14]
type: Class
subclass of: harmonised classification of substances chemical class
subclass of: Restriction
  on property: member of
  some values from: other herbicides [H99]
IAO_0000115: The chemical class 'organophosphorous herbicides' (harmonised classification of substances code H99_14), a member of the category of products 'other herbicides' in the harmonised classification of substances of annex III of Regulation (EU) 2017/269 concerning statistics on pesticides in the EU.
IAO_0000117: Michael Rubinigg
IAO_0000118: Organophosphor-Herbizide @de
IAO_0000118: organophosphorous herbicides
id: EUPH:3092
denoted by: //app.pollinatorhub.eu/vocabulary/classes/8165) the category of products 'other herbicides' in the harmonised classification of substances of annex III of Regulation (EU) 2017/269 concerning statistics on pesticides in the EU.

Axiom
annotated source: organophosphorous herbicides [H99_14]
annotated property: IAO_0000115
annotated target: The chemical class 'organophosphorous herbicides' (harmonised classification of substances code H99_14), a member of the category of products 'other herbicides' in the harmonised classification of substances of annex III of Regulation (EU) 2017/269 concerning statistics on pesticides in the EU.
source: https://eur-lex.europa.eu/eli/reg/2017/269/oj

Axiom
annotated source: organophosphorous herbicides [H99_14]
annotated property: denoted by
annotated target: //app.pollinatorhub.eu/vocabulary/classes/8165) the category of products 'other herbicides' in the harmonised classification of substances of annex III of Regulation (EU) 2017/269 concerning statistics on pesticides in the EU.
has db xref: harmonised classification of substances code

phenylpyrazole herbicides [H99_15]
type: Class
subclass of: harmonised classification of substances chemical class
subclass of: Restriction
  on property: member of
  some values from: other herbicides [H99]
IAO_0000115: The chemical class 'phenylpyrazole herbicides' (harmonised classification of substances code H99_15), a member of the category of products 'other herbicides' in the harmonised classification of substances of annex III of Regulation (EU) 2017/269 concerning statistics on pesticides in the EU.
IAO_0000117: Michael Rubinigg
IAO_0000118: Phenylpyrazol-Herbizide @de
IAO_0000118: phenylpyrazole herbicides
id: EUPH:3093
denoted by: //app.pollinatorhub.eu/vocabulary/classes/8165) the category of products 'other herbicides' in the harmonised classification of substances of annex III of Regulation (EU) 2017/269 concerning statistics on pesticides in the EU.

Axiom
annotated source: phenylpyrazole herbicides [H99_15]
annotated property: IAO_0000115
annotated target: The chemical class 'phenylpyrazole herbicides' (harmonised classification of substances code H99_15), a member of the category of products 'other herbicides' in the harmonised classification of substances of annex III of Regulation (EU) 2017/269 concerning statistics on pesticides in the EU.
source: https://eur-lex.europa.eu/eli/reg/2017/269/oj

Axiom
annotated source: phenylpyrazole herbicides [H99_15]
annotated property: denoted by
annotated target: //app.pollinatorhub.eu/vocabulary/classes/8165) the category of products 'other herbicides' in the harmonised classification of substances of annex III of Regulation (EU) 2017/269 concerning statistics on pesticides in the EU.
has db xref: harmonised classification of substances code

pyridazinone herbicides [H99_16]
type: Class
subclass of: harmonised classification of substances chemical class
subclass of: Restriction
  on property: member of
  some values from: other herbicides [H99]
IAO_0000115: The chemical class 'pyridazinone herbicides' (harmonised classification of substances code H99_16), a member of the category of products 'other herbicides' in the harmonised classification of substances of annex III of Regulation (EU) 2017/269 concerning statistics on pesticides in the EU.
IAO_0000117: Michael Rubinigg
IAO_0000118: Pyridazinon-Herbizide @de
IAO_0000118: pyridazinone herbicides
id: EUPH:3094
denoted by: //app.pollinatorhub.eu/vocabulary/classes/8165) the category of products 'other herbicides' in the harmonised classification of substances of annex III of Regulation (EU) 2017/269 concerning statistics on pesticides in the EU.

Axiom
annotated source: pyridazinone herbicides [H99_16]
annotated property: IAO_0000115
annotated target: The chemical class 'pyridazinone herbicides' (harmonised classification of substances code H99_16), a member of the category of products 'other herbicides' in the harmonised classification of substances of annex III of Regulation (EU) 2017/269 concerning statistics on pesticides in the EU.
source: https://eur-lex.europa.eu/eli/reg/2017/269/oj

Axiom
annotated source: pyridazinone herbicides [H99_16]
annotated property: denoted by
annotated target: //app.pollinatorhub.eu/vocabulary/classes/8165) the category of products 'other herbicides' in the harmonised classification of substances of annex III of Regulation (EU) 2017/269 concerning statistics on pesticides in the EU.
has db xref: harmonised classification of substances code

pyridinecarboxamide herbicides [H99_17]
type: Class
subclass of: harmonised classification of substances chemical class
subclass of: Restriction
  on property: member of
  some values from: other herbicides [H99]
IAO_0000115: The chemical class 'pyridinecarboxamide herbicides' (harmonised classification of substances code H99_17), a member of the category of products 'other herbicides' in the harmonised classification of substances of annex III of Regulation (EU) 2017/269 concerning statistics on pesticides in the EU.
IAO_0000117: Michael Rubinigg
IAO_0000118: Pyridincarboxamid-Herbizide @de
IAO_0000118: pyridinecarboxamide herbicides
id: EUPH:3095
denoted by: //app.pollinatorhub.eu/vocabulary/classes/8165) the category of products 'other herbicides' in the harmonised classification of substances of annex III of Regulation (EU) 2017/269 concerning statistics on pesticides in the EU.

Axiom
annotated source: pyridinecarboxamide herbicides [H99_17]
annotated property: IAO_0000115
annotated target: The chemical class 'pyridinecarboxamide herbicides' (harmonised classification of substances code H99_17), a member of the category of products 'other herbicides' in the harmonised classification of substances of annex III of Regulation (EU) 2017/269 concerning statistics on pesticides in the EU.
source: https://eur-lex.europa.eu/eli/reg/2017/269/oj

Axiom
annotated source: pyridinecarboxamide herbicides [H99_17]
annotated property: denoted by
annotated target: //app.pollinatorhub.eu/vocabulary/classes/8165) the category of products 'other herbicides' in the harmonised classification of substances of annex III of Regulation (EU) 2017/269 concerning statistics on pesticides in the EU.
has db xref: harmonised classification of substances code

pyridinecarboxylic-acid herbicides [H99_18]
type: Class
subclass of: harmonised classification of substances chemical class
subclass of: Restriction
  on property: member of
  some values from: other herbicides [H99]
IAO_0000115: The chemical class 'pyridinecarboxylic-acid herbicides' (harmonised classification of substances code H99_18), a member of the category of products 'other herbicides' in the harmonised classification of substances of annex III of Regulation (EU) 2017/269 concerning statistics on pesticides in the EU.
IAO_0000117: Michael Rubinigg
IAO_0000118: Pyridincarboxyl-Herbizide @de
IAO_0000118: pyridinecarboxylic-acid herbicides
id: EUPH:3096
denoted by: //app.pollinatorhub.eu/vocabulary/classes/8165) the category of products 'other herbicides' in the harmonised classification of substances of annex III of Regulation (EU) 2017/269 concerning statistics on pesticides in the EU.

Axiom
annotated source: pyridinecarboxylic-acid herbicides [H99_18]
annotated property: IAO_0000115
annotated target: The chemical class 'pyridinecarboxylic-acid herbicides' (harmonised classification of substances code H99_18), a member of the category of products 'other herbicides' in the harmonised classification of substances of annex III of Regulation (EU) 2017/269 concerning statistics on pesticides in the EU.
source: https://eur-lex.europa.eu/eli/reg/2017/269/oj

Axiom
annotated source: pyridinecarboxylic-acid herbicides [H99_18]
annotated property: denoted by
annotated target: //app.pollinatorhub.eu/vocabulary/classes/8165) the category of products 'other herbicides' in the harmonised classification of substances of annex III of Regulation (EU) 2017/269 concerning statistics on pesticides in the EU.
has db xref: harmonised classification of substances code

pyridyloxyacetic-acid herbicides [H99_19]
type: Class
subclass of: harmonised classification of substances chemical class
subclass of: Restriction
  on property: member of
  some values from: other herbicides [H99]
IAO_0000115: The chemical class 'pyridyloxyacetic-acid herbicides' (harmonised classification of substances code H99_19), a member of the category of products 'other herbicides' in the harmonised classification of substances of annex III of Regulation (EU) 2017/269 concerning statistics on pesticides in the EU.
IAO_0000117: Michael Rubinigg
IAO_0000118: Pyridyloxyessigsäure-Herbizide @de
IAO_0000118: pyridyloxyacetic-acid herbicides
id: EUPH:3097
denoted by: //app.pollinatorhub.eu/vocabulary/classes/8165) the category of products 'other herbicides' in the harmonised classification of substances of annex III of Regulation (EU) 2017/269 concerning statistics on pesticides in the EU.

Axiom
annotated source: pyridyloxyacetic-acid herbicides [H99_19]
annotated property: IAO_0000115
annotated target: The chemical class 'pyridyloxyacetic-acid herbicides' (harmonised classification of substances code H99_19), a member of the category of products 'other herbicides' in the harmonised classification of substances of annex III of Regulation (EU) 2017/269 concerning statistics on pesticides in the EU.
source: https://eur-lex.europa.eu/eli/reg/2017/269/oj

Axiom
annotated source: pyridyloxyacetic-acid herbicides [H99_19]
annotated property: denoted by
annotated target: //app.pollinatorhub.eu/vocabulary/classes/8165) the category of products 'other herbicides' in the harmonised classification of substances of annex III of Regulation (EU) 2017/269 concerning statistics on pesticides in the EU.
has db xref: harmonised classification of substances code

quinoline herbicides [H99_20]
type: Class
subclass of: harmonised classification of substances chemical class
subclass of: Restriction
  on property: member of
  some values from: other herbicides [H99]
IAO_0000115: The chemical class 'quinoline herbicides' (harmonised classification of substances code H99_20), a member of the category of products 'other herbicides' in the harmonised classification of substances of annex III of Regulation (EU) 2017/269 concerning statistics on pesticides in the EU.
IAO_0000117: Michael Rubinigg
IAO_0000118: Chinolin-Herbizide @de
IAO_0000118: quinoline herbicides
id: EUPH:3098
denoted by: //app.pollinatorhub.eu/vocabulary/classes/8165) the category of products 'other herbicides' in the harmonised classification of substances of annex III of Regulation (EU) 2017/269 concerning statistics on pesticides in the EU.

Axiom
annotated source: quinoline herbicides [H99_20]
annotated property: IAO_0000115
annotated target: The chemical class 'quinoline herbicides' (harmonised classification of substances code H99_20), a member of the category of products 'other herbicides' in the harmonised classification of substances of annex III of Regulation (EU) 2017/269 concerning statistics on pesticides in the EU.
source: https://eur-lex.europa.eu/eli/reg/2017/269/oj

Axiom
annotated source: quinoline herbicides [H99_20]
annotated property: denoted by
annotated target: //app.pollinatorhub.eu/vocabulary/classes/8165) the category of products 'other herbicides' in the harmonised classification of substances of annex III of Regulation (EU) 2017/269 concerning statistics on pesticides in the EU.
has db xref: harmonised classification of substances code

thiadiazine herbicides [H99_21]
type: Class
subclass of: harmonised classification of substances chemical class
subclass of: Restriction
  on property: member of
  some values from: other herbicides [H99]
IAO_0000115: The chemical class 'thiadiazine herbicides' (harmonised classification of substances code H99_21), a member of the category of products 'other herbicides' in the harmonised classification of substances of annex III of Regulation (EU) 2017/269 concerning statistics on pesticides in the EU.
IAO_0000117: Michael Rubinigg
IAO_0000118: Thiadiazin-Herbizide @de
IAO_0000118: thiadiazine herbicides
id: EUPH:3099
denoted by: //app.pollinatorhub.eu/vocabulary/classes/8165) the category of products 'other herbicides' in the harmonised classification of substances of annex III of Regulation (EU) 2017/269 concerning statistics on pesticides in the EU.

Axiom
annotated source: thiadiazine herbicides [H99_21]
annotated property: IAO_0000115
annotated target: The chemical class 'thiadiazine herbicides' (harmonised classification of substances code H99_21), a member of the category of products 'other herbicides' in the harmonised classification of substances of annex III of Regulation (EU) 2017/269 concerning statistics on pesticides in the EU.
source: https://eur-lex.europa.eu/eli/reg/2017/269/oj

Axiom
annotated source: thiadiazine herbicides [H99_21]
annotated property: denoted by
annotated target: //app.pollinatorhub.eu/vocabulary/classes/8165) the category of products 'other herbicides' in the harmonised classification of substances of annex III of Regulation (EU) 2017/269 concerning statistics on pesticides in the EU.
has db xref: harmonised classification of substances code

drone brood
type: Class
subclass of: brood
subclass of: Restriction
  on property: has part
  some values from: immature drone bee
IAO_0000115: Drone brood is brood that develops into drones.
IAO_0000117: Michael Rubinigg
IAO_0000118: Drohnenbrut @de
IAO_0000118: couvain de mâles @fr
IAO_0000118: covata di fuchi @it
IAO_0000118: covata maschile @it
IAO_0000118: cria zanganeira @pt
IAO_0000118: criação de zângões @pt
IAO_0000118: cría de machos @es
IAO_0000118: cría de zánganos @es
IAO_0000118: darrenbroed @nl
IAO_0000118: drone brood
IAO_0000118: droneyngel @da
IAO_0000118: drönaryngel @sv
IAO_0000118: pollo de machos @es
IAO_0000118: pollo de zánganos @es
IAO_0000118: puiet de trîntor @ro
id: EUPH:31

thiocarbamate herbicides [H99_22]
type: Class
subclass of: harmonised classification of substances chemical class
subclass of: Restriction
  on property: member of
  some values from: other herbicides [H99]
IAO_0000115: The chemical class 'thiocarbamate herbicides' (harmonised classification of substances code H99_22), a member of the category of products 'other herbicides' in the harmonised classification of substances of annex III of Regulation (EU) 2017/269 concerning statistics on pesticides in the EU.
IAO_0000117: Michael Rubinigg
IAO_0000118: Thiocarbamat-Herbizide @de
IAO_0000118: thiocarbamate herbicides
id: EUPH:3100
denoted by: //app.pollinatorhub.eu/vocabulary/classes/8165) the category of products 'other herbicides' in the harmonised classification of substances of annex III of Regulation (EU) 2017/269 concerning statistics on pesticides in the EU.

Axiom
annotated source: thiocarbamate herbicides [H99_22]
annotated property: IAO_0000115
annotated target: The chemical class 'thiocarbamate herbicides' (harmonised classification of substances code H99_22), a member of the category of products 'other herbicides' in the harmonised classification of substances of annex III of Regulation (EU) 2017/269 concerning statistics on pesticides in the EU.
source: https://eur-lex.europa.eu/eli/reg/2017/269/oj

Axiom
annotated source: thiocarbamate herbicides [H99_22]
annotated property: denoted by
annotated target: //app.pollinatorhub.eu/vocabulary/classes/8165) the category of products 'other herbicides' in the harmonised classification of substances of annex III of Regulation (EU) 2017/269 concerning statistics on pesticides in the EU.
has db xref: harmonised classification of substances code

triazole herbicides [H99_23]
type: Class
subclass of: harmonised classification of substances chemical class
subclass of: Restriction
  on property: member of
  some values from: other herbicides [H99]
IAO_0000115: The chemical class 'triazole herbicides' (harmonised classification of substances code H99_23), a member of the category of products 'other herbicides' in the harmonised classification of substances of annex III of Regulation (EU) 2017/269 concerning statistics on pesticides in the EU.
IAO_0000117: Michael Rubinigg
IAO_0000118: Triazol-Herbizide @de
IAO_0000118: triazole herbicides
id: EUPH:3101
denoted by: //app.pollinatorhub.eu/vocabulary/classes/8165) the category of products 'other herbicides' in the harmonised classification of substances of annex III of Regulation (EU) 2017/269 concerning statistics on pesticides in the EU.

Axiom
annotated source: triazole herbicides [H99_23]
annotated property: IAO_0000115
annotated target: The chemical class 'triazole herbicides' (harmonised classification of substances code H99_23), a member of the category of products 'other herbicides' in the harmonised classification of substances of annex III of Regulation (EU) 2017/269 concerning statistics on pesticides in the EU.
source: https://eur-lex.europa.eu/eli/reg/2017/269/oj

Axiom
annotated source: triazole herbicides [H99_23]
annotated property: denoted by
annotated target: //app.pollinatorhub.eu/vocabulary/classes/8165) the category of products 'other herbicides' in the harmonised classification of substances of annex III of Regulation (EU) 2017/269 concerning statistics on pesticides in the EU.
has db xref: harmonised classification of substances code

triazolinone herbicides [H99_24]
type: Class
subclass of: harmonised classification of substances chemical class
subclass of: Restriction
  on property: member of
  some values from: other herbicides [H99]
IAO_0000115: The chemical class 'triazolinone herbicides' (harmonised classification of substances code H99_24), a member of the category of products 'other herbicides' in the harmonised classification of substances of annex III of Regulation (EU) 2017/269 concerning statistics on pesticides in the EU.
IAO_0000117: Michael Rubinigg
IAO_0000118: Triazolinon-Herbizide @de
IAO_0000118: triazolinone herbicides
id: EUPH:3102
denoted by: //app.pollinatorhub.eu/vocabulary/classes/8165) the category of products 'other herbicides' in the harmonised classification of substances of annex III of Regulation (EU) 2017/269 concerning statistics on pesticides in the EU.

Axiom
annotated source: triazolinone herbicides [H99_24]
annotated property: IAO_0000115
annotated target: The chemical class 'triazolinone herbicides' (harmonised classification of substances code H99_24), a member of the category of products 'other herbicides' in the harmonised classification of substances of annex III of Regulation (EU) 2017/269 concerning statistics on pesticides in the EU.
source: https://eur-lex.europa.eu/eli/reg/2017/269/oj

Axiom
annotated source: triazolinone herbicides [H99_24]
annotated property: denoted by
annotated target: //app.pollinatorhub.eu/vocabulary/classes/8165) the category of products 'other herbicides' in the harmonised classification of substances of annex III of Regulation (EU) 2017/269 concerning statistics on pesticides in the EU.
has db xref: harmonised classification of substances code

triazolone herbicides [H99_25]
type: Class
subclass of: harmonised classification of substances chemical class
subclass of: Restriction
  on property: member of
  some values from: other herbicides [H99]
IAO_0000115: The chemical class 'triazolone herbicides' (harmonised classification of substances code H99_25), a member of the category of products 'other herbicides' in the harmonised classification of substances of annex III of Regulation (EU) 2017/269 concerning statistics on pesticides in the EU.
IAO_0000117: Michael Rubinigg
IAO_0000118: Triazolinon-Herbizide @de
IAO_0000118: triazolone herbicides
id: EUPH:3103
denoted by: //app.pollinatorhub.eu/vocabulary/classes/8165) the category of products 'other herbicides' in the harmonised classification of substances of annex III of Regulation (EU) 2017/269 concerning statistics on pesticides in the EU.

Axiom
annotated source: triazolone herbicides [H99_25]
annotated property: IAO_0000115
annotated target: The chemical class 'triazolone herbicides' (harmonised classification of substances code H99_25), a member of the category of products 'other herbicides' in the harmonised classification of substances of annex III of Regulation (EU) 2017/269 concerning statistics on pesticides in the EU.
source: https://eur-lex.europa.eu/eli/reg/2017/269/oj

Axiom
annotated source: triazolone herbicides [H99_25]
annotated property: denoted by
annotated target: //app.pollinatorhub.eu/vocabulary/classes/8165) the category of products 'other herbicides' in the harmonised classification of substances of annex III of Regulation (EU) 2017/269 concerning statistics on pesticides in the EU.
has db xref: harmonised classification of substances code

triketone herbicides [H99_26]
type: Class
subclass of: harmonised classification of substances chemical class
subclass of: Restriction
  on property: member of
  some values from: other herbicides [H99]
IAO_0000115: The chemical class 'triketone herbicides' (harmonised classification of substances code H99_26), a member of the category of products 'other herbicides' in the harmonised classification of substances of annex III of Regulation (EU) 2017/269 concerning statistics on pesticides in the EU.
IAO_0000117: Michael Rubinigg
IAO_0000118: Triketon-Herbizide @de
IAO_0000118: triketone herbicides
id: EUPH:3104
denoted by: //app.pollinatorhub.eu/vocabulary/classes/8165) the category of products 'other herbicides' in the harmonised classification of substances of annex III of Regulation (EU) 2017/269 concerning statistics on pesticides in the EU.

Axiom
annotated source: triketone herbicides [H99_26]
annotated property: IAO_0000115
annotated target: The chemical class 'triketone herbicides' (harmonised classification of substances code H99_26), a member of the category of products 'other herbicides' in the harmonised classification of substances of annex III of Regulation (EU) 2017/269 concerning statistics on pesticides in the EU.
source: https://eur-lex.europa.eu/eli/reg/2017/269/oj

Axiom
annotated source: triketone herbicides [H99_26]
annotated property: denoted by
annotated target: //app.pollinatorhub.eu/vocabulary/classes/8165) the category of products 'other herbicides' in the harmonised classification of substances of annex III of Regulation (EU) 2017/269 concerning statistics on pesticides in the EU.
has db xref: harmonised classification of substances code

unclassified herbicides [H99_99]
type: Class
subclass of: harmonised classification of substances chemical class
subclass of: Restriction
  on property: member of
  some values from: other herbicides [H99]
IAO_0000115: The chemical class 'unclassified herbicides' (harmonised classification of substances code H99_99), a member of the category of products 'other herbicides' in the harmonised classification of substances of annex III of Regulation (EU) 2017/269 concerning statistics on pesticides in the EU.
IAO_0000117: Michael Rubinigg
IAO_0000118: nicht zugeordnete Herbizide @de
IAO_0000118: unclassified herbicides
id: EUPH:3105
denoted by: //app.pollinatorhub.eu/vocabulary/classes/8165) the category of products 'other herbicides' in the harmonised classification of substances of annex III of Regulation (EU) 2017/269 concerning statistics on pesticides in the EU.

Axiom
annotated source: unclassified herbicides [H99_99]
annotated property: IAO_0000115
annotated target: The chemical class 'unclassified herbicides' (harmonised classification of substances code H99_99), a member of the category of products 'other herbicides' in the harmonised classification of substances of annex III of Regulation (EU) 2017/269 concerning statistics on pesticides in the EU.
source: https://eur-lex.europa.eu/eli/reg/2017/269/oj

Axiom
annotated source: unclassified herbicides [H99_99]
annotated property: denoted by
annotated target: //app.pollinatorhub.eu/vocabulary/classes/8165) the category of products 'other herbicides' in the harmonised classification of substances of annex III of Regulation (EU) 2017/269 concerning statistics on pesticides in the EU.
has db xref: harmonised classification of substances code

insecticides and acaricides [PES_I]
type: Class
subclass of: harmonised classification of substances major groups
IAO_0000115: The major group 'insecticides and acaricides' (harmonised classification of substances code PES_I or Euro SDMX registry code I) of the harmonised classification of substances in annex III of Regulation (EU) 2017/269 concerning statistics on pesticides in the EU.
IAO_0000117: Michael Rubinigg
IAO_0000118: Insektizide und Akarizide @de
IAO_0000118: insecticides and acaricides
id: EUPH:3106
denoted by: //app.pollinatorhub.eu/vocabulary/classes/8244) I) of the harmonised classification of substances in annex III of Regulation (EU) 2017/269 concerning statistics on pesticides in the EU.

Axiom
annotated source: insecticides and acaricides [PES_I]
annotated property: IAO_0000115
annotated target: The major group 'insecticides and acaricides' (harmonised classification of substances code PES_I or Euro SDMX registry code I) of the harmonised classification of substances in annex III of Regulation (EU) 2017/269 concerning statistics on pesticides in the EU.
source: https://eur-lex.europa.eu/eli/reg/2017/269/oj

Axiom
annotated source: insecticides and acaricides [PES_I]
annotated property: denoted by
annotated target: //app.pollinatorhub.eu/vocabulary/classes/8244) I) of the harmonised classification of substances in annex III of Regulation (EU) 2017/269 concerning statistics on pesticides in the EU.
has db xref: harmonised classification of substances code

insecticides based on pyrethroids [I01]
type: Class
subclass of: harmonised classification of substances categories of products
subclass of: Restriction
  on property: member of
  some values from: insecticides and acaricides [PES_I]
IAO_0000115: The category of products 'insecticides based on pyrethroids' (harmonised classification of substances code I01), a member of the major group 'insecticides and acaricides' in the harmonised classification of substances of annex III of Regulation (EU) 2017/269 concerning statistics on pesticides in the EU.
IAO_0000117: Michael Rubinigg
IAO_0000118: insecticides based on pyrethroids
IAO_0000118: von Pyrethroiden abgeleitete Insektizide @de
id: EUPH:3107
denoted by: //app.pollinatorhub.eu/vocabulary/classes/8165) the major group 'insecticides and acaricides' in the harmonised classification of substances of annex III of Regulation (EU) 2017/269 concerning statistics on pesticides in the EU.

Axiom
annotated source: insecticides based on pyrethroids [I01]
annotated property: IAO_0000115
annotated target: The category of products 'insecticides based on pyrethroids' (harmonised classification of substances code I01), a member of the major group 'insecticides and acaricides' in the harmonised classification of substances of annex III of Regulation (EU) 2017/269 concerning statistics on pesticides in the EU.
source: https://eur-lex.europa.eu/eli/reg/2017/269/oj

Axiom
annotated source: insecticides based on pyrethroids [I01]
annotated property: denoted by
annotated target: //app.pollinatorhub.eu/vocabulary/classes/8165) the major group 'insecticides and acaricides' in the harmonised classification of substances of annex III of Regulation (EU) 2017/269 concerning statistics on pesticides in the EU.
has db xref: harmonised classification of substances code

pyrethroid insecticides [I01_01]
type: Class
subclass of: harmonised classification of substances chemical class
subclass of: Restriction
  on property: member of
  some values from: insecticides based on pyrethroids [I01]
IAO_0000115: The chemical class 'pyrethroid insecticides' (harmonised classification of substances code I01_01), a member of the category of products 'insecticides based on pyrethroids' in the harmonised classification of substances of annex III of Regulation (EU) 2017/269 concerning statistics on pesticides in the EU.
IAO_0000117: Michael Rubinigg
IAO_0000118: Pyrethroid-Insektizide @de
IAO_0000118: pyrethroid insecticides
id: EUPH:3108
denoted by: //app.pollinatorhub.eu/vocabulary/classes/8165) the category of products 'insecticides based on pyrethroids' in the harmonised classification of substances of annex III of Regulation (EU) 2017/269 concerning statistics on pesticides in the EU.

Axiom
annotated source: pyrethroid insecticides [I01_01]
annotated property: IAO_0000115
annotated target: The chemical class 'pyrethroid insecticides' (harmonised classification of substances code I01_01), a member of the category of products 'insecticides based on pyrethroids' in the harmonised classification of substances of annex III of Regulation (EU) 2017/269 concerning statistics on pesticides in the EU.
source: https://eur-lex.europa.eu/eli/reg/2017/269/oj

Axiom
annotated source: pyrethroid insecticides [I01_01]
annotated property: denoted by
annotated target: //app.pollinatorhub.eu/vocabulary/classes/8165) the category of products 'insecticides based on pyrethroids' in the harmonised classification of substances of annex III of Regulation (EU) 2017/269 concerning statistics on pesticides in the EU.
has db xref: harmonised classification of substances code

other insecticides based on pyrethroids [I01_99]
type: Class
subclass of: harmonised classification of substances chemical class
subclass of: Restriction
  on property: member of
  some values from: insecticides based on pyrethroids [I01]
IAO_0000115: The chemical class 'other insecticides based on pyrethroids' (harmonised classification of substances code I01_99), a member of the category of products 'insecticides based on pyrethroids' in the harmonised classification of substances of annex III of Regulation (EU) 2017/269 concerning statistics on pesticides in the EU.
IAO_0000117: Michael Rubinigg
IAO_0000118: other insecticides based on pyrethroids
IAO_0000118: sonstige von Pyrethroiden abgeleitete Insektizide @de
id: EUPH:3109
denoted by: //app.pollinatorhub.eu/vocabulary/classes/8165) the category of products 'insecticides based on pyrethroids' in the harmonised classification of substances of annex III of Regulation (EU) 2017/269 concerning statistics on pesticides in the EU.

Axiom
annotated source: other insecticides based on pyrethroids [I01_99]
annotated property: IAO_0000115
annotated target: The chemical class 'other insecticides based on pyrethroids' (harmonised classification of substances code I01_99), a member of the category of products 'insecticides based on pyrethroids' in the harmonised classification of substances of annex III of Regulation (EU) 2017/269 concerning statistics on pesticides in the EU.
source: https://eur-lex.europa.eu/eli/reg/2017/269/oj

Axiom
annotated source: other insecticides based on pyrethroids [I01_99]
annotated property: denoted by
annotated target: //app.pollinatorhub.eu/vocabulary/classes/8165) the category of products 'insecticides based on pyrethroids' in the harmonised classification of substances of annex III of Regulation (EU) 2017/269 concerning statistics on pesticides in the EU.
has db xref: harmonised classification of substances code

insecticides based on chlorinated hydrocarbons [I02]
type: Class
subclass of: harmonised classification of substances categories of products
subclass of: Restriction
  on property: member of
  some values from: insecticides and acaricides [PES_I]
IAO_0000115: The category of products 'insecticides based on chlorinated hydrocarbons' (harmonised classification of substances code I02), a member of the major group 'insecticides and acaricides' in the harmonised classification of substances of annex III of Regulation (EU) 2017/269 concerning statistics on pesticides in the EU.
IAO_0000117: Michael Rubinigg
IAO_0000118: insecticides based on chlorinated hydrocarbons
IAO_0000118: von chlorierten Kohlenwasserstoffen abgeleitete Insektizide @de
id: EUPH:3110
denoted by: //app.pollinatorhub.eu/vocabulary/classes/8165) the major group 'insecticides and acaricides' in the harmonised classification of substances of annex III of Regulation (EU) 2017/269 concerning statistics on pesticides in the EU.

Axiom
annotated source: insecticides based on chlorinated hydrocarbons [I02]
annotated property: IAO_0000115
annotated target: The category of products 'insecticides based on chlorinated hydrocarbons' (harmonised classification of substances code I02), a member of the major group 'insecticides and acaricides' in the harmonised classification of substances of annex III of Regulation (EU) 2017/269 concerning statistics on pesticides in the EU.
source: https://eur-lex.europa.eu/eli/reg/2017/269/oj

Axiom
annotated source: insecticides based on chlorinated hydrocarbons [I02]
annotated property: denoted by
annotated target: //app.pollinatorhub.eu/vocabulary/classes/8165) the major group 'insecticides and acaricides' in the harmonised classification of substances of annex III of Regulation (EU) 2017/269 concerning statistics on pesticides in the EU.
has db xref: harmonised classification of substances code

anthranilic diamide insecticides [I02_01]
type: Class
subclass of: harmonised classification of substances chemical class
subclass of: Restriction
  on property: member of
  some values from: insecticides based on chlorinated hydrocarbons [I02]
IAO_0000115: [Chemical class](The chemical class) 'anthranilic diamide insecticides' (harmonised classification of substances code I02_01), a member of the category of products 'insecticides based on chlorinated hydrocarbons' in the harmonised classification of substances of annex III of Regulation (EU) 2017/269 concerning statistics on pesticides in the EU.
IAO_0000117: Michael Rubinigg
IAO_0000118: Anthranilamid-Insektizide @de
IAO_0000118: anthranilic diamide insecticides
id: EUPH:3111
denoted by: //app.pollinatorhub.eu/vocabulary/classes/8165) the category of products 'insecticides based on chlorinated hydrocarbons' in the harmonised classification of substances of annex III of Regulation (EU) 2017/269 concerning statistics on pesticides in the EU.

Axiom
annotated source: anthranilic diamide insecticides [I02_01]
annotated property: IAO_0000115
annotated target: [Chemical class](The chemical class) 'anthranilic diamide insecticides' (harmonised classification of substances code I02_01), a member of the category of products 'insecticides based on chlorinated hydrocarbons' in the harmonised classification of substances of annex III of Regulation (EU) 2017/269 concerning statistics on pesticides in the EU.
source: https://eur-lex.europa.eu/eli/reg/2017/269/oj

Axiom
annotated source: anthranilic diamide insecticides [I02_01]
annotated property: denoted by
annotated target: //app.pollinatorhub.eu/vocabulary/classes/8165) the category of products 'insecticides based on chlorinated hydrocarbons' in the harmonised classification of substances of annex III of Regulation (EU) 2017/269 concerning statistics on pesticides in the EU.
has db xref: harmonised classification of substances code

other insecticides based on chlorinated hydrocarbons [I02_99]
type: Class
subclass of: harmonised classification of substances chemical class
subclass of: Restriction
  on property: member of
  some values from: insecticides based on chlorinated hydrocarbons [I02]
IAO_0000115: [Chemical class](The chemical class) 'other insecticides based on chlorinated hydrocarbons' (harmonised classification of substances code I02_99), a member of the category of products 'insecticides based on chlorinated hydrocarbons' in the harmonised classification of substances of annex III of Regulation (EU) 2017/269 concerning statistics on pesticides in the EU.
IAO_0000117: Michael Rubinigg
IAO_0000118: other insecticides based on chlorinated hydrocarbons
IAO_0000118: sonstige von Chlorierten Kohlenwasserstoffen abgeleitete Insektizide @de
id: EUPH:3112
denoted by: //app.pollinatorhub.eu/vocabulary/classes/8165) the category of products 'insecticides based on chlorinated hydrocarbons' in the harmonised classification of substances of annex III of Regulation (EU) 2017/269 concerning statistics on pesticides in the EU.

Axiom
annotated source: other insecticides based on chlorinated hydrocarbons [I02_99]
annotated property: IAO_0000115
annotated target: [Chemical class](The chemical class) 'other insecticides based on chlorinated hydrocarbons' (harmonised classification of substances code I02_99), a member of the category of products 'insecticides based on chlorinated hydrocarbons' in the harmonised classification of substances of annex III of Regulation (EU) 2017/269 concerning statistics on pesticides in the EU.
source: https://eur-lex.europa.eu/eli/reg/2017/269/oj

Axiom
annotated source: other insecticides based on chlorinated hydrocarbons [I02_99]
annotated property: denoted by
annotated target: //app.pollinatorhub.eu/vocabulary/classes/8165) the category of products 'insecticides based on chlorinated hydrocarbons' in the harmonised classification of substances of annex III of Regulation (EU) 2017/269 concerning statistics on pesticides in the EU.
has db xref: harmonised classification of substances code

insecticides based on carbamates and oxime-carbamate [I03]
type: Class
subclass of: harmonised classification of substances categories of products
subclass of: Restriction
  on property: member of
  some values from: insecticides and acaricides [PES_I]
IAO_0000115: The category of products 'insecticides based on carbamates and oxime-carbamate' (harmonised classification of substances code I03), a member of the major group 'insecticides and acaricides' in the harmonised classification of substances of annex III of Regulation (EU) 2017/269 concerning statistics on pesticides in the EU.
IAO_0000117: Michael Rubinigg
IAO_0000118: insecticides based on carbamates and oxime-carbamate
IAO_0000118: von Carbamaten und Oximcarbamaten abgeleitete Insektizide @de
id: EUPH:3113
denoted by: //app.pollinatorhub.eu/vocabulary/classes/8165) the major group 'insecticides and acaricides' in the harmonised classification of substances of annex III of Regulation (EU) 2017/269 concerning statistics on pesticides in the EU.

Axiom
annotated source: insecticides based on carbamates and oxime-carbamate [I03]
annotated property: IAO_0000115
annotated target: The category of products 'insecticides based on carbamates and oxime-carbamate' (harmonised classification of substances code I03), a member of the major group 'insecticides and acaricides' in the harmonised classification of substances of annex III of Regulation (EU) 2017/269 concerning statistics on pesticides in the EU.
source: https://eur-lex.europa.eu/eli/reg/2017/269/oj

Axiom
annotated source: insecticides based on carbamates and oxime-carbamate [I03]
annotated property: denoted by
annotated target: //app.pollinatorhub.eu/vocabulary/classes/8165) the major group 'insecticides and acaricides' in the harmonised classification of substances of annex III of Regulation (EU) 2017/269 concerning statistics on pesticides in the EU.
has db xref: harmonised classification of substances code

oxime-carbamate insecticides [I03_01]
type: Class
subclass of: harmonised classification of substances chemical class
subclass of: Restriction
  on property: member of
  some values from: insecticides based on carbamates and oxime-carbamate [I03]
IAO_0000115: The chemical class 'oxime-carbamate insecticides' (harmonised classification of substances code I03_01), a member of the category of products 'insecticides based on carbamates and oxime-carbamate' in the harmonised classification of substances of annex III of Regulation (EU) 2017/269 concerning statistics on pesticides in the EU.
IAO_0000117: Michael Rubinigg
IAO_0000118: Oximcarbamat-Insektizide @de
IAO_0000118: oxime-carbamate insecticides
id: EUPH:3114
denoted by: //app.pollinatorhub.eu/vocabulary/classes/8165) the category of products 'insecticides based on carbamates and oxime-carbamate' in the harmonised classification of substances of annex III of Regulation (EU) 2017/269 concerning statistics on pesticides in the EU.

Axiom
annotated source: oxime-carbamate insecticides [I03_01]
annotated property: IAO_0000115
annotated target: The chemical class 'oxime-carbamate insecticides' (harmonised classification of substances code I03_01), a member of the category of products 'insecticides based on carbamates and oxime-carbamate' in the harmonised classification of substances of annex III of Regulation (EU) 2017/269 concerning statistics on pesticides in the EU.
source: https://eur-lex.europa.eu/eli/reg/2017/269/oj

Axiom
annotated source: oxime-carbamate insecticides [I03_01]
annotated property: denoted by
annotated target: //app.pollinatorhub.eu/vocabulary/classes/8165) the category of products 'insecticides based on carbamates and oxime-carbamate' in the harmonised classification of substances of annex III of Regulation (EU) 2017/269 concerning statistics on pesticides in the EU.
has db xref: harmonised classification of substances code

carbamate insecticides [I03_02]
type: Class
subclass of: harmonised classification of substances chemical class
subclass of: Restriction
  on property: member of
  some values from: insecticides based on carbamates and oxime-carbamate [I03]
IAO_0000115: The chemical class 'carbamate insecticides' (harmonised classification of substances code I03_02), a member of the category of products 'insecticides based on carbamates and oxime-carbamate' in the harmonised classification of substances of annex III of Regulation (EU) 2017/269 concerning statistics on pesticides in the EU.
IAO_0000117: Michael Rubinigg
IAO_0000118: Carbamat-Insektizide @de
IAO_0000118: carbamate insecticides
id: EUPH:3115
denoted by: //app.pollinatorhub.eu/vocabulary/classes/8165) the category of products 'insecticides based on carbamates and oxime-carbamate' in the harmonised classification of substances of annex III of Regulation (EU) 2017/269 concerning statistics on pesticides in the EU.

Axiom
annotated source: carbamate insecticides [I03_02]
annotated property: IAO_0000115
annotated target: The chemical class 'carbamate insecticides' (harmonised classification of substances code I03_02), a member of the category of products 'insecticides based on carbamates and oxime-carbamate' in the harmonised classification of substances of annex III of Regulation (EU) 2017/269 concerning statistics on pesticides in the EU.
source: https://eur-lex.europa.eu/eli/reg/2017/269/oj

Axiom
annotated source: carbamate insecticides [I03_02]
annotated property: denoted by
annotated target: //app.pollinatorhub.eu/vocabulary/classes/8165) the category of products 'insecticides based on carbamates and oxime-carbamate' in the harmonised classification of substances of annex III of Regulation (EU) 2017/269 concerning statistics on pesticides in the EU.
has db xref: harmonised classification of substances code

other insecticides absed on carbamate and oxie-carbamate [I03_99]
type: Class
subclass of: harmonised classification of substances chemical class
subclass of: Restriction
  on property: member of
  some values from: insecticides based on carbamates and oxime-carbamate [I03]
IAO_0000115: The chemical class 'other insecticides absed on carbamate and oxie-carbamate' (harmonised classification of substances code I03_99), a member of the category of products 'insecticides based on carbamates and oxime-carbamate' in the harmonised classification of substances of annex III of Regulation (EU) 2017/269 concerning statistics on pesticides in the EU.
IAO_0000117: Michael Rubinigg
IAO_0000118: other insecticides absed on carbamate and oxie-carbamate
IAO_0000118: sonstige von Carbamaten und Oximcarbamaten abgeleitete Insektizide @de
id: EUPH:3116
denoted by: //app.pollinatorhub.eu/vocabulary/classes/8165) the category of products 'insecticides based on carbamates and oxime-carbamate' in the harmonised classification of substances of annex III of Regulation (EU) 2017/269 concerning statistics on pesticides in the EU.

Axiom
annotated source: other insecticides absed on carbamate and oxie-carbamate [I03_99]
annotated property: IAO_0000115
annotated target: The chemical class 'other insecticides absed on carbamate and oxie-carbamate' (harmonised classification of substances code I03_99), a member of the category of products 'insecticides based on carbamates and oxime-carbamate' in the harmonised classification of substances of annex III of Regulation (EU) 2017/269 concerning statistics on pesticides in the EU.
source: https://eur-lex.europa.eu/eli/reg/2017/269/oj

Axiom
annotated source: other insecticides absed on carbamate and oxie-carbamate [I03_99]
annotated property: denoted by
annotated target: //app.pollinatorhub.eu/vocabulary/classes/8165) the category of products 'insecticides based on carbamates and oxime-carbamate' in the harmonised classification of substances of annex III of Regulation (EU) 2017/269 concerning statistics on pesticides in the EU.
has db xref: harmonised classification of substances code

insecticides based on organophosphates [I04]
type: Class
subclass of: harmonised classification of substances categories of products
subclass of: Restriction
  on property: member of
  some values from: insecticides and acaricides [PES_I]
IAO_0000115: The category of products 'insecticides based on organophosphates' (harmonised classification of substances code I04), a member of the major group 'insecticides and acaricides' in the harmonised classification of substances of annex III of Regulation (EU) 2017/269 concerning statistics on pesticides in the EU.
IAO_0000117: Michael Rubinigg
IAO_0000118: insecticides based on organophosphates
IAO_0000118: von organischen Phosphaten abgeleitete Insektizide @de
id: EUPH:3117
denoted by: //app.pollinatorhub.eu/vocabulary/classes/8165) the major group 'insecticides and acaricides' in the harmonised classification of substances of annex III of Regulation (EU) 2017/269 concerning statistics on pesticides in the EU.

Axiom
annotated source: insecticides based on organophosphates [I04]
annotated property: IAO_0000115
annotated target: The category of products 'insecticides based on organophosphates' (harmonised classification of substances code I04), a member of the major group 'insecticides and acaricides' in the harmonised classification of substances of annex III of Regulation (EU) 2017/269 concerning statistics on pesticides in the EU.
source: https://eur-lex.europa.eu/eli/reg/2017/269/oj

Axiom
annotated source: insecticides based on organophosphates [I04]
annotated property: denoted by
annotated target: //app.pollinatorhub.eu/vocabulary/classes/8165) the major group 'insecticides and acaricides' in the harmonised classification of substances of annex III of Regulation (EU) 2017/269 concerning statistics on pesticides in the EU.
has db xref: harmonised classification of substances code

organophosphorus insecticides [I04_01]
type: Class
subclass of: harmonised classification of substances chemical class
subclass of: Restriction
  on property: member of
  some values from: insecticides based on organophosphates [I04]
IAO_0000115: The chemical class 'organophosphorus insecticides' (harmonised classification of substances code I04_01), a member of the category of products 'insecticides based on organophosphates' in the harmonised classification of substances of annex III of Regulation (EU) 2017/269 concerning statistics on pesticides in the EU.
IAO_0000117: Michael Rubinigg
IAO_0000118: Organophosphor-Insektizide @de
IAO_0000118: organophosphorus insecticides
id: EUPH:3118
denoted by: //app.pollinatorhub.eu/vocabulary/classes/8165) the category of products 'insecticides based on organophosphates' in the harmonised classification of substances of annex III of Regulation (EU) 2017/269 concerning statistics on pesticides in the EU.

Axiom
annotated source: organophosphorus insecticides [I04_01]
annotated property: IAO_0000115
annotated target: The chemical class 'organophosphorus insecticides' (harmonised classification of substances code I04_01), a member of the category of products 'insecticides based on organophosphates' in the harmonised classification of substances of annex III of Regulation (EU) 2017/269 concerning statistics on pesticides in the EU.
source: https://eur-lex.europa.eu/eli/reg/2017/269/oj

Axiom
annotated source: organophosphorus insecticides [I04_01]
annotated property: denoted by
annotated target: //app.pollinatorhub.eu/vocabulary/classes/8165) the category of products 'insecticides based on organophosphates' in the harmonised classification of substances of annex III of Regulation (EU) 2017/269 concerning statistics on pesticides in the EU.
has db xref: harmonised classification of substances code

other insecticides based on organophosphates [I04_99]
type: Class
subclass of: harmonised classification of substances chemical class
subclass of: Restriction
  on property: member of
  some values from: insecticides based on organophosphates [I04]
IAO_0000115: The chemical class 'other insecticides based on organophosphates' (harmonised classification of substances code I04_99), a member of the category of products 'insecticides based on organophosphates' in the harmonised classification of substances of annex III of Regulation (EU) 2017/269 concerning statistics on pesticides in the EU.
IAO_0000117: Michael Rubinigg
IAO_0000118: other insecticides based on organophosphates
IAO_0000118: sonstige von organischen Phosphaten abgeleitete Insektizide @de
id: EUPH:3119
denoted by: //app.pollinatorhub.eu/vocabulary/classes/8165) the category of products 'insecticides based on organophosphates' in the harmonised classification of substances of annex III of Regulation (EU) 2017/269 concerning statistics on pesticides in the EU.

Axiom
annotated source: other insecticides based on organophosphates [I04_99]
annotated property: IAO_0000115
annotated target: The chemical class 'other insecticides based on organophosphates' (harmonised classification of substances code I04_99), a member of the category of products 'insecticides based on organophosphates' in the harmonised classification of substances of annex III of Regulation (EU) 2017/269 concerning statistics on pesticides in the EU.
source: https://eur-lex.europa.eu/eli/reg/2017/269/oj

Axiom
annotated source: other insecticides based on organophosphates [I04_99]
annotated property: denoted by
annotated target: //app.pollinatorhub.eu/vocabulary/classes/8165) the category of products 'insecticides based on organophosphates' in the harmonised classification of substances of annex III of Regulation (EU) 2017/269 concerning statistics on pesticides in the EU.
has db xref: harmonised classification of substances code

insecticides of microbiological or botanical origin [I05]
type: Class
subclass of: harmonised classification of substances categories of products
subclass of: Restriction
  on property: member of
  some values from: insecticides and acaricides [PES_I]
IAO_0000115: The category of products 'insecticides of microbiological or botanical origin' (harmonised classification of substances code I05), a member of the major group 'insecticides and acaricides' in the harmonised classification of substances of annex III of Regulation (EU) 2017/269 concerning statistics on pesticides in the EU.
IAO_0000117: Michael Rubinigg
IAO_0000118: insecticides of microbiological or botanical origin
IAO_0000118: insektizide mikrobiologischen und pflanzlichen Ursprungs @de
id: EUPH:3120
denoted by: //app.pollinatorhub.eu/vocabulary/classes/8165) the major group 'insecticides and acaricides' in the harmonised classification of substances of annex III of Regulation (EU) 2017/269 concerning statistics on pesticides in the EU.

Axiom
annotated source: insecticides of microbiological or botanical origin [I05]
annotated property: IAO_0000115
annotated target: The category of products 'insecticides of microbiological or botanical origin' (harmonised classification of substances code I05), a member of the major group 'insecticides and acaricides' in the harmonised classification of substances of annex III of Regulation (EU) 2017/269 concerning statistics on pesticides in the EU.
source: https://eur-lex.europa.eu/eli/reg/2017/269/oj

Axiom
annotated source: insecticides of microbiological or botanical origin [I05]
annotated property: denoted by
annotated target: //app.pollinatorhub.eu/vocabulary/classes/8165) the major group 'insecticides and acaricides' in the harmonised classification of substances of annex III of Regulation (EU) 2017/269 concerning statistics on pesticides in the EU.
has db xref: harmonised classification of substances code

microbiological insecticides [I05_01]
type: Class
subclass of: harmonised classification of substances chemical class
subclass of: Restriction
  on property: member of
  some values from: insecticides of microbiological or botanical origin [I05]
IAO_0000115: The chemical class 'microbiological insecticides' (harmonised classification of substances code I05_01), a member of the category of products 'insecticides of microbiological or botanical origin' in the harmonised classification of substances of annex III of Regulation (EU) 2017/269 concerning statistics on pesticides in the EU.
IAO_0000117: Michael Rubinigg
IAO_0000118: microbiological insecticides
IAO_0000118: mikrobiogische Insektizide @de
id: EUPH:3121
denoted by: //app.pollinatorhub.eu/vocabulary/classes/8165) the category of products 'insecticides of microbiological or botanical origin' in the harmonised classification of substances of annex III of Regulation (EU) 2017/269 concerning statistics on pesticides in the EU.

Axiom
annotated source: microbiological insecticides [I05_01]
annotated property: IAO_0000115
annotated target: The chemical class 'microbiological insecticides' (harmonised classification of substances code I05_01), a member of the category of products 'insecticides of microbiological or botanical origin' in the harmonised classification of substances of annex III of Regulation (EU) 2017/269 concerning statistics on pesticides in the EU.
source: https://eur-lex.europa.eu/eli/reg/2017/269/oj

Axiom
annotated source: microbiological insecticides [I05_01]
annotated property: denoted by
annotated target: //app.pollinatorhub.eu/vocabulary/classes/8165) the category of products 'insecticides of microbiological or botanical origin' in the harmonised classification of substances of annex III of Regulation (EU) 2017/269 concerning statistics on pesticides in the EU.
has db xref: harmonised classification of substances code

botanical insecticides [I05_02]
type: Class
subclass of: harmonised classification of substances chemical class
subclass of: Restriction
  on property: member of
  some values from: insecticides of microbiological or botanical origin [I05]
IAO_0000115: The chemical class 'botanical insecticides' (harmonised classification of substances code I05_02), a member of the category of products 'insecticides of microbiological or botanical origin' in the harmonised classification of substances of annex III of Regulation (EU) 2017/269 concerning statistics on pesticides in the EU.
IAO_0000117: Michael Rubinigg
IAO_0000118: Insektizide auf pflanzlicher Basis @de
IAO_0000118: botanical insecticides
id: EUPH:3122
denoted by: //app.pollinatorhub.eu/vocabulary/classes/8165) the category of products 'insecticides of microbiological or botanical origin' in the harmonised classification of substances of annex III of Regulation (EU) 2017/269 concerning statistics on pesticides in the EU.

Axiom
annotated source: botanical insecticides [I05_02]
annotated property: IAO_0000115
annotated target: The chemical class 'botanical insecticides' (harmonised classification of substances code I05_02), a member of the category of products 'insecticides of microbiological or botanical origin' in the harmonised classification of substances of annex III of Regulation (EU) 2017/269 concerning statistics on pesticides in the EU.
source: https://eur-lex.europa.eu/eli/reg/2017/269/oj

Axiom
annotated source: botanical insecticides [I05_02]
annotated property: denoted by
annotated target: //app.pollinatorhub.eu/vocabulary/classes/8165) the category of products 'insecticides of microbiological or botanical origin' in the harmonised classification of substances of annex III of Regulation (EU) 2017/269 concerning statistics on pesticides in the EU.
has db xref: harmonised classification of substances code

other insecticides of microbiological or botanical origin [I05_99]
type: Class
subclass of: harmonised classification of substances chemical class
subclass of: Restriction
  on property: member of
  some values from: insecticides of microbiological or botanical origin [I05]
IAO_0000115: The chemical class 'other insecticides of microbiological or botanical origin' (harmonised classification of substances code I05_99), a member of the category of products 'insecticides of microbiological or botanical origin' in the harmonised classification of substances of annex III of Regulation (EU) 2017/269 concerning statistics on pesticides in the EU.
IAO_0000117: Michael Rubinigg
IAO_0000118: other insecticides of microbiological or botanical origin
IAO_0000118: sonstige Insektizide mikrobiologischen oder pflanzlichen Ursprungs @de
id: EUPH:3123
denoted by: //app.pollinatorhub.eu/vocabulary/classes/8165) the category of products 'insecticides of microbiological or botanical origin' in the harmonised classification of substances of annex III of Regulation (EU) 2017/269 concerning statistics on pesticides in the EU.

Axiom
annotated source: other insecticides of microbiological or botanical origin [I05_99]
annotated property: IAO_0000115
annotated target: The chemical class 'other insecticides of microbiological or botanical origin' (harmonised classification of substances code I05_99), a member of the category of products 'insecticides of microbiological or botanical origin' in the harmonised classification of substances of annex III of Regulation (EU) 2017/269 concerning statistics on pesticides in the EU.
source: https://eur-lex.europa.eu/eli/reg/2017/269/oj

Axiom
annotated source: other insecticides of microbiological or botanical origin [I05_99]
annotated property: denoted by
annotated target: //app.pollinatorhub.eu/vocabulary/classes/8165) the category of products 'insecticides of microbiological or botanical origin' in the harmonised classification of substances of annex III of Regulation (EU) 2017/269 concerning statistics on pesticides in the EU.
has db xref: harmonised classification of substances code

acaricides [I06]
type: Class
subclass of: harmonised classification of substances categories of products
subclass of: Restriction
  on property: member of
  some values from: insecticides and acaricides [PES_I]
IAO_0000115: The category of products 'acaricides' (harmonised classification of substances code I06), a member of the major group 'insecticides and acaricides' in the harmonised classification of substances of annex III of Regulation (EU) 2017/269 concerning statistics on pesticides in the EU.
IAO_0000117: Michael Rubinigg
IAO_0000118: Akarizide @de
IAO_0000118: acaricides
id: EUPH:3124
denoted by: //app.pollinatorhub.eu/vocabulary/classes/8165) the major group 'insecticides and acaricides' in the harmonised classification of substances of annex III of Regulation (EU) 2017/269 concerning statistics on pesticides in the EU.

Axiom
annotated source: acaricides [I06]
annotated property: IAO_0000115
annotated target: The category of products 'acaricides' (harmonised classification of substances code I06), a member of the major group 'insecticides and acaricides' in the harmonised classification of substances of annex III of Regulation (EU) 2017/269 concerning statistics on pesticides in the EU.
source: https://eur-lex.europa.eu/eli/reg/2017/269/oj

Axiom
annotated source: acaricides [I06]
annotated property: denoted by
annotated target: //app.pollinatorhub.eu/vocabulary/classes/8165) the major group 'insecticides and acaricides' in the harmonised classification of substances of annex III of Regulation (EU) 2017/269 concerning statistics on pesticides in the EU.
has db xref: harmonised classification of substances code

pyrazole acaricide [I06_01]
type: Class
subclass of: harmonised classification of substances chemical class
subclass of: Restriction
  on property: member of
  some values from: acaricides [I06]
IAO_0000115: The chemical class 'pyrazole acaricides' (harmonised classification of substances code I06_01), a member of the category of products 'acaricides' in the harmonised classification of substances of annex III of Regulation (EU) 2017/269 concerning statistics on pesticides in the EU.
IAO_0000117: Michael Rubinigg
IAO_0000118: Pyrazol-Akarizide @de
IAO_0000118: pyrazole acaricide
id: EUPH:3125
denoted by: //app.pollinatorhub.eu/vocabulary/classes/8165) the category of products 'acaricides' in the harmonised classification of substances of annex III of Regulation (EU) 2017/269 concerning statistics on pesticides in the EU.

Axiom
annotated source: pyrazole acaricide [I06_01]
annotated property: IAO_0000115
annotated target: The chemical class 'pyrazole acaricides' (harmonised classification of substances code I06_01), a member of the category of products 'acaricides' in the harmonised classification of substances of annex III of Regulation (EU) 2017/269 concerning statistics on pesticides in the EU.
source: https://eur-lex.europa.eu/eli/reg/2017/269/oj

Axiom
annotated source: pyrazole acaricide [I06_01]
annotated property: denoted by
annotated target: //app.pollinatorhub.eu/vocabulary/classes/8165) the category of products 'acaricides' in the harmonised classification of substances of annex III of Regulation (EU) 2017/269 concerning statistics on pesticides in the EU.
has db xref: harmonised classification of substances code

tetrazine acaricides [I06_02]
type: Class
subclass of: harmonised classification of substances chemical class
subclass of: Restriction
  on property: member of
  some values from: acaricides [I06]
IAO_0000115: The chemical class 'tetrazine acaricides' (harmonised classification of substances code I06_02), a member of the category of products 'acaricides' in the harmonised classification of substances of annex III of Regulation (EU) 2017/269 concerning statistics on pesticides in the EU.
IAO_0000117: Michael Rubinigg
IAO_0000118: Tetrazin-Akarizide @de
IAO_0000118: tetrazine acaricides
id: EUPH:3126
denoted by: //app.pollinatorhub.eu/vocabulary/classes/8165) the category of products 'acaricides' in the harmonised classification of substances of annex III of Regulation (EU) 2017/269 concerning statistics on pesticides in the EU.

Axiom
annotated source: tetrazine acaricides [I06_02]
annotated property: IAO_0000115
annotated target: The chemical class 'tetrazine acaricides' (harmonised classification of substances code I06_02), a member of the category of products 'acaricides' in the harmonised classification of substances of annex III of Regulation (EU) 2017/269 concerning statistics on pesticides in the EU.
source: https://eur-lex.europa.eu/eli/reg/2017/269/oj

Axiom
annotated source: tetrazine acaricides [I06_02]
annotated property: denoted by
annotated target: //app.pollinatorhub.eu/vocabulary/classes/8165) the category of products 'acaricides' in the harmonised classification of substances of annex III of Regulation (EU) 2017/269 concerning statistics on pesticides in the EU.
has db xref: harmonised classification of substances code

other acaricides [I06_99]
type: Class
subclass of: harmonised classification of substances chemical class
subclass of: Restriction
  on property: member of
  some values from: acaricides [I06]
IAO_0000115: The chemical class 'other acaricides' (harmonised classification of substances code I06_99), a member of the category of products 'acaricides' in the harmonised classification of substances of annex III of Regulation (EU) 2017/269 concerning statistics on pesticides in the EU.
IAO_0000117: Michael Rubinigg
IAO_0000118: other acaricides
IAO_0000118: sonstige Akarizide @de
id: EUPH:3127
denoted by: //app.pollinatorhub.eu/vocabulary/classes/8165) the category of products 'acaricides' in the harmonised classification of substances of annex III of Regulation (EU) 2017/269 concerning statistics on pesticides in the EU.

Axiom
annotated source: other acaricides [I06_99]
annotated property: IAO_0000115
annotated target: The chemical class 'other acaricides' (harmonised classification of substances code I06_99), a member of the category of products 'acaricides' in the harmonised classification of substances of annex III of Regulation (EU) 2017/269 concerning statistics on pesticides in the EU.
source: https://eur-lex.europa.eu/eli/reg/2017/269/oj

Axiom
annotated source: other acaricides [I06_99]
annotated property: denoted by
annotated target: //app.pollinatorhub.eu/vocabulary/classes/8165) the category of products 'acaricides' in the harmonised classification of substances of annex III of Regulation (EU) 2017/269 concerning statistics on pesticides in the EU.
has db xref: harmonised classification of substances code

other insecticides [I99]
type: Class
subclass of: harmonised classification of substances categories of products
subclass of: Restriction
  on property: member of
  some values from: insecticides and acaricides [PES_I]
IAO_0000115: The category of products 'other insecticides' (harmonised classification of substances code I99), a member of the major group 'insecticides and acaricides' in the harmonised classification of substances of annex III of Regulation (EU) 2017/269 concerning statistics on pesticides in the EU.
IAO_0000117: Michael Rubinigg
IAO_0000118: other insecticides
IAO_0000118: sonstige Insektizide @de
id: EUPH:3128
denoted by: //app.pollinatorhub.eu/vocabulary/classes/8165) the major group 'insecticides and acaricides' in the harmonised classification of substances of annex III of Regulation (EU) 2017/269 concerning statistics on pesticides in the EU.

Axiom
annotated source: other insecticides [I99]
annotated property: IAO_0000115
annotated target: The category of products 'other insecticides' (harmonised classification of substances code I99), a member of the major group 'insecticides and acaricides' in the harmonised classification of substances of annex III of Regulation (EU) 2017/269 concerning statistics on pesticides in the EU.
source: https://eur-lex.europa.eu/eli/reg/2017/269/oj

Axiom
annotated source: other insecticides [I99]
annotated property: denoted by
annotated target: //app.pollinatorhub.eu/vocabulary/classes/8165) the major group 'insecticides and acaricides' in the harmonised classification of substances of annex III of Regulation (EU) 2017/269 concerning statistics on pesticides in the EU.
has db xref: harmonised classification of substances code

insecticides produced by fermentation [I99_01]
type: Class
subclass of: harmonised classification of substances chemical class
subclass of: Restriction
  on property: member of
  some values from: other insecticides [I99]
IAO_0000115: The chemical class 'insecticides produced by fermentation' (harmonised classification of substances code I99_01), a member of the category of products 'other insecticides' in the harmonised classification of substances of annex III of Regulation (EU) 2017/269 concerning statistics on pesticides in the EU.
IAO_0000117: Michael Rubinigg
IAO_0000118: durch Fermentierung erzeugte Insektizide @de
IAO_0000118: insecticides produced by fermentation
id: EUPH:3129
denoted by: //app.pollinatorhub.eu/vocabulary/classes/8165) the category of products 'other insecticides' in the harmonised classification of substances of annex III of Regulation (EU) 2017/269 concerning statistics on pesticides in the EU.

Axiom
annotated source: insecticides produced by fermentation [I99_01]
annotated property: IAO_0000115
annotated target: The chemical class 'insecticides produced by fermentation' (harmonised classification of substances code I99_01), a member of the category of products 'other insecticides' in the harmonised classification of substances of annex III of Regulation (EU) 2017/269 concerning statistics on pesticides in the EU.
source: https://eur-lex.europa.eu/eli/reg/2017/269/oj

Axiom
annotated source: insecticides produced by fermentation [I99_01]
annotated property: denoted by
annotated target: //app.pollinatorhub.eu/vocabulary/classes/8165) the category of products 'other insecticides' in the harmonised classification of substances of annex III of Regulation (EU) 2017/269 concerning statistics on pesticides in the EU.
has db xref: harmonised classification of substances code

benzoylurea insecticides [I99_03]
type: Class
subclass of: harmonised classification of substances chemical class
subclass of: Restriction
  on property: member of
  some values from: other insecticides [I99]
IAO_0000115: The chemical class 'benzoylurea insecticides' (harmonised classification of substances code I99_03), a member of the category of products 'other insecticides' in the harmonised classification of substances of annex III of Regulation (EU) 2017/269 concerning statistics on pesticides in the EU.
IAO_0000117: Michael Rubinigg
IAO_0000118: Benzoylharnstoff-Insektizide @de
IAO_0000118: benzoylurea insecticides
id: EUPH:3130
denoted by: //app.pollinatorhub.eu/vocabulary/classes/8165) the category of products 'other insecticides' in the harmonised classification of substances of annex III of Regulation (EU) 2017/269 concerning statistics on pesticides in the EU.

Axiom
annotated source: benzoylurea insecticides [I99_03]
annotated property: IAO_0000115
annotated target: The chemical class 'benzoylurea insecticides' (harmonised classification of substances code I99_03), a member of the category of products 'other insecticides' in the harmonised classification of substances of annex III of Regulation (EU) 2017/269 concerning statistics on pesticides in the EU.
source: https://eur-lex.europa.eu/eli/reg/2017/269/oj

Axiom
annotated source: benzoylurea insecticides [I99_03]
annotated property: denoted by
annotated target: //app.pollinatorhub.eu/vocabulary/classes/8165) the category of products 'other insecticides' in the harmonised classification of substances of annex III of Regulation (EU) 2017/269 concerning statistics on pesticides in the EU.
has db xref: harmonised classification of substances code

carbazate insecticides [I99_04]
type: Class
subclass of: harmonised classification of substances chemical class
subclass of: Restriction
  on property: member of
  some values from: other insecticides [I99]
IAO_0000115: The chemical class 'carbazate insecticides' (harmonised classification of substances code I99_04), a member of the category of products 'other insecticides' in the harmonised classification of substances of annex III of Regulation (EU) 2017/269 concerning statistics on pesticides in the EU.
IAO_0000117: Michael Rubinigg
IAO_0000118: Carbazat-Insektizide @de
IAO_0000118: carbazate insecticides
id: EUPH:3131
denoted by: //app.pollinatorhub.eu/vocabulary/classes/8165) the category of products 'other insecticides' in the harmonised classification of substances of annex III of Regulation (EU) 2017/269 concerning statistics on pesticides in the EU.

Axiom
annotated source: carbazate insecticides [I99_04]
annotated property: IAO_0000115
annotated target: The chemical class 'carbazate insecticides' (harmonised classification of substances code I99_04), a member of the category of products 'other insecticides' in the harmonised classification of substances of annex III of Regulation (EU) 2017/269 concerning statistics on pesticides in the EU.
source: https://eur-lex.europa.eu/eli/reg/2017/269/oj

Axiom
annotated source: carbazate insecticides [I99_04]
annotated property: denoted by
annotated target: //app.pollinatorhub.eu/vocabulary/classes/8165) the category of products 'other insecticides' in the harmonised classification of substances of annex III of Regulation (EU) 2017/269 concerning statistics on pesticides in the EU.
has db xref: harmonised classification of substances code

diazylhydrazine insecticides [I99_05]
type: Class
subclass of: harmonised classification of substances chemical class
subclass of: Restriction
  on property: member of
  some values from: other insecticides [I99]
IAO_0000115: The chemical class 'diazylhydrazine insecticides' (harmonised classification of substances code I99_05), a member of the category of products 'other insecticides' in the harmonised classification of substances of annex III of Regulation (EU) 2017/269 concerning statistics on pesticides in the EU.
IAO_0000117: Michael Rubinigg
IAO_0000118: Diazylhydrazin-Insektizide @de
IAO_0000118: diazylhydrazine insecticides
id: EUPH:3132
denoted by: //app.pollinatorhub.eu/vocabulary/classes/8165) the category of products 'other insecticides' in the harmonised classification of substances of annex III of Regulation (EU) 2017/269 concerning statistics on pesticides in the EU.

Axiom
annotated source: diazylhydrazine insecticides [I99_05]
annotated property: IAO_0000115
annotated target: The chemical class 'diazylhydrazine insecticides' (harmonised classification of substances code I99_05), a member of the category of products 'other insecticides' in the harmonised classification of substances of annex III of Regulation (EU) 2017/269 concerning statistics on pesticides in the EU.
source: https://eur-lex.europa.eu/eli/reg/2017/269/oj

Axiom
annotated source: diazylhydrazine insecticides [I99_05]
annotated property: denoted by
annotated target: //app.pollinatorhub.eu/vocabulary/classes/8165) the category of products 'other insecticides' in the harmonised classification of substances of annex III of Regulation (EU) 2017/269 concerning statistics on pesticides in the EU.
has db xref: harmonised classification of substances code

insect growth regulators [I99_06]
type: Class
subclass of: harmonised classification of substances chemical class
subclass of: Restriction
  on property: member of
  some values from: other insecticides [I99]
IAO_0000115: The chemical class 'insect growth regulators' (harmonised classification of substances code I99_06), a member of the category of products 'other insecticides' in the harmonised classification of substances of annex III of Regulation (EU) 2017/269 concerning statistics on pesticides in the EU.
IAO_0000117: Michael Rubinigg
IAO_0000118: Insektenwachstumsregler @de
IAO_0000118: insect growth regulators
id: EUPH:3133
denoted by: //app.pollinatorhub.eu/vocabulary/classes/8165) the category of products 'other insecticides' in the harmonised classification of substances of annex III of Regulation (EU) 2017/269 concerning statistics on pesticides in the EU.

Axiom
annotated source: insect growth regulators [I99_06]
annotated property: IAO_0000115
annotated target: The chemical class 'insect growth regulators' (harmonised classification of substances code I99_06), a member of the category of products 'other insecticides' in the harmonised classification of substances of annex III of Regulation (EU) 2017/269 concerning statistics on pesticides in the EU.
source: https://eur-lex.europa.eu/eli/reg/2017/269/oj

Axiom
annotated source: insect growth regulators [I99_06]
annotated property: denoted by
annotated target: //app.pollinatorhub.eu/vocabulary/classes/8165) the category of products 'other insecticides' in the harmonised classification of substances of annex III of Regulation (EU) 2017/269 concerning statistics on pesticides in the EU.
has db xref: harmonised classification of substances code

nitroguanidine insecticides [I99_08]
type: Class
subclass of: harmonised classification of substances chemical class
subclass of: Restriction
  on property: member of
  some values from: other insecticides [I99]
IAO_0000115: The chemical class 'nitroguanidine insecticides' (harmonised classification of substances code I99_08), a member of the category of products 'other insecticides' in the harmonised classification of substances of annex III of Regulation (EU) 2017/269 concerning statistics on pesticides in the EU.
IAO_0000117: Michael Rubinigg
IAO_0000118: Nitroguanidin-Insektizide @de
IAO_0000118: nitroguanidine insecticides
id: EUPH:3134
denoted by: //app.pollinatorhub.eu/vocabulary/classes/8165) the category of products 'other insecticides' in the harmonised classification of substances of annex III of Regulation (EU) 2017/269 concerning statistics on pesticides in the EU.

Axiom
annotated source: nitroguanidine insecticides [I99_08]
annotated property: IAO_0000115
annotated target: The chemical class 'nitroguanidine insecticides' (harmonised classification of substances code I99_08), a member of the category of products 'other insecticides' in the harmonised classification of substances of annex III of Regulation (EU) 2017/269 concerning statistics on pesticides in the EU.
source: https://eur-lex.europa.eu/eli/reg/2017/269/oj

Axiom
annotated source: nitroguanidine insecticides [I99_08]
annotated property: denoted by
annotated target: //app.pollinatorhub.eu/vocabulary/classes/8165) the category of products 'other insecticides' in the harmonised classification of substances of annex III of Regulation (EU) 2017/269 concerning statistics on pesticides in the EU.
has db xref: harmonised classification of substances code

organotin insecticides [I99_09]
type: Class
subclass of: harmonised classification of substances chemical class
subclass of: Restriction
  on property: member of
  some values from: other insecticides [I99]
IAO_0000115: The chemical class 'organotin insecticides' (harmonised classification of substances code I99_09), a member of the category of products 'other insecticides' in the harmonised classification of substances of annex III of Regulation (EU) 2017/269 concerning statistics on pesticides in the EU.
IAO_0000117: Michael Rubinigg
IAO_0000118: Organozinn-Insektizide @de
IAO_0000118: organotin insecticides
id: EUPH:3135
denoted by: //app.pollinatorhub.eu/vocabulary/classes/8165) the category of products 'other insecticides' in the harmonised classification of substances of annex III of Regulation (EU) 2017/269 concerning statistics on pesticides in the EU.

Axiom
annotated source: organotin insecticides [I99_09]
annotated property: IAO_0000115
annotated target: The chemical class 'organotin insecticides' (harmonised classification of substances code I99_09), a member of the category of products 'other insecticides' in the harmonised classification of substances of annex III of Regulation (EU) 2017/269 concerning statistics on pesticides in the EU.
source: https://eur-lex.europa.eu/eli/reg/2017/269/oj

Axiom
annotated source: organotin insecticides [I99_09]
annotated property: denoted by
annotated target: //app.pollinatorhub.eu/vocabulary/classes/8165) the category of products 'other insecticides' in the harmonised classification of substances of annex III of Regulation (EU) 2017/269 concerning statistics on pesticides in the EU.
has db xref: harmonised classification of substances code

oxadiazine insecticides [I99_10]
type: Class
subclass of: harmonised classification of substances chemical class
subclass of: Restriction
  on property: member of
  some values from: other insecticides [I99]
IAO_0000115: The chemical class 'oxadiazine insecticides' (harmonised classification of substances code I99_10), a member of the category of products 'other insecticides' in the harmonised classification of substances of annex III of Regulation (EU) 2017/269 concerning statistics on pesticides in the EU.
IAO_0000117: Michael Rubinigg
IAO_0000118: Oxadiazin-Insektizide @de
IAO_0000118: oxadiazine insecticides
id: EUPH:3136
denoted by: //app.pollinatorhub.eu/vocabulary/classes/8165) the category of products 'other insecticides' in the harmonised classification of substances of annex III of Regulation (EU) 2017/269 concerning statistics on pesticides in the EU.

Axiom
annotated source: oxadiazine insecticides [I99_10]
annotated property: IAO_0000115
annotated target: The chemical class 'oxadiazine insecticides' (harmonised classification of substances code I99_10), a member of the category of products 'other insecticides' in the harmonised classification of substances of annex III of Regulation (EU) 2017/269 concerning statistics on pesticides in the EU.
source: https://eur-lex.europa.eu/eli/reg/2017/269/oj

Axiom
annotated source: oxadiazine insecticides [I99_10]
annotated property: denoted by
annotated target: //app.pollinatorhub.eu/vocabulary/classes/8165) the category of products 'other insecticides' in the harmonised classification of substances of annex III of Regulation (EU) 2017/269 concerning statistics on pesticides in the EU.
has db xref: harmonised classification of substances code

phenyl-ether insecticides [I99_11]
type: Class
subclass of: harmonised classification of substances chemical class
subclass of: Restriction
  on property: member of
  some values from: other insecticides [I99]
IAO_0000115: The chemical class 'phenyl-ether insecticides' (harmonised classification of substances code I99_11), a member of the category of products 'other insecticides' in the harmonised classification of substances of annex III of Regulation (EU) 2017/269 concerning statistics on pesticides in the EU.
IAO_0000117: Michael Rubinigg
IAO_0000118: Phenylether-Insektizide @de
IAO_0000118: phenyl-ether insecticides
id: EUPH:3137
denoted by: //app.pollinatorhub.eu/vocabulary/classes/8165) the category of products 'other insecticides' in the harmonised classification of substances of annex III of Regulation (EU) 2017/269 concerning statistics on pesticides in the EU.

Axiom
annotated source: phenyl-ether insecticides [I99_11]
annotated property: IAO_0000115
annotated target: The chemical class 'phenyl-ether insecticides' (harmonised classification of substances code I99_11), a member of the category of products 'other insecticides' in the harmonised classification of substances of annex III of Regulation (EU) 2017/269 concerning statistics on pesticides in the EU.
source: https://eur-lex.europa.eu/eli/reg/2017/269/oj

Axiom
annotated source: phenyl-ether insecticides [I99_11]
annotated property: denoted by
annotated target: //app.pollinatorhub.eu/vocabulary/classes/8165) the category of products 'other insecticides' in the harmonised classification of substances of annex III of Regulation (EU) 2017/269 concerning statistics on pesticides in the EU.
has db xref: harmonised classification of substances code

pyrazole (phenyl-)insecticides [I99_12]
type: Class
subclass of: harmonised classification of substances chemical class
subclass of: Restriction
  on property: member of
  some values from: other insecticides [I99]
IAO_0000115: The chemical class 'pyrazole (phenyl-)insecticides' (harmonised classification of substances code I99_12), a member of the category of products 'other insecticides' in the harmonised classification of substances of annex III of Regulation (EU) 2017/269 concerning statistics on pesticides in the EU.
IAO_0000117: Michael Rubinigg
IAO_0000118: Pyrazol(Phenyl-)-Insektizide @de
IAO_0000118: pyrazole (phenyl-)insecticides
id: EUPH:3138
denoted by: //app.pollinatorhub.eu/vocabulary/classes/8165) the category of products 'other insecticides' in the harmonised classification of substances of annex III of Regulation (EU) 2017/269 concerning statistics on pesticides in the EU.

Axiom
annotated source: pyrazole (phenyl-)insecticides [I99_12]
annotated property: IAO_0000115
annotated target: The chemical class 'pyrazole (phenyl-)insecticides' (harmonised classification of substances code I99_12), a member of the category of products 'other insecticides' in the harmonised classification of substances of annex III of Regulation (EU) 2017/269 concerning statistics on pesticides in the EU.
source: https://eur-lex.europa.eu/eli/reg/2017/269/oj

Axiom
annotated source: pyrazole (phenyl-)insecticides [I99_12]
annotated property: denoted by
annotated target: //app.pollinatorhub.eu/vocabulary/classes/8165) the category of products 'other insecticides' in the harmonised classification of substances of annex III of Regulation (EU) 2017/269 concerning statistics on pesticides in the EU.
has db xref: harmonised classification of substances code

pyridine insecticides [I99_13]
type: Class
subclass of: harmonised classification of substances chemical class
subclass of: Restriction
  on property: member of
  some values from: other insecticides [I99]
IAO_0000115: The chemical class 'pyridine insecticides' (harmonised classification of substances code I99_13), a member of the category of products 'other insecticides' in the harmonised classification of substances of annex III of Regulation (EU) 2017/269 concerning statistics on pesticides in the EU.
IAO_0000117: Michael Rubinigg
IAO_0000118: Pyridin-Insektizide @de
IAO_0000118: pyridine insecticides
id: EUPH:3139
denoted by: //app.pollinatorhub.eu/vocabulary/classes/8165) the category of products 'other insecticides' in the harmonised classification of substances of annex III of Regulation (EU) 2017/269 concerning statistics on pesticides in the EU.

Axiom
annotated source: pyridine insecticides [I99_13]
annotated property: IAO_0000115
annotated target: The chemical class 'pyridine insecticides' (harmonised classification of substances code I99_13), a member of the category of products 'other insecticides' in the harmonised classification of substances of annex III of Regulation (EU) 2017/269 concerning statistics on pesticides in the EU.
source: https://eur-lex.europa.eu/eli/reg/2017/269/oj

Axiom
annotated source: pyridine insecticides [I99_13]
annotated property: denoted by
annotated target: //app.pollinatorhub.eu/vocabulary/classes/8165) the category of products 'other insecticides' in the harmonised classification of substances of annex III of Regulation (EU) 2017/269 concerning statistics on pesticides in the EU.
has db xref: harmonised classification of substances code

pyridymethylamine insecticides [I99_14]
type: Class
subclass of: harmonised classification of substances chemical class
subclass of: Restriction
  on property: member of
  some values from: other insecticides [I99]
IAO_0000115: The chemical class 'pyridymethylamine insecticides' (harmonised classification of substances code I99_14), a member of the category of products 'other insecticides' in the harmonised classification of substances of annex III of Regulation (EU) 2017/269 concerning statistics on pesticides in the EU.
IAO_0000117: Michael Rubinigg
IAO_0000118: Pyridylmethylamin-Insektizide @de
IAO_0000118: pyridymethylamine insecticides
id: EUPH:3140
denoted by: //app.pollinatorhub.eu/vocabulary/classes/8165) the category of products 'other insecticides' in the harmonised classification of substances of annex III of Regulation (EU) 2017/269 concerning statistics on pesticides in the EU.

Axiom
annotated source: pyridymethylamine insecticides [I99_14]
annotated property: IAO_0000115
annotated target: The chemical class 'pyridymethylamine insecticides' (harmonised classification of substances code I99_14), a member of the category of products 'other insecticides' in the harmonised classification of substances of annex III of Regulation (EU) 2017/269 concerning statistics on pesticides in the EU.
source: https://eur-lex.europa.eu/eli/reg/2017/269/oj

Axiom
annotated source: pyridymethylamine insecticides [I99_14]
annotated property: denoted by
annotated target: //app.pollinatorhub.eu/vocabulary/classes/8165) the category of products 'other insecticides' in the harmonised classification of substances of annex III of Regulation (EU) 2017/269 concerning statistics on pesticides in the EU.
has db xref: harmonised classification of substances code

sulfite ester insecticides [I99_15]
type: Class
subclass of: harmonised classification of substances chemical class
subclass of: Restriction
  on property: member of
  some values from: other insecticides [I99]
IAO_0000115: The chemical class 'sulfite ester insecticides' (harmonised classification of substances code I99_15), a member of the category of products 'other insecticides' in the harmonised classification of substances of annex III of Regulation (EU) 2017/269 concerning statistics on pesticides in the EU.
IAO_0000117: Michael Rubinigg
IAO_0000118: Sulfit-Ester-Insektizide @de
IAO_0000118: sulfite ester insecticides
id: EUPH:3141
denoted by: //app.pollinatorhub.eu/vocabulary/classes/8165) the category of products 'other insecticides' in the harmonised classification of substances of annex III of Regulation (EU) 2017/269 concerning statistics on pesticides in the EU.

Axiom
annotated source: sulfite ester insecticides [I99_15]
annotated property: IAO_0000115
annotated target: The chemical class 'sulfite ester insecticides' (harmonised classification of substances code I99_15), a member of the category of products 'other insecticides' in the harmonised classification of substances of annex III of Regulation (EU) 2017/269 concerning statistics on pesticides in the EU.
source: https://eur-lex.europa.eu/eli/reg/2017/269/oj

Axiom
annotated source: sulfite ester insecticides [I99_15]
annotated property: denoted by
annotated target: //app.pollinatorhub.eu/vocabulary/classes/8165) the category of products 'other insecticides' in the harmonised classification of substances of annex III of Regulation (EU) 2017/269 concerning statistics on pesticides in the EU.
has db xref: harmonised classification of substances code

tetronic acid insecticides [I99_17]
type: Class
subclass of: harmonised classification of substances chemical class
subclass of: Restriction
  on property: member of
  some values from: other insecticides [I99]
IAO_0000115: The chemical class 'tetronic acid insecticide' (harmonised classification of substances code I99_17), a member of the category of products 'other insecticides' in the harmonised classification of substances of annex III of Regulation (EU) 2017/269 concerning statistics on pesticides in the EU.
IAO_0000117: Michael Rubinigg
IAO_0000118: Tetronsäure-Insektizide @de
IAO_0000118: tetronic acid insecticides
id: EUPH:3142
denoted by: //app.pollinatorhub.eu/vocabulary/classes/8165) the category of products 'other insecticides' in the harmonised classification of substances of annex III of Regulation (EU) 2017/269 concerning statistics on pesticides in the EU.

Axiom
annotated source: tetronic acid insecticides [I99_17]
annotated property: IAO_0000115
annotated target: The chemical class 'tetronic acid insecticide' (harmonised classification of substances code I99_17), a member of the category of products 'other insecticides' in the harmonised classification of substances of annex III of Regulation (EU) 2017/269 concerning statistics on pesticides in the EU.
source: https://eur-lex.europa.eu/eli/reg/2017/269/oj

Axiom
annotated source: tetronic acid insecticides [I99_17]
annotated property: denoted by
annotated target: //app.pollinatorhub.eu/vocabulary/classes/8165) the category of products 'other insecticides' in the harmonised classification of substances of annex III of Regulation (EU) 2017/269 concerning statistics on pesticides in the EU.
has db xref: harmonised classification of substances code

insect attractants straight chain lepidopteran pheromones (SCLPS) [I99_18]
type: Class
subclass of: harmonised classification of substances chemical class
subclass of: Restriction
  on property: member of
  some values from: other insecticides [I99]
IAO_0000115: The chemical class 'insect attractants straight chain lepidopteran pheromones (SCLPS)' (harmonised classification of substances code I99_18), a member of the category of products 'other insecticides' in the harmonised classification of substances of annex III of Regulation (EU) 2017/269 concerning statistics on pesticides in the EU.
IAO_0000117: Michael Rubinigg
IAO_0000118: Ködergifte geradkettige Lepidopterapheromone @de
IAO_0000118: SCLPS @de
IAO_0000118: insect attractants straight chain lepidopteran pheromones
id: EUPH:3143
denoted by: //app.pollinatorhub.eu/vocabulary/classes/8165) the category of products 'other insecticides' in the harmonised classification of substances of annex III of Regulation (EU) 2017/269 concerning statistics on pesticides in the EU.

Axiom
annotated source: insect attractants straight chain lepidopteran pheromones (SCLPS) [I99_18]
annotated property: IAO_0000115
annotated target: The chemical class 'insect attractants straight chain lepidopteran pheromones (SCLPS)' (harmonised classification of substances code I99_18), a member of the category of products 'other insecticides' in the harmonised classification of substances of annex III of Regulation (EU) 2017/269 concerning statistics on pesticides in the EU.
source: https://eur-lex.europa.eu/eli/reg/2017/269/oj

Axiom
annotated source: insect attractants straight chain lepidopteran pheromones (SCLPS) [I99_18]
annotated property: denoted by
annotated target: //app.pollinatorhub.eu/vocabulary/classes/8165) the category of products 'other insecticides' in the harmonised classification of substances of annex III of Regulation (EU) 2017/269 concerning statistics on pesticides in the EU.
has db xref: harmonised classification of substances code

other insect attractants [I99_19]
type: Class
subclass of: harmonised classification of substances chemical class
subclass of: Restriction
  on property: member of
  some values from: other insecticides [I99]
IAO_0000115: The chemical class 'other insect attractants' (harmonised classification of substances code I99_19), a member of the category of products 'other insecticides' in the harmonised classification of substances of annex III of Regulation (EU) 2017/269 concerning statistics on pesticides in the EU.
IAO_0000117: Michael Rubinigg
IAO_0000118: andere Ködergifte @de
IAO_0000118: other insect attractants
id: EUPH:3144
denoted by: //app.pollinatorhub.eu/vocabulary/classes/8165) the category of products 'other insecticides' in the harmonised classification of substances of annex III of Regulation (EU) 2017/269 concerning statistics on pesticides in the EU.

Axiom
annotated source: other insect attractants [I99_19]
annotated property: IAO_0000115
annotated target: The chemical class 'other insect attractants' (harmonised classification of substances code I99_19), a member of the category of products 'other insecticides' in the harmonised classification of substances of annex III of Regulation (EU) 2017/269 concerning statistics on pesticides in the EU.
source: https://eur-lex.europa.eu/eli/reg/2017/269/oj

Axiom
annotated source: other insect attractants [I99_19]
annotated property: denoted by
annotated target: //app.pollinatorhub.eu/vocabulary/classes/8165) the category of products 'other insecticides' in the harmonised classification of substances of annex III of Regulation (EU) 2017/269 concerning statistics on pesticides in the EU.
has db xref: harmonised classification of substances code

unclassified insecticides-acaricides [I99_99]
type: Class
subclass of: harmonised classification of substances chemical class
subclass of: Restriction
  on property: member of
  some values from: other insecticides [I99]
IAO_0000115: The chemical class 'unclassified insecticides-acaricides' (harmonised classification of substances code I99_99), a member of the category of products 'other insecticides' in the harmonised classification of substances of annex III of Regulation (EU) 2017/269 concerning statistics on pesticides in the EU.
IAO_0000117: Michael Rubinigg
IAO_0000118: nicht zugeordnete Insektizide/Akarizide @de
IAO_0000118: unclassified insecticides-acaricides
id: EUPH:3145
denoted by: //app.pollinatorhub.eu/vocabulary/classes/8165) the category of products 'other insecticides' in the harmonised classification of substances of annex III of Regulation (EU) 2017/269 concerning statistics on pesticides in the EU.

Axiom
annotated source: unclassified insecticides-acaricides [I99_99]
annotated property: IAO_0000115
annotated target: The chemical class 'unclassified insecticides-acaricides' (harmonised classification of substances code I99_99), a member of the category of products 'other insecticides' in the harmonised classification of substances of annex III of Regulation (EU) 2017/269 concerning statistics on pesticides in the EU.
source: https://eur-lex.europa.eu/eli/reg/2017/269/oj

Axiom
annotated source: unclassified insecticides-acaricides [I99_99]
annotated property: denoted by
annotated target: //app.pollinatorhub.eu/vocabulary/classes/8165) the category of products 'other insecticides' in the harmonised classification of substances of annex III of Regulation (EU) 2017/269 concerning statistics on pesticides in the EU.
has db xref: harmonised classification of substances code

molluscicides [PES_M]
type: Class
subclass of: harmonised classification of substances major groups
IAO_0000115: The major group 'molluscicides' (harmonised classification of substances code PES_M or Euro SDMX registry code M) of the harmonised classification of substances in annex III of Regulation (EU) 2017/269 concerning statistics on pesticides in the EU.
IAO_0000117: Michael Rubinigg
IAO_0000118: Molluskizide @de
IAO_0000118: molluscicides
id: EUPH:3146
denoted by: //app.pollinatorhub.eu/vocabulary/classes/8244) M) of the harmonised classification of substances in annex III of Regulation (EU) 2017/269 concerning statistics on pesticides in the EU.

Axiom
annotated source: molluscicides [PES_M]
annotated property: IAO_0000115
annotated target: The major group 'molluscicides' (harmonised classification of substances code PES_M or Euro SDMX registry code M) of the harmonised classification of substances in annex III of Regulation (EU) 2017/269 concerning statistics on pesticides in the EU.
source: https://eur-lex.europa.eu/eli/reg/2017/269/oj

Axiom
annotated source: molluscicides [PES_M]
annotated property: denoted by
annotated target: //app.pollinatorhub.eu/vocabulary/classes/8244) M) of the harmonised classification of substances in annex III of Regulation (EU) 2017/269 concerning statistics on pesticides in the EU.
has db xref: harmonised classification of substances code

molluscicides [M01]
type: Class
subclass of: harmonised classification of substances categories of products
subclass of: Restriction
  on property: member of
  some values from: molluscicides [PES_M]
IAO_0000115: The category of products 'molluscicides' (harmonised classification of substances code M01), a member of the major group 'molluscicides' in the harmonised classification of substances of annex III of Regulation (EU) 2017/269 concerning statistics on pesticides in the EU.
IAO_0000117: Michael Rubinigg
IAO_0000118: Molluskizide @de
IAO_0000118: molluscicides
id: EUPH:3147
denoted by: //app.pollinatorhub.eu/vocabulary/classes/8165) the major group 'molluscicides' in the harmonised classification of substances of annex III of Regulation (EU) 2017/269 concerning statistics on pesticides in the EU.

Axiom
annotated source: molluscicides [M01]
annotated property: IAO_0000115
annotated target: The category of products 'molluscicides' (harmonised classification of substances code M01), a member of the major group 'molluscicides' in the harmonised classification of substances of annex III of Regulation (EU) 2017/269 concerning statistics on pesticides in the EU.
source: https://eur-lex.europa.eu/eli/reg/2017/269/oj

Axiom
annotated source: molluscicides [M01]
annotated property: denoted by
annotated target: //app.pollinatorhub.eu/vocabulary/classes/8165) the major group 'molluscicides' in the harmonised classification of substances of annex III of Regulation (EU) 2017/269 concerning statistics on pesticides in the EU.
has db xref: harmonised classification of substances code

molluscicides [M01_01]
type: Class
subclass of: harmonised classification of substances chemical class
subclass of: Restriction
  on property: member of
  some values from: molluscicides [M01]
IAO_0000115: The chemical class 'molluscicides' (harmonised classification of substances code M01_01), a member of the category of products 'molluscicides' in the harmonised classification of substances of annex III of Regulation (EU) 2017/269 concerning statistics on pesticides in the EU.
IAO_0000117: Michael Rubinigg
IAO_0000118: Molluskizide @de
IAO_0000118: molluscicides
id: EUPH:3148
denoted by: //app.pollinatorhub.eu/vocabulary/classes/8165) the category of products 'molluscicides' in the harmonised classification of substances of annex III of Regulation (EU) 2017/269 concerning statistics on pesticides in the EU.

Axiom
annotated source: molluscicides [M01_01]
annotated property: IAO_0000115
annotated target: The chemical class 'molluscicides' (harmonised classification of substances code M01_01), a member of the category of products 'molluscicides' in the harmonised classification of substances of annex III of Regulation (EU) 2017/269 concerning statistics on pesticides in the EU.
source: https://eur-lex.europa.eu/eli/reg/2017/269/oj

Axiom
annotated source: molluscicides [M01_01]
annotated property: denoted by
annotated target: //app.pollinatorhub.eu/vocabulary/classes/8165) the category of products 'molluscicides' in the harmonised classification of substances of annex III of Regulation (EU) 2017/269 concerning statistics on pesticides in the EU.
has db xref: harmonised classification of substances code

plant growth regulators [PES_PGR]
type: Class
subclass of: harmonised classification of substances major groups
IAO_0000115: The major group 'plant growth regulators' (harmonised classification of substances code PES_PGR or Euro SDMX registry code PGR) of the harmonised classification of substances in annex III of Regulation (EU) 2017/269 concerning statistics on pesticides in the EU.the EU.
IAO_0000117: Michael Rubinigg
IAO_0000118: Pflanzenwachstumsregler @de
IAO_0000118: plant growth regulators
id: EUPH:3149
denoted by: //app.pollinatorhub.eu/vocabulary/classes/8244) PGR) of the harmonised classification of substances in annex III of Regulation (EU) 2017/269 concerning statistics on pesticides in the EU.the EU.

Axiom
annotated source: plant growth regulators [PES_PGR]
annotated property: IAO_0000115
annotated target: The major group 'plant growth regulators' (harmonised classification of substances code PES_PGR or Euro SDMX registry code PGR) of the harmonised classification of substances in annex III of Regulation (EU) 2017/269 concerning statistics on pesticides in the EU.the EU.
source: https://eur-lex.europa.eu/eli/reg/2017/269/oj

Axiom
annotated source: plant growth regulators [PES_PGR]
annotated property: denoted by
annotated target: //app.pollinatorhub.eu/vocabulary/classes/8244) PGR) of the harmonised classification of substances in annex III of Regulation (EU) 2017/269 concerning statistics on pesticides in the EU.the EU.
has db xref: harmonised classification of substances code

physiological plant growth regulators [PGR01]
type: Class
subclass of: harmonised classification of substances categories of products
subclass of: Restriction
  on property: member of
  some values from: plant growth regulators [PES_PGR]
IAO_0000115: The category of products 'physiological plant growth regulators' (harmonised classification of substances code PGR01), a member of the major group 'plant growth regulators' in the harmonised classification of substances of annex III of Regulation (EU) 2017/269 concerning statistics on pesticides in the EU.
IAO_0000117: Michael Rubinigg
IAO_0000118: physiological plant growth regulators
IAO_0000118: physiologisch wirkende Pflanzenwachstumsregler @de
id: EUPH:3150
denoted by: //app.pollinatorhub.eu/vocabulary/classes/8165) the major group 'plant growth regulators' in the harmonised classification of substances of annex III of Regulation (EU) 2017/269 concerning statistics on pesticides in the EU.

Axiom
annotated source: physiological plant growth regulators [PGR01]
annotated property: IAO_0000115
annotated target: The category of products 'physiological plant growth regulators' (harmonised classification of substances code PGR01), a member of the major group 'plant growth regulators' in the harmonised classification of substances of annex III of Regulation (EU) 2017/269 concerning statistics on pesticides in the EU.
source: https://eur-lex.europa.eu/eli/reg/2017/269/oj

Axiom
annotated source: physiological plant growth regulators [PGR01]
annotated property: denoted by
annotated target: //app.pollinatorhub.eu/vocabulary/classes/8165) the major group 'plant growth regulators' in the harmonised classification of substances of annex III of Regulation (EU) 2017/269 concerning statistics on pesticides in the EU.
has db xref: harmonised classification of substances code

physiological plant regulators [PGR01_01]
type: Class
subclass of: harmonised classification of substances chemical class
subclass of: Restriction
  on property: member of
  some values from: physiological plant growth regulators [PGR01]
IAO_0000115: The chemical class 'physiological plant regulators' (harmonised classification of substances code PGR01_01), a member of the category of products 'physiological plant growth regulators' in the harmonised classification of substances of annex III of Regulation (EU) 2017/269 concerning statistics on pesticides in the EU.
IAO_0000117: Michael Rubinigg
IAO_0000118: physiological plant regulators
IAO_0000118: physiologisch wirkende Pflanzenwachstumsregler @de
id: EUPH:3151
denoted by: //app.pollinatorhub.eu/vocabulary/classes/8165) the category of products 'physiological plant growth regulators' in the harmonised classification of substances of annex III of Regulation (EU) 2017/269 concerning statistics on pesticides in the EU.

Axiom
annotated source: physiological plant regulators [PGR01_01]
annotated property: IAO_0000115
annotated target: The chemical class 'physiological plant regulators' (harmonised classification of substances code PGR01_01), a member of the category of products 'physiological plant growth regulators' in the harmonised classification of substances of annex III of Regulation (EU) 2017/269 concerning statistics on pesticides in the EU.
source: https://eur-lex.europa.eu/eli/reg/2017/269/oj

Axiom
annotated source: physiological plant regulators [PGR01_01]
annotated property: denoted by
annotated target: //app.pollinatorhub.eu/vocabulary/classes/8165) the category of products 'physiological plant growth regulators' in the harmonised classification of substances of annex III of Regulation (EU) 2017/269 concerning statistics on pesticides in the EU.
has db xref: harmonised classification of substances code

other physiological plant growth regulators [PGR01_99]
type: Class
subclass of: harmonised classification of substances chemical class
subclass of: Restriction
  on property: member of
  some values from: physiological plant growth regulators [PGR01]
IAO_0000115: The chemical class 'other physiological plant growth regulators' (harmonised classification of substances code PGR01_99), a member of the category of products 'physiological plant growth regulators' in the harmonised classification of substances of annex III of Regulation (EU) 2017/269 concerning statistics on pesticides in the EU.
IAO_0000117: Michael Rubinigg
IAO_0000118: other physiological plant growth regulators
IAO_0000118: sonstige physiologisch wirkende Pflanzenwachstumsregler @de
id: EUPH:3152
denoted by: //app.pollinatorhub.eu/vocabulary/classes/8165) the category of products 'physiological plant growth regulators' in the harmonised classification of substances of annex III of Regulation (EU) 2017/269 concerning statistics on pesticides in the EU.

Axiom
annotated source: other physiological plant growth regulators [PGR01_99]
annotated property: IAO_0000115
annotated target: The chemical class 'other physiological plant growth regulators' (harmonised classification of substances code PGR01_99), a member of the category of products 'physiological plant growth regulators' in the harmonised classification of substances of annex III of Regulation (EU) 2017/269 concerning statistics on pesticides in the EU.
source: https://eur-lex.europa.eu/eli/reg/2017/269/oj

Axiom
annotated source: other physiological plant growth regulators [PGR01_99]
annotated property: denoted by
annotated target: //app.pollinatorhub.eu/vocabulary/classes/8165) the category of products 'physiological plant growth regulators' in the harmonised classification of substances of annex III of Regulation (EU) 2017/269 concerning statistics on pesticides in the EU.
has db xref: harmonised classification of substances code

anti-sprouting products [PGR02]
type: Class
subclass of: harmonised classification of substances categories of products
subclass of: Restriction
  on property: member of
  some values from: plant growth regulators [PES_PGR]
IAO_0000115: The category of products 'anti-sprouting products' (harmonised classification of substances code PGR02), a member of the major group 'plant growth regulators' in the harmonised classification of substances of annex III of Regulation (EU) 2017/269 concerning statistics on pesticides in the EU.
IAO_0000117: Michael Rubinigg
IAO_0000118: Keimhemmungsmittel @de
IAO_0000118: anti-sprouting products
id: EUPH:3153
denoted by: //app.pollinatorhub.eu/vocabulary/classes/8165) the major group 'plant growth regulators' in the harmonised classification of substances of annex III of Regulation (EU) 2017/269 concerning statistics on pesticides in the EU.

Axiom
annotated source: anti-sprouting products [PGR02]
annotated property: IAO_0000115
annotated target: The category of products 'anti-sprouting products' (harmonised classification of substances code PGR02), a member of the major group 'plant growth regulators' in the harmonised classification of substances of annex III of Regulation (EU) 2017/269 concerning statistics on pesticides in the EU.
source: https://eur-lex.europa.eu/eli/reg/2017/269/oj

Axiom
annotated source: anti-sprouting products [PGR02]
annotated property: denoted by
annotated target: //app.pollinatorhub.eu/vocabulary/classes/8165) the major group 'plant growth regulators' in the harmonised classification of substances of annex III of Regulation (EU) 2017/269 concerning statistics on pesticides in the EU.
has db xref: harmonised classification of substances code

antisprouting products [PGR02_02]
type: Class
subclass of: harmonised classification of substances chemical class
subclass of: Restriction
  on property: member of
  some values from: anti-sprouting products [PGR02]
IAO_0000115: The chemical class 'antisprouting products' (harmonised classification of substances code PGR02_02), a member of the category of products 'anti-sprouting products' in the harmonised classification of substances of annex III of Regulation (EU) 2017/269 concerning statistics on pesticides in the EU.
IAO_0000117: Michael Rubinigg
IAO_0000118: Keimungshemmer @de
IAO_0000118: antisprouting products
id: EUPH:3154
denoted by: //app.pollinatorhub.eu/vocabulary/classes/8165) the category of products 'anti-sprouting products' in the harmonised classification of substances of annex III of Regulation (EU) 2017/269 concerning statistics on pesticides in the EU.

Axiom
annotated source: antisprouting products [PGR02_02]
annotated property: IAO_0000115
annotated target: The chemical class 'antisprouting products' (harmonised classification of substances code PGR02_02), a member of the category of products 'anti-sprouting products' in the harmonised classification of substances of annex III of Regulation (EU) 2017/269 concerning statistics on pesticides in the EU.
source: https://eur-lex.europa.eu/eli/reg/2017/269/oj

Axiom
annotated source: antisprouting products [PGR02_02]
annotated property: denoted by
annotated target: //app.pollinatorhub.eu/vocabulary/classes/8165) the category of products 'anti-sprouting products' in the harmonised classification of substances of annex III of Regulation (EU) 2017/269 concerning statistics on pesticides in the EU.
has db xref: harmonised classification of substances code

other antisprouting products [PGR02_99]
type: Class
subclass of: harmonised classification of substances chemical class
subclass of: Restriction
  on property: member of
  some values from: anti-sprouting products [PGR02]
IAO_0000115: The chemical class 'other antisprouting products' (harmonised classification of substances code PGR02_99), a member of the category of products 'anti-sprouting products' in the harmonised classification of substances of annex III of Regulation (EU) 2017/269 concerning statistics on pesticides in the EU.
IAO_0000117: Michael Rubinigg
IAO_0000118: other antisprouting products
IAO_0000118: sonstige Keimungshemmer @de
id: EUPH:3155
denoted by: //app.pollinatorhub.eu/vocabulary/classes/8165) the category of products 'anti-sprouting products' in the harmonised classification of substances of annex III of Regulation (EU) 2017/269 concerning statistics on pesticides in the EU.

Axiom
annotated source: other antisprouting products [PGR02_99]
annotated property: IAO_0000115
annotated target: The chemical class 'other antisprouting products' (harmonised classification of substances code PGR02_99), a member of the category of products 'anti-sprouting products' in the harmonised classification of substances of annex III of Regulation (EU) 2017/269 concerning statistics on pesticides in the EU.
source: https://eur-lex.europa.eu/eli/reg/2017/269/oj

Axiom
annotated source: other antisprouting products [PGR02_99]
annotated property: denoted by
annotated target: //app.pollinatorhub.eu/vocabulary/classes/8165) the category of products 'anti-sprouting products' in the harmonised classification of substances of annex III of Regulation (EU) 2017/269 concerning statistics on pesticides in the EU.
has db xref: harmonised classification of substances code

other plant growth regulators [PGR03]
type: Class
subclass of: harmonised classification of substances categories of products
subclass of: Restriction
  on property: member of
  some values from: plant growth regulators [PES_PGR]
IAO_0000115: The category of products 'other plant growth regulators' (harmonised classification of substances code PGR03), a member of the major group 'plant growth regulators' in the harmonised classification of substances of annex III of Regulation (EU) 2017/269 concerning statistics on pesticides in the EU.
IAO_0000117: Michael Rubinigg
IAO_0000118: other plant growth regulators
IAO_0000118: sonstige Pflanzenwachstumsregler @de
id: EUPH:3156
denoted by: //app.pollinatorhub.eu/vocabulary/classes/8165) the major group 'plant growth regulators' in the harmonised classification of substances of annex III of Regulation (EU) 2017/269 concerning statistics on pesticides in the EU.

Axiom
annotated source: other plant growth regulators [PGR03]
annotated property: IAO_0000115
annotated target: The category of products 'other plant growth regulators' (harmonised classification of substances code PGR03), a member of the major group 'plant growth regulators' in the harmonised classification of substances of annex III of Regulation (EU) 2017/269 concerning statistics on pesticides in the EU.
source: https://eur-lex.europa.eu/eli/reg/2017/269/oj

Axiom
annotated source: other plant growth regulators [PGR03]
annotated property: denoted by
annotated target: //app.pollinatorhub.eu/vocabulary/classes/8165) the major group 'plant growth regulators' in the harmonised classification of substances of annex III of Regulation (EU) 2017/269 concerning statistics on pesticides in the EU.
has db xref: harmonised classification of substances code

other plant growth regulators [PGR03_99]
type: Class
subclass of: harmonised classification of substances chemical class
subclass of: Restriction
  on property: member of
  some values from: other plant growth regulators [PGR03]
IAO_0000115: The chemical class 'other plant growth regulators' ([code](harmonised classification of substances code) PGR03_99), a member of the category of products 'other plant growth regulators' in the harmonised classification of substances of annex III of Regulation (EU) 2017/269 concerning statistics on pesticides in the EU.
IAO_0000117: Michael Rubinigg
IAO_0000118: other plant growth regulators
IAO_0000118: sonstige Pflanzenwachstumsregler @de
id: EUPH:3157
denoted by: //app.pollinatorhub.eu/vocabulary/classes/8165) the category of products 'other plant growth regulators' in the harmonised classification of substances of annex III of Regulation (EU) 2017/269 concerning statistics on pesticides in the EU.

Axiom
annotated source: other plant growth regulators [PGR03_99]
annotated property: IAO_0000115
annotated target: The chemical class 'other plant growth regulators' ([code](harmonised classification of substances code) PGR03_99), a member of the category of products 'other plant growth regulators' in the harmonised classification of substances of annex III of Regulation (EU) 2017/269 concerning statistics on pesticides in the EU.
source: https://eur-lex.europa.eu/eli/reg/2017/269/oj

Axiom
annotated source: other plant growth regulators [PGR03_99]
annotated property: denoted by
annotated target: //app.pollinatorhub.eu/vocabulary/classes/8165) the category of products 'other plant growth regulators' in the harmonised classification of substances of annex III of Regulation (EU) 2017/269 concerning statistics on pesticides in the EU.
has db xref: harmonised classification of substances code

other plant protection products [PES_ZR]
type: Class
subclass of: harmonised classification of substances major groups
IAO_0000115: The major group 'other plant protection products' (harmonised classification of substances code PES_ZR or Euro SDMX registry code ZR) of the harmonised classification of substances in annex III of Regulation (EU) 2017/269 concerning statistics on pesticides in the EU.the EU.
IAO_0000117: Michael Rubinigg
IAO_0000118: other plant protection products
IAO_0000118: sonstige Pflanzenschutzmittel @de
id: EUPH:3158
denoted by: //app.pollinatorhub.eu/vocabulary/classes/8244) ZR) of the harmonised classification of substances in annex III of Regulation (EU) 2017/269 concerning statistics on pesticides in the EU.the EU.

Axiom
annotated source: other plant protection products [PES_ZR]
annotated property: IAO_0000115
annotated target: The major group 'other plant protection products' (harmonised classification of substances code PES_ZR or Euro SDMX registry code ZR) of the harmonised classification of substances in annex III of Regulation (EU) 2017/269 concerning statistics on pesticides in the EU.the EU.
source: https://eur-lex.europa.eu/eli/reg/2017/269/oj

Axiom
annotated source: other plant protection products [PES_ZR]
annotated property: denoted by
annotated target: //app.pollinatorhub.eu/vocabulary/classes/8244) ZR) of the harmonised classification of substances in annex III of Regulation (EU) 2017/269 concerning statistics on pesticides in the EU.the EU.
has db xref: harmonised classification of substances code

vegetal oils [ZR02]
type: Class
subclass of: harmonised classification of substances categories of products
subclass of: Restriction
  on property: member of
  some values from: other plant protection products [PES_ZR]
IAO_0000115: The category of products 'vegetal oils' (harmonised classification of substances code ZR02), a member of the major group 'other plant protection products' in the harmonised classification of substances of annex III of Regulation (EU) 2017/269 concerning statistics on pesticides in the EU.
IAO_0000117: Michael Rubinigg
IAO_0000118: Pflanzenöle @de
IAO_0000118: vegetal oils
id: EUPH:3159
denoted by: //app.pollinatorhub.eu/vocabulary/classes/8165) the major group 'other plant protection products' in the harmonised classification of substances of annex III of Regulation (EU) 2017/269 concerning statistics on pesticides in the EU.

Axiom
annotated source: vegetal oils [ZR02]
annotated property: IAO_0000115
annotated target: The category of products 'vegetal oils' (harmonised classification of substances code ZR02), a member of the major group 'other plant protection products' in the harmonised classification of substances of annex III of Regulation (EU) 2017/269 concerning statistics on pesticides in the EU.
source: https://eur-lex.europa.eu/eli/reg/2017/269/oj

Axiom
annotated source: vegetal oils [ZR02]
annotated property: denoted by
annotated target: //app.pollinatorhub.eu/vocabulary/classes/8165) the major group 'other plant protection products' in the harmonised classification of substances of annex III of Regulation (EU) 2017/269 concerning statistics on pesticides in the EU.
has db xref: harmonised classification of substances code

vegetal oils [ZR02_01]
type: Class
subclass of: harmonised classification of substances chemical class
subclass of: Restriction
  on property: member of
  some values from: vegetal oils [ZR02]
IAO_0000115: The chemical class 'vegetal oils' (harmonised classification of substances code ZR02_01), a member of the category of products 'vegetal oils' in the harmonised classification of substances of annex III of Regulation (EU) 2017/269 concerning statistics on pesticides in the EU.
IAO_0000117: Michael Rubinigg
IAO_0000118: Pflanzenöle @de
IAO_0000118: vegetal oils
id: EUPH:3160
denoted by: //app.pollinatorhub.eu/vocabulary/classes/8165) the category of products 'vegetal oils' in the harmonised classification of substances of annex III of Regulation (EU) 2017/269 concerning statistics on pesticides in the EU.

Axiom
annotated source: vegetal oils [ZR02_01]
annotated property: IAO_0000115
annotated target: The chemical class 'vegetal oils' (harmonised classification of substances code ZR02_01), a member of the category of products 'vegetal oils' in the harmonised classification of substances of annex III of Regulation (EU) 2017/269 concerning statistics on pesticides in the EU.
source: https://eur-lex.europa.eu/eli/reg/2017/269/oj

Axiom
annotated source: vegetal oils [ZR02_01]
annotated property: denoted by
annotated target: //app.pollinatorhub.eu/vocabulary/classes/8165) the category of products 'vegetal oils' in the harmonised classification of substances of annex III of Regulation (EU) 2017/269 concerning statistics on pesticides in the EU.
has db xref: harmonised classification of substances code

soil sterilants including nematicides [ZR03]
type: Class
subclass of: harmonised classification of substances categories of products
subclass of: Restriction
  on property: member of
  some values from: other plant protection products [PES_ZR]
IAO_0000115: The category of products 'soil sterilants (incl. nematicides)' (harmonised classification of substances code ZR03), a member of the major group 'other plant protection products' in the harmonised classification of substances of annex III of Regulation (EU) 2017/269 concerning statistics on pesticides in the EU.
IAO_0000117: Michael Rubinigg
IAO_0000118: Bodenentseuchungsmittel (einschließlich Nematizide) @de
IAO_0000118: soil sterilants (incl. nematicides)
id: EUPH:3161
denoted by: //app.pollinatorhub.eu/vocabulary/classes/8165) the major group 'other plant protection products' in the harmonised classification of substances of annex III of Regulation (EU) 2017/269 concerning statistics on pesticides in the EU.

Axiom
annotated source: soil sterilants including nematicides [ZR03]
annotated property: IAO_0000115
annotated target: The category of products 'soil sterilants (incl. nematicides)' (harmonised classification of substances code ZR03), a member of the major group 'other plant protection products' in the harmonised classification of substances of annex III of Regulation (EU) 2017/269 concerning statistics on pesticides in the EU.
source: https://eur-lex.europa.eu/eli/reg/2017/269/oj

Axiom
annotated source: soil sterilants including nematicides [ZR03]
annotated property: denoted by
annotated target: //app.pollinatorhub.eu/vocabulary/classes/8165) the major group 'other plant protection products' in the harmonised classification of substances of annex III of Regulation (EU) 2017/269 concerning statistics on pesticides in the EU.
has db xref: harmonised classification of substances code

methyl bromide [ZR03_01]
type: Class
subclass of: harmonised classification of substances chemical class
subclass of: Restriction
  on property: member of
  some values from: soil sterilants including nematicides [ZR03]
IAO_0000115: The chemical class 'methyl bromide' (harmonised classification of substances code ZR03_01), a member of the category of products 'soil sterilants including nematicides' in the harmonised classification of substances of annex III of Regulation (EU) 2017/269 concerning statistics on pesticides in the EU.
IAO_0000117: Michael Rubinigg
IAO_0000118: Methylbromid @de
IAO_0000118: methyl bromide
id: EUPH:3162
denoted by: //app.pollinatorhub.eu/vocabulary/classes/8165) the category of products 'soil sterilants including nematicides' in the harmonised classification of substances of annex III of Regulation (EU) 2017/269 concerning statistics on pesticides in the EU.

Axiom
annotated source: methyl bromide [ZR03_01]
annotated property: IAO_0000115
annotated target: The chemical class 'methyl bromide' (harmonised classification of substances code ZR03_01), a member of the category of products 'soil sterilants including nematicides' in the harmonised classification of substances of annex III of Regulation (EU) 2017/269 concerning statistics on pesticides in the EU.
source: https://eur-lex.europa.eu/eli/reg/2017/269/oj

Axiom
annotated source: methyl bromide [ZR03_01]
annotated property: denoted by
annotated target: //app.pollinatorhub.eu/vocabulary/classes/8165) the category of products 'soil sterilants including nematicides' in the harmonised classification of substances of annex III of Regulation (EU) 2017/269 concerning statistics on pesticides in the EU.
has db xref: harmonised classification of substances code

biological nematicides [ZR03_02]
type: Class
subclass of: harmonised classification of substances chemical class
subclass of: Restriction
  on property: member of
  some values from: soil sterilants including nematicides [ZR03]
IAO_0000115: The chemical class 'biological nematicides' (harmonised classification of substances code ZR03_02), a member of the category of products 'soil sterilants including nematicides' in the harmonised classification of substances of annex III of Regulation (EU) 2017/269 concerning statistics on pesticides in the EU.
IAO_0000117: Michael Rubinigg
IAO_0000118: biological nematicides
IAO_0000118: biologische Nematizide @de
id: EUPH:3163
denoted by: //app.pollinatorhub.eu/vocabulary/classes/8165) the category of products 'soil sterilants including nematicides' in the harmonised classification of substances of annex III of Regulation (EU) 2017/269 concerning statistics on pesticides in the EU.

Axiom
annotated source: biological nematicides [ZR03_02]
annotated property: IAO_0000115
annotated target: The chemical class 'biological nematicides' (harmonised classification of substances code ZR03_02), a member of the category of products 'soil sterilants including nematicides' in the harmonised classification of substances of annex III of Regulation (EU) 2017/269 concerning statistics on pesticides in the EU.
source: https://eur-lex.europa.eu/eli/reg/2017/269/oj

Axiom
annotated source: biological nematicides [ZR03_02]
annotated property: denoted by
annotated target: //app.pollinatorhub.eu/vocabulary/classes/8165) the category of products 'soil sterilants including nematicides' in the harmonised classification of substances of annex III of Regulation (EU) 2017/269 concerning statistics on pesticides in the EU.
has db xref: harmonised classification of substances code

organophosphorous nematicides [ZR03_03]
type: Class
subclass of: harmonised classification of substances chemical class
subclass of: Restriction
  on property: member of
  some values from: soil sterilants including nematicides [ZR03]
IAO_0000115: The chemical class 'organophosphorous nematicides' (harmonised classification of substances code ZR03_03), a member of the category of products 'soil sterilants including nematicides' in the harmonised classification of substances of annex III of Regulation (EU) 2017/269 concerning statistics on pesticides in the EU.
IAO_0000117: Michael Rubinigg
IAO_0000118: Organophosphor-Nematizide @de
IAO_0000118: organophosphorous nematicides
id: EUPH:3164
denoted by: //app.pollinatorhub.eu/vocabulary/classes/8165) the category of products 'soil sterilants including nematicides' in the harmonised classification of substances of annex III of Regulation (EU) 2017/269 concerning statistics on pesticides in the EU.

Axiom
annotated source: organophosphorous nematicides [ZR03_03]
annotated property: IAO_0000115
annotated target: The chemical class 'organophosphorous nematicides' (harmonised classification of substances code ZR03_03), a member of the category of products 'soil sterilants including nematicides' in the harmonised classification of substances of annex III of Regulation (EU) 2017/269 concerning statistics on pesticides in the EU.
source: https://eur-lex.europa.eu/eli/reg/2017/269/oj

Axiom
annotated source: organophosphorous nematicides [ZR03_03]
annotated property: denoted by
annotated target: //app.pollinatorhub.eu/vocabulary/classes/8165) the category of products 'soil sterilants including nematicides' in the harmonised classification of substances of annex III of Regulation (EU) 2017/269 concerning statistics on pesticides in the EU.
has db xref: harmonised classification of substances code

other soil sterilants [ZR03_99]
type: Class
subclass of: harmonised classification of substances chemical class
subclass of: Restriction
  on property: member of
  some values from: soil sterilants including nematicides [ZR03]
IAO_0000115: The chemical class 'other soil sterilants' (harmonised classification of substances code ZR03_99), a member of the category of products 'soil sterilants including nematicides' in the harmonised classification of substances of annex III of Regulation (EU) 2017/269 concerning statistics on pesticides in the EU.
IAO_0000117: Michael Rubinigg
IAO_0000118: other soil sterilants
IAO_0000118: sonstige Bodenentseuchungsmittel @de
id: EUPH:3165
denoted by: //app.pollinatorhub.eu/vocabulary/classes/8165) the category of products 'soil sterilants including nematicides' in the harmonised classification of substances of annex III of Regulation (EU) 2017/269 concerning statistics on pesticides in the EU.

Axiom
annotated source: other soil sterilants [ZR03_99]
annotated property: IAO_0000115
annotated target: The chemical class 'other soil sterilants' (harmonised classification of substances code ZR03_99), a member of the category of products 'soil sterilants including nematicides' in the harmonised classification of substances of annex III of Regulation (EU) 2017/269 concerning statistics on pesticides in the EU.
source: https://eur-lex.europa.eu/eli/reg/2017/269/oj

Axiom
annotated source: other soil sterilants [ZR03_99]
annotated property: denoted by
annotated target: //app.pollinatorhub.eu/vocabulary/classes/8165) the category of products 'soil sterilants including nematicides' in the harmonised classification of substances of annex III of Regulation (EU) 2017/269 concerning statistics on pesticides in the EU.
has db xref: harmonised classification of substances code

rodenticides [ZR04]
type: Class
subclass of: harmonised classification of substances categories of products
subclass of: Restriction
  on property: member of
  some values from: other plant protection products [PES_ZR]
IAO_0000115: The category of products 'rodenticides' (harmonised classification of substances code ZR04), a member of the major group 'other plant protection products' in the harmonised classification of substances of annex III of Regulation (EU) 2017/269 concerning statistics on pesticides in the EU.
IAO_0000117: Michael Rubinigg
IAO_0000118: Rodentizide @de
IAO_0000118: rodenticides
id: EUPH:3166
denoted by: //app.pollinatorhub.eu/vocabulary/classes/8165) the major group 'other plant protection products' in the harmonised classification of substances of annex III of Regulation (EU) 2017/269 concerning statistics on pesticides in the EU.

Axiom
annotated source: rodenticides [ZR04]
annotated property: IAO_0000115
annotated target: The category of products 'rodenticides' (harmonised classification of substances code ZR04), a member of the major group 'other plant protection products' in the harmonised classification of substances of annex III of Regulation (EU) 2017/269 concerning statistics on pesticides in the EU.
source: https://eur-lex.europa.eu/eli/reg/2017/269/oj

Axiom
annotated source: rodenticides [ZR04]
annotated property: denoted by
annotated target: //app.pollinatorhub.eu/vocabulary/classes/8165) the major group 'other plant protection products' in the harmonised classification of substances of annex III of Regulation (EU) 2017/269 concerning statistics on pesticides in the EU.
has db xref: harmonised classification of substances code

rodenticides [ZR04_01]
type: Class
subclass of: harmonised classification of substances chemical class
subclass of: Restriction
  on property: member of
  some values from: rodenticides [ZR04]
IAO_0000115: The chemical class 'rodenticides' (harmonised classification of substances code ZR04_01), a member of the category of products 'rodenticides' in the harmonised classification of substances of annex III of Regulation (EU) 2017/269 concerning statistics on pesticides in the EU.
IAO_0000117: Michael Rubinigg
IAO_0000118: Rodentizide @de
IAO_0000118: rodenticides
id: EUPH:3167
denoted by: //app.pollinatorhub.eu/vocabulary/classes/8165) the category of products 'rodenticides' in the harmonised classification of substances of annex III of Regulation (EU) 2017/269 concerning statistics on pesticides in the EU.

Axiom
annotated source: rodenticides [ZR04_01]
annotated property: IAO_0000115
annotated target: The chemical class 'rodenticides' (harmonised classification of substances code ZR04_01), a member of the category of products 'rodenticides' in the harmonised classification of substances of annex III of Regulation (EU) 2017/269 concerning statistics on pesticides in the EU.
source: https://eur-lex.europa.eu/eli/reg/2017/269/oj

Axiom
annotated source: rodenticides [ZR04_01]
annotated property: denoted by
annotated target: //app.pollinatorhub.eu/vocabulary/classes/8165) the category of products 'rodenticides' in the harmonised classification of substances of annex III of Regulation (EU) 2017/269 concerning statistics on pesticides in the EU.
has db xref: harmonised classification of substances code

all other plant protection products [ZR99]
type: Class
subclass of: harmonised classification of substances categories of products
subclass of: Restriction
  on property: member of
  some values from: other plant protection products [PES_ZR]
IAO_0000115: The category of products 'all other plant protection products' (harmonised classification of substances code ZR99), a member of the major group 'other plant protection products' in the harmonised classification of substances of annex III of Regulation (EU) 2017/269 concerning statistics on pesticides in the EU.
IAO_0000117: Michael Rubinigg
IAO_0000118: all other plant protection products
IAO_0000118: alle sonstigen Pflanzenschutzmittel @de
id: EUPH:3168
denoted by: //app.pollinatorhub.eu/vocabulary/classes/8165) the major group 'other plant protection products' in the harmonised classification of substances of annex III of Regulation (EU) 2017/269 concerning statistics on pesticides in the EU.

Axiom
annotated source: all other plant protection products [ZR99]
annotated property: IAO_0000115
annotated target: The category of products 'all other plant protection products' (harmonised classification of substances code ZR99), a member of the major group 'other plant protection products' in the harmonised classification of substances of annex III of Regulation (EU) 2017/269 concerning statistics on pesticides in the EU.
source: https://eur-lex.europa.eu/eli/reg/2017/269/oj

Axiom
annotated source: all other plant protection products [ZR99]
annotated property: denoted by
annotated target: //app.pollinatorhub.eu/vocabulary/classes/8165) the major group 'other plant protection products' in the harmonised classification of substances of annex III of Regulation (EU) 2017/269 concerning statistics on pesticides in the EU.
has db xref: harmonised classification of substances code

disinfectants [ZR99_01]
type: Class
subclass of: harmonised classification of substances chemical class
subclass of: Restriction
  on property: member of
  some values from: all other plant protection products [ZR99]
IAO_0000115: The chemical class 'disinfectants' (harmonised classification of substances code ZR99_01), a member of the category of products 'all other plant protection products' in the harmonised classification of substances of annex III of Regulation (EU) 2017/269 concerning statistics on pesticides in the EU.
IAO_0000117: Michael Rubinigg
IAO_0000118: disinfectants
id: EUPH:3169
denoted by: //app.pollinatorhub.eu/vocabulary/classes/8165) the category of products 'all other plant protection products' in the harmonised classification of substances of annex III of Regulation (EU) 2017/269 concerning statistics on pesticides in the EU.

Axiom
annotated source: disinfectants [ZR99_01]
annotated property: IAO_0000115
annotated target: The chemical class 'disinfectants' (harmonised classification of substances code ZR99_01), a member of the category of products 'all other plant protection products' in the harmonised classification of substances of annex III of Regulation (EU) 2017/269 concerning statistics on pesticides in the EU.
source: https://eur-lex.europa.eu/eli/reg/2017/269/oj

Axiom
annotated source: disinfectants [ZR99_01]
annotated property: denoted by
annotated target: //app.pollinatorhub.eu/vocabulary/classes/8165) the category of products 'all other plant protection products' in the harmonised classification of substances of annex III of Regulation (EU) 2017/269 concerning statistics on pesticides in the EU.
has db xref: harmonised classification of substances code

repellents [ZR99_02]
type: Class
subclass of: harmonised classification of substances chemical class
subclass of: Restriction
  on property: member of
  some values from: all other plant protection products [ZR99]
IAO_0000115: The chemical class 'repellents' (harmonised classification of substances code ZR99_02), a member of the category of products 'all other plant protection products' in the harmonised classification of substances of annex III of Regulation (EU) 2017/269 concerning statistics on pesticides in the EU.
IAO_0000117: Michael Rubinigg
IAO_0000118: repellents
id: EUPH:3170
denoted by: //app.pollinatorhub.eu/vocabulary/classes/8165) the category of products 'all other plant protection products' in the harmonised classification of substances of annex III of Regulation (EU) 2017/269 concerning statistics on pesticides in the EU.

Axiom
annotated source: repellents [ZR99_02]
annotated property: IAO_0000115
annotated target: The chemical class 'repellents' (harmonised classification of substances code ZR99_02), a member of the category of products 'all other plant protection products' in the harmonised classification of substances of annex III of Regulation (EU) 2017/269 concerning statistics on pesticides in the EU.
source: https://eur-lex.europa.eu/eli/reg/2017/269/oj

Axiom
annotated source: repellents [ZR99_02]
annotated property: denoted by
annotated target: //app.pollinatorhub.eu/vocabulary/classes/8165) the category of products 'all other plant protection products' in the harmonised classification of substances of annex III of Regulation (EU) 2017/269 concerning statistics on pesticides in the EU.
has db xref: harmonised classification of substances code

other plant protection products [ZR99_99]
type: Class
subclass of: harmonised classification of substances chemical class
subclass of: Restriction
  on property: member of
  some values from: all other plant protection products [ZR99]
IAO_0000115: The chemical class 'other plant protection products' (harmonised classification of substances code ZR99_99), a member of the category of products 'all other plant protection products' in the harmonised classification of substances of annex III of Regulation (EU) 2017/269 concerning statistics on pesticides in the EU.
IAO_0000117: Michael Rubinigg
IAO_0000118: other plant protection products
id: EUPH:3171
denoted by: //app.pollinatorhub.eu/vocabulary/classes/8165) the category of products 'all other plant protection products' in the harmonised classification of substances of annex III of Regulation (EU) 2017/269 concerning statistics on pesticides in the EU.

Axiom
annotated source: other plant protection products [ZR99_99]
annotated property: IAO_0000115
annotated target: The chemical class 'other plant protection products' (harmonised classification of substances code ZR99_99), a member of the category of products 'all other plant protection products' in the harmonised classification of substances of annex III of Regulation (EU) 2017/269 concerning statistics on pesticides in the EU.
source: https://eur-lex.europa.eu/eli/reg/2017/269/oj

Axiom
annotated source: other plant protection products [ZR99_99]
annotated property: denoted by
annotated target: //app.pollinatorhub.eu/vocabulary/classes/8165) the category of products 'all other plant protection products' in the harmonised classification of substances of annex III of Regulation (EU) 2017/269 concerning statistics on pesticides in the EU.
has db xref: harmonised classification of substances code

death
type: Class
subclass of: process boundary in veterinary medicine
IAO_0000115: Death means the irreversible loss of brain activity demonstrable by the loss of brain stem reflexes.
IAO_0000117: Michael Rubinigg
IAO_0000118: Tot @de
IAO_0000118: death
id: EUPH:3173

Axiom
annotated source: death
annotated property: IAO_0000115
annotated target: Death means the irreversible loss of brain activity demonstrable by the loss of brain stem reflexes.
has db xref: ISBN:978-92-95115-40-8

killing
type: Class
subclass of: process in veterinary medicine
subclass of: Restriction
  on property: ends with
  some values from: death
IAO_0000115: Killing means any procedure that causes the death of an animal.
IAO_0000117: Michael Rubinigg
IAO_0000118: killing
id: EUPH:3174

Axiom
annotated source: killing
annotated property: IAO_0000115
annotated target: Killing means any procedure that causes the death of an animal.
has db xref: ISBN:978-92-95115-40-8

queen cell
type: Class
subclass of: cell
subclass of: Restriction
  on property: produced by
  some values from: wax-making bee
IAO_0000115: A queen cell is a specialised brood cell in which an immature queen bee develops into an adult queen bee.
IAO_0000117: Michael Rubinigg
IAO_0000118: Königinnenzelle @de
IAO_0000118: Weiselzelle @de
IAO_0000118: alvéole royal @fr
IAO_0000118: alvéolo real @es
IAO_0000118: botcă @ro
IAO_0000118: celda real @es
IAO_0000118: cella reale @it
IAO_0000118: cellule royale @fr
IAO_0000118: célula real @pt
IAO_0000118: dronningcelle @da
IAO_0000118: drottningcell @sv
IAO_0000118: koniginnecel @nl
IAO_0000118: moerdop @nl
IAO_0000118: queen cell
IAO_0000118: realeira @pt
IAO_0000118: realera @es
IAO_0000118: visecell @sv
id: EUPH:32

polytropy
type: Class
subclass of: foraging behavior
IAO_0000115: Polygotropy is a foraging behaviour in which a variety of food sources (e.g. flowers of a variety of plant species) are used by the foraging animal.
IAO_0000117: Noa Simon Delso
IAO_0000118: Oligolektie @de
IAO_0000118: poliléctico @es
IAO_0000118: polytropy
id: EUPH:3264

FAOSTAT
type: Class
subclass of: https://w3id.org/euph/7823
IAO_0000115: The Food and Agriculture Organization Corporate Statistical Database
IAO_0000117: Michael Rubinigg
IAO_0000118: Base de datos estadísticos corporativos de la Organización para la Agricultura y la Alimentación @es
IAO_0000118: Base di dati statistica dell'Organizzazione delle Nazioni unite per l'alimentazione e l'agricoltura @it
IAO_0000118: Food and Agriculture Organization Corporate Statistical Database
IAO_0000118: Statistische Datenbank der Ernährungs- und Landwirtschaftsorganisation der Vereinten Nationen @de
IAO_0000118: قاعدة البيانات الإحصائية لمنظمة الأغذية والزراعة @ar
id: EUPH:3265

Axiom
annotated source: FAOSTAT
annotated property: IAO_0000115
annotated target: The Food and Agriculture Organization Corporate Statistical Database
source: https://www.fao.org/faostat/en/#definitions

animal production
type: Class
subclass of: agriculture
IAO_0000115: An entity in animal production is an entity in the agriculture domain and has been defined as the science of breeding and caring for farm animals.
IAO_0000117: Michael Rubinigg
IAO_0000118: Tierhaltung @de
IAO_0000118: Tierproduktion @de
IAO_0000118: allevamento @it
IAO_0000118: animal husbandry
IAO_0000118: animal production
IAO_0000118: veehouderij @nl
IAO_0000118: veeteelt @nl
IAO_0000118: élevage @fr
id: EUPH:3266

Axiom
annotated source: animal production
annotated property: IAO_0000115
annotated target: An entity in animal production is an entity in the agriculture domain and has been defined as the science of breeding and caring for farm animals.
source: https://ncit.nci.nih.gov/ncitbrowser/pages/home.jsf

insect parasite
type: Class
subclass of: https://w3id.org/euph/83
IAO_0000115: A parasite belonging to the taxonomic class Insecta.
IAO_0000117: Michael Rubinigg
IAO_0000118: insect parasite
id: EUPH:3270

fungal parasite
type: Class
subclass of: parasite
IAO_0000115: A parasite belonging to the taxonomic kingdom Fungi.
IAO_0000117: Michael Rubinigg
IAO_0000118: Pilzparasit @de
IAO_0000118: fungal parasite
id: EUPH:3272

single-stranded RNA virus
type: Class
subclass of: virus
IAO_0000115: A single-stranded RNA virus is an RNA virus with a single-stranded RNA genome.
IAO_0000117: Michael Rubinigg
IAO_0000118: Einzelstrang-RNA-Virus @de
IAO_0000118: single-stranded RNA virus
id: EUPH:3274

Axiom
annotated source: single-stranded RNA virus
annotated property: IAO_0000115
annotated target: A single-stranded RNA virus is an RNA virus with a single-stranded RNA genome.
has db xref: ISBN:978-88-470-5649-7

limit of quantification (LOQ)
type: Class
subclass of: assay output
IAO_0000115: The highest or lowest amount of an analyte in a sample that can be quantitatively determined with pre-defined precision and accuracy.
IAO_0000117: Michael Rubinigg
IAO_0000118: limit of quantification
id: EUPH:3275

frame type
type: Class
subclass of: beekeeping equipment quality
subclass of: Restriction
  on property: quality of
  some values from: frame
IAO_0000115: A frame type is a quality of a frame that is used to distinguish between design, function, or size.
IAO_0000117: Michael Rubinigg
IAO_0000118: Rähmchenmaß @de
IAO_0000118: frame type
id: EUPH:3278

annotation on geological entities
type: Class
subclass of: information content entity in geology
IAO_0000115: An annotation on geological entities is a written explanatory or critical description, or other in-context information that has been associated with data or other types of information in the geology domain.
IAO_0000117: Gilles San Martin
IAO_0000118: annotation on geological entities
id: EUPH:3279

Axiom
annotated source: annotation on geological entities
annotated property: IAO_0000115
annotated target: An annotation on geological entities is a written explanatory or critical description, or other in-context information that has been associated with data or other types of information in the geology domain.
has db xref: 10.1186/2041-1480-5-14

quality in geology
type: Class
subclass of: specifically dependent continuant in geology
IAO_0000115: A quality in geology is a specifically dependent continuant in the geology domain that does not require any further process to be realised.
IAO_0000117: Noa Simon Delso
IAO_0000118: quality in geology
id: EUPH:3283

Axiom
annotated source: quality in geology
annotated property: IAO_0000115
annotated target: A quality in geology is a specifically dependent continuant in the geology domain that does not require any further process to be realised.
source: http://purl.obolibrary.org/obo/BFO_0000019

pollinator
type: Class
subclass of: ecological role
subclass of: Restriction
  on property: participates in
  some values from: pollination
IAO_0000115: A pollinator is an animal such as an insect, a bird, or a mammal, that moves pollen from the anther to the stigma of a flower.
IAO_0000117: Gilles San Martin
IAO_0000118: Bestäuber @de
IAO_0000118: pollinator
id: EUPH:3284

generically dependent continuant in biology
type: Class
subclass of: continuant in biology
IAO_0000115: A specifically dependent continuant in biology is a continuant entity in the biology domain that does not exist on its own, but requires a specific single entity in any other domain to exist.
IAO_0000117: Noa Simon Delso
IAO_0000118: specifically dependent continuant in biology
id: EUPH:3286

Axiom
annotated source: generically dependent continuant in biology
annotated property: IAO_0000115
annotated target: A specifically dependent continuant in biology is a continuant entity in the biology domain that does not exist on its own, but requires a specific single entity in any other domain to exist.
source: http://purl.obolibrary.org/obo/BFO_0000031

generically dependent continuant in engineering
type: Class
subclass of: continuant in engineering
IAO_0000115: A generically dependent continuant in engineering is a continuant entity in the engineering domain that does not exist on its own, but does not require a specific single entity in another domain to exist.
IAO_0000117: Michael Rubinigg
IAO_0000118: generically dependent continuant in engineering
id: EUPH:3287

Axiom
annotated source: generically dependent continuant in engineering
annotated property: IAO_0000115
annotated target: A generically dependent continuant in engineering is a continuant entity in the engineering domain that does not exist on its own, but does not require a specific single entity in another domain to exist.
source: http://purl.obolibrary.org/obo/BFO_0000031

material entity in biology
type: Class
subclass of: independent continuant in biology
IAO_0000115: A material entity in biology is an independent continuant in the biology domain that always has some portion of matter as a continuant part.
IAO_0000117: Michael Rubinigg
IAO_0000118: material entity in biology
id: EUPH:3288

Axiom
annotated source: material entity in biology
annotated property: IAO_0000115
annotated target: A material entity in biology is an independent continuant in the biology domain that always has some portion of matter as a continuant part.
source: http://purl.obolibrary.org/obo/BFO_0000040

identifier of biological entities
type: Class
subclass of: quality in biology
IAO_0000115: An identifier of biological entities is an identifier that is specific for an entity in the biology domain.
IAO_0000117: Michael Rubinigg
IAO_0000118: ID of biological entities
IAO_0000118: identifier of biological entities
id: EUPH:3289

drone trap
type: Class
subclass of: queen breeding and rearing equipment
IAO_0000115: A drone trap is a device for the separation of drones and worker bees for the purpose of filling mating nuc boxes exclusively with worker bees, as required e.g. in mating stations.
IAO_0000117: Michael Rubinigg
IAO_0000118: Drohnenfalle @de
IAO_0000118: Drohnensieb @de
IAO_0000118: atrappe-bourdons @fr
IAO_0000118: capcană de trîntori @ro
IAO_0000118: cazazánganos @es
IAO_0000118: caçador de zangões @pt
IAO_0000118: caçador de zângãos @pt
IAO_0000118: darrenval @nl
IAO_0000118: drone trap
IAO_0000118: dronefelle @no
IAO_0000118: dronefælde @da
IAO_0000118: drönarfälla @sv
IAO_0000118: grade de zângãos @pt
IAO_0000118: sfucatrice @it
IAO_0000118: trampa de zánganos @es
IAO_0000118: trappe à bourdons @fr
IAO_0000118: trappola per fuchi @it
id: EUPH:3291

object in plant production
type: Class
subclass of: material entity in plant production
IAO_0000115: An object in plant production is a material entity in the plant production domain that is neither a collection of disjoint self-standing single objects, nor a proper part of an object.
IAO_0000117: Michael Rubinigg
IAO_0000118: object in plant production
id: EUPH:3296

Axiom
annotated source: object in plant production
annotated property: IAO_0000115
annotated target: An object in plant production is a material entity in the plant production domain that is neither a collection of disjoint self-standing single objects, nor a proper part of an object.
source: http://purl.obolibrary.org/obo/BFO_0000030/

lower limit of quantification
type: Class
subclass of: limit of quantification (LOQ)
IAO_0000115: The lowest amount of an analyte in a sample that can be quantitatively determined using a method with predefined precision and accuracy.
IAO_0000117: Michael Rubinigg
IAO_0000118: lower limit of quantification
id: EUPH:3297

Axiom
annotated source: lower limit of quantification
annotated property: IAO_0000115
annotated target: The lowest amount of an analyte in a sample that can be quantitatively determined using a method with predefined precision and accuracy.
source: https://www.ema.europa.eu/en/documents/scientific-guideline/ich-guideline-m10-bioanalytical-method-validation-step-5_en.pdf

upper limit of quantification
type: Class
subclass of: limit of quantification (LOQ)
IAO_0000115: The highest amount of an analyte in a sample that can be quantitatively determined with pre-defined precision and accuracy.
IAO_0000117: Michael Rubinigg
IAO_0000118: upper limit of quantification
id: EUPH:3298

Axiom
annotated source: upper limit of quantification
annotated property: IAO_0000115
annotated target: The highest amount of an analyte in a sample that can be quantitatively determined with pre-defined precision and accuracy.
source: https://www.ema.europa.eu/en/documents/scientific-guideline/ich-guideline-m10-bioanalytical-method-validation-step-5_en.pdf

bee hat
type: Class
subclass of: hive management equipment
subclass of: Restriction
  on property: involved in
  some values from: colony management
IAO_0000115: A hat worn when managing honey beehives. When fitted with a bee veil, it serves as protection against stings.
IAO_0000117: Michael Rubinigg
IAO_0000118: Bienenhut @de
IAO_0000118: bee hat
IAO_0000118: bihat @da
IAO_0000118: bihatt @no
IAO_0000118: bijenhoed @nl
IAO_0000118: bijenkap @nl
IAO_0000118: capello da apicoltore @it
IAO_0000118: chapeau d'apiculteur @fr
IAO_0000118: chapéu de apicultor @pt
IAO_0000118: mască @ro
IAO_0000118: pălărie de apicultor @ro
IAO_0000118: sombrero de apicultor @es
id: EUPH:3299

uncapped queen cell
type: Class
subclass of: queen cell
subclass of: Restriction
  on property: location of
  some values from: immature queen bee
IAO_0000115: An uncapped queen cell is a queen cell, which has not been closed with a wax capping by worker bees..
IAO_0000117: Michael Rubinigg
IAO_0000118: cella reale non opercolata @it
IAO_0000118: cellule royale ouverte @fr
IAO_0000118: open moerdop @nl
IAO_0000118: uncapped queen cell
IAO_0000118: unverdeckelte Weiselzelle @de
id: EUPH:33

sting organ
type: Class
subclass of: organ
IAO_0000115: The sting of the honey bee is contained within the large sting chamber in the end of the abdomen enclosed between the tergal and sternal plates of segment VII.
IAO_0000117: Michael Rubinigg
IAO_0000118: Stachel @de
IAO_0000118: ac @ro
IAO_0000118: aculeo @it
IAO_0000118: aguijón @es
IAO_0000118: aiguillon @fr
IAO_0000118: angel @nl
IAO_0000118: aparat vulnerant @ro
IAO_0000118: brod @da
IAO_0000118: brodd @no
IAO_0000118: dard @fr
IAO_0000118: ferrão @pt
IAO_0000118: gadd @sv
IAO_0000118: pungiglione @it
IAO_0000118: sting
id: EUPH:3300

Axiom
annotated source: sting organ
annotated property: IAO_0000115
annotated target: The sting of the honey bee is contained within the large sting chamber in the end of the abdomen enclosed between the tergal and sternal plates of segment VII.
has db xref: ISBN:978-0-8014-0400-9

flight board
type: Class
subclass of: bottom board
subclass of: Restriction
  on property: part of
  some values from: https://w3id.org/euph/8
subclass of: Restriction
  on property: connected to
  some values from: https://w3id.org/euph/816
IAO_0000115: A board in front of the hive entrance on which the bees can take off and land on their return flight.
IAO_0000117: Michael Rubinigg
IAO_0000118: Flugbrett @de
IAO_0000118: alighting-board
IAO_0000118: davanzalino @it
IAO_0000118: flight board
IAO_0000118: flusterbräda @sv
IAO_0000118: flusterbräde @sv
IAO_0000118: flybrett @no
IAO_0000118: flyvebræt @da
IAO_0000118: plancha de vuelo @es
IAO_0000118: planche de vol @fr
IAO_0000118: planchette de vol @fr
IAO_0000118: predellino d'approdo @it
IAO_0000118: scîndură de zbor @ro
IAO_0000118: terreiro @pt
IAO_0000118: tábua de voo @pt
IAO_0000118: vliegplank @nl
id: EUPH:3303

entity in chemistry
type: Class
subclass of: physical sciences
IAO_0000115: An entity in chemistry is an entity in the physical sciences domain that contains all classes related to aspects of pollinators and pollination studied in chemistry, i.e. the [...] science of the composition, structure, properties, and reactions of matter, especially of atomic and molecular systems.
IAO_0000117: Michael Rubinigg
IAO_0000118: Chemie @de
IAO_0000118: chemistry
IAO_0000118: chimica @it
IAO_0000118: chimie @fr
IAO_0000118: scheikunde @nl
id: EUPH:3307

Axiom
annotated source: entity in chemistry
annotated property: IAO_0000115
annotated target: An entity in chemistry is an entity in the physical sciences domain that contains all classes related to aspects of pollinators and pollination studied in chemistry, i.e. the [...] science of the composition, structure, properties, and reactions of matter, especially of atomic and molecular systems.
source: http://purl.obolibrary.org/obo/BFO_0000001
source: https://ncit.nci.nih.gov/ncitbrowser/pages/home.jsf

Apis mellifera ligustica
type: Class
subclass of: subspecies of Apis mellifera
IAO_0000115: The subspecies Apis mellifera ligustica Spinola, occurring along the Italian Peninsula and, due to commercial export, throughout the world.
IAO_0000117: Michael Rubinigg
IAO_0000118: Apis mellifera ligustica
IAO_0000118: Italiaanse bij @nl
IAO_0000118: Italian honey bee
IAO_0000118: Ligustica @de
IAO_0000118: abeille italienne @fr
IAO_0000118: abeja italiana @es
IAO_0000118: abelha italiana @pt
IAO_0000118: albina italiană @ro
IAO_0000118: italienske bi @da
id: EUPH:3319

sulphuring
type: Class
subclass of: hive management
subclass of: Restriction
  on property: occurrent part of
  some values from: killing
IAO_0000115: Sulphuring is a method used in beekeeping whereby a honey bee colony is killed by releasing sulphur dioxide into the beehive. This is often done by burning a carrier coated with elemental sulphur, which releases sulphur dioxide.
IAO_0000117: Michael Rubinigg
IAO_0000118: a afuma cu pucioasă @ro
IAO_0000118: a sulfuriza @ro
IAO_0000118: a trata cu pucioasă @ro
IAO_0000118: abschwefeln @de
IAO_0000118: afzwafelen @nl
IAO_0000118: at svovle @da
IAO_0000118: att svavla @sv
IAO_0000118: ausschwefeln @de
IAO_0000118: azufrar @es
IAO_0000118: enxofrar @pt
IAO_0000118: solforare @it
IAO_0000118: soufrer @fr
IAO_0000118: sulfuring
IAO_0000118: sulphuring
IAO_0000118: to sulfur
IAO_0000118: to sulphur
IAO_0000118: uitzwavelen @nl
IAO_0000118: å svovle @no
id: EUPH:3320

kilogram per year
type: Class
subclass of: https://w3id.org/euph/985
IAO_0000115: The quantity mass, expressed in kilogram per year.
IAO_0000117: Michael Rubinigg
IAO_0000118: Kilogramm pro Jahr @de
IAO_0000118: kilogram na leto @sl
IAO_0000118: kilogram per year
id: EUPH:3322

annual production of honey
type: Class
subclass of: unit of measure in beekeeping
subclass of: Restriction
  on property: is unit of
  some values from: honey yield
IAO_0000115: Total production of honey within a calendar year or within a more precicely defined period of one year.
IAO_0000117: Michael Rubinigg
IAO_0000118: annual production of honey
IAO_0000118: jährliche Honigproduktion @de
id: EUPH:3323

annual production of honey per colony
type: Class
subclass of: unit of measure in beekeeping
subclass of: Restriction
  on property: is unit of
  some values from: honey yield
IAO_0000115: Total production of honey from one honey bee colony within a calendar year or within a more precicely defined period of one year.
IAO_0000117: Michael Rubinigg
IAO_0000118: Jährliche Honigproduktion pro Bienenvolk @de
IAO_0000118: annual production of honey per colony
id: EUPH:3324

code set of geographical entities
type: Class
subclass of: information content entity in geography
IAO_0000115: A code set of geographical entities is an information content entity in the geography domain [...] that is a collection of other information content entities that has been created to identify or annotate things in a specified domain, and where the intention of its creators is that the collection has a one-to-one correspondence with those things.
IAO_0000117: Michael Rubinigg
IAO_0000118: Code-Set geografischer Einheiten @de
IAO_0000118: code set of geographical entities
id: EUPH:3325

Axiom
annotated source: code set of geographical entities
annotated property: IAO_0000115
annotated target: A code set of geographical entities is an information content entity in the geography domain [...] that is a collection of other information content entities that has been created to identify or annotate things in a specified domain, and where the intention of its creators is that the collection has a one-to-one correspondence with those things.
source: code set

NUTS
type: Class
subclass of: code set of geographical entities
subclass of: Restriction
  on property: member of
  some values from: EUROSTAT
IAO_0000115: The NUTS classification (Nomenclature of territorial units for statistics) is a hierarchical system for dividing up the economic territory of the EU and the UK for the purpose of: The collection, development and harmonisation of European regional statistics Socio-economic analyses of the regions [...] Framing of EU regional policies
IAO_0000117: Michael Rubinigg
IAO_0000118: NUTS @de
IAO_0000118: clasificación estadística común de unidades territoriales @es
IAO_0000118: classificazione statistica delle unità territoriali @it
IAO_0000118: nomenclature des unités territoriales statistiques @fr
IAO_0000118: nomenclature of territorial units for statistics
IAO_0000118: nomenclatuur van territoriale eenheden voor de statistiek @nl
IAO_0000118: statistische Klassifikation der Gebietseinheiten @de
IAO_0000118: statistična klasifikacija teritorialnih enot @sl
id: EUPH:3326

Axiom
annotated source: NUTS
annotated property: IAO_0000115
annotated target: The NUTS classification (Nomenclature of territorial units for statistics) is a hierarchical system for dividing up the economic territory of the EU and the UK for the purpose of: The collection, development and harmonisation of European regional statistics Socio-economic analyses of the regions [...] Framing of EU regional policies
source: https://ec.europa.eu/eurostat/web/nuts/background

main agricultural production zone (HPG)
type: Class
subclass of: Statistic Austria
IAO_0000115: Division of Austria into main agricultural production zones (Landwirtschaftliche Hauptproduktionsgebiete, HPG), which are an aggregate of minor agricultural production areas (Landwirtschaftliche Kleinproduktionsgebiete, KPG), which in turn aggregate municipalties with similar conditions for agricultural production.
IAO_0000117: Michael Rubinigg
IAO_0000118: HPG @de
IAO_0000118: Landwirtschaftliche Hauptproduktionsgebiet @de
IAO_0000118: main agricultural production zone
id: EUPH:3327

Axiom
annotated source: main agricultural production zone (HPG)
annotated property: IAO_0000115
annotated target: Division of Austria into main agricultural production zones (Landwirtschaftliche Hauptproduktionsgebiete, HPG), which are an aggregate of minor agricultural production areas (Landwirtschaftliche Kleinproduktionsgebiete, KPG), which in turn aggregate municipalties with similar conditions for agricultural production.
has db xref: ISBN:3-7040-1060-X
has db xref: ISBN:3-7040-1061-8

NUTS code
type: Class
subclass of: identifier of geographical enities
subclass of: Restriction
  on property: quality of
  some values from: geopolitical region
IAO_0000115: A 3 to 5 digit code with the following structure: It begins with a two-letter code referencing the country, which is not necessarily identical with the alpha-2 code in ISO 3166-1. Each of three possible subdivision of the country are then referred to with one additional number from 1 to 9, or a latin capital letter where a subdivision has more than nine entities.
IAO_0000117: Michael Rubinigg
IAO_0000118: NUTS Code @de
IAO_0000118: NUTS code
IAO_0000118: code NUTS @fr
IAO_0000118: codice NUTS @it
IAO_0000118: código NUTS @es
IAO_0000118: oznaka NUTS @sl
id: EUPH:3328

Axiom
annotated source: NUTS code
annotated property: IAO_0000115
annotated target: A 3 to 5 digit code with the following structure: It begins with a two-letter code referencing the country, which is not necessarily identical with the alpha-2 code in ISO 3166-1. Each of three possible subdivision of the country are then referred to with one additional number from 1 to 9, or a latin capital letter where a subdivision has more than nine entities.
source: https://eur-lex.europa.eu/eli/reg/2003/1059/2018-01-18

apiary ID
type: Class
subclass of: identifier of beekeeping entities
subclass of: Restriction
  on property: quality of
  some values from: apiary
IAO_0000115: An apiary ID is a unique sequence of characters associated with an apiary, which is specific to a dataset or to a beekeeper.
IAO_0000117: Michael Rubinigg
IAO_0000118: Bienenstand-Identifikator @de
IAO_0000118: apiary ID
IAO_0000118: apiary identifier
id: EUPH:3329

beekeeper ID
type: Class
subclass of: identifier of beekeeping entities
subclass of: Restriction
  on property: quality of
  some values from: beekeeper
IAO_0000115: Unique sequence of characters associated with a beekeeper, which is specific to a dataset.
IAO_0000117: Michael Rubinigg
IAO_0000118: Imker-Identifikator @de
IAO_0000118: beekeeper identifier
id: EUPH:3330

record ID
type: Class
subclass of: identifier of information resources
subclass of: Restriction
  on property: quality of
  some values from: https://w3id.org/euph/7515
IAO_0000115: Unique sequence of integers associated with a record within a certain table.
IAO_0000117: Michael Rubinigg
IAO_0000118: Datensatz-Identifikator @de
IAO_0000118: record identifier
id: EUPH:3331

honey bee colony ID
type: Class
subclass of: identifier of beekeeping entities
subclass of: Restriction
  on property: quality of
  some values from: honey bee colony
IAO_0000115: Unique sequence of characters associated with a honey bee colony within a certain dataset
IAO_0000117: Michael Rubinigg
IAO_0000118: Bienenvolk-Identifikator @de
IAO_0000118: colony identifier
id: EUPH:3332

frame dimension
type: Class
subclass of: beekeeping equipment quality
subclass of: Restriction
  on property: quality of
  some values from: frame
IAO_0000115: A frame dimension is a characteristic of a frame. The height is measured from the outside surface of the top bar to the outside surface of the bottom bar. The width is measured between the outside surfaces of the side bars.
IAO_0000117: Michael Rubinigg
IAO_0000118: Rähmchenmaß @de
IAO_0000118: dimension du cadre @fr
IAO_0000118: frame dimension
id: EUPH:3333

geographical coordinate
type: Class
subclass of: data item in geography
IAO_0000115: Geographical coordinates of a location in WGS84 format in decimal degrees.
IAO_0000117: Michael Rubinigg
IAO_0000118: coordinate geografiche @it
IAO_0000118: coordonnées géographiques @fr
IAO_0000118: geografische Koordinaten @de
IAO_0000118: geografische coördinaten @nl
IAO_0000118: geographical coordinates
id: EUPH:3334

hive temperature
type: Class
subclass of: beekeeping quantity
subclass of: Restriction
  on property: has unit
  some values from: degree Celsius
subclass of: Restriction
  on property: quality of
  some values from: https://w3id.org/euph/8
IAO_0000115: A hive temperature is a measurement of the temperature inside a beehive.
IAO_0000117: Michael Rubinigg
IAO_0000118: Temperatur im Bienenstock @de
IAO_0000118: hive temperature
IAO_0000118: temperatura de la colmena @es
IAO_0000118: tempèrature de la ruche @fr
id: EUPH:3335

hive weight
type: Class
subclass of: beekeeping quantity
subclass of: Restriction
  on property: has unit
  some values from: kilogram
subclass of: Restriction
  on property: quality of
  some values from: https://w3id.org/euph/8
IAO_0000115: A hive weight is a measurement of the mass of a beehive.
IAO_0000117: Michael Rubinigg
IAO_0000118: Bienenstockgewicht @de
IAO_0000118: Stockgewicht @de
IAO_0000118: hive weight
id: EUPH:3336

decimal latitude
type: Class
subclass of: geographical coordinate
subclass of: Restriction
  on property: has quality
  some values from: https://w3id.org/euph/7646
subclass of: Restriction
  on property: has quality
  some values from: https://w3id.org/euph/7647
subclass of: Restriction
  on property: member of
  some values from: https://w3id.org/euph/7639
IAO_0000115: The geographic latitude (in decimal degrees, using the spatial reference system given in dwc:geodeticDatum) of the geographic center of a dcterms:Location. Positive values are north of the Equator, negative values are south of it. Legal values lie between -90 and 90, inclusive.
IAO_0000117: Michael Rubinigg
IAO_0000118: breedtegraad @nl
IAO_0000118: geographische Breite @de
IAO_0000118: latitud @es
IAO_0000118: latitude
IAO_0000118: latitudine @it
IAO_0000118: zemljepisna širina @sl
id: EUPH:3337

Axiom
annotated source: decimal latitude
annotated property: IAO_0000115
annotated target: The geographic latitude (in decimal degrees, using the spatial reference system given in dwc:geodeticDatum) of the geographic center of a dcterms:Location. Positive values are north of the Equator, negative values are south of it. Legal values lie between -90 and 90, inclusive.
has db xref: 10.1371/journal.pone.0029715

decimal longitude
type: Class
subclass of: geographical coordinate
subclass of: Restriction
  on property: has quality
  some values from: https://w3id.org/euph/7646
subclass of: Restriction
  on property: has quality
  some values from: https://w3id.org/euph/7647
subclass of: Restriction
  on property: member of
  some values from: https://w3id.org/euph/7639
IAO_0000115: The geographic longitude (in decimal degrees, using the spatial reference system given in dwc:geodeticDatum) of the geographic center of a dcterms:Location. Positive values are east of the Greenwich Meridian, negative values are west of it. Legal values lie between -180 and 180, inclusive.
IAO_0000117: Michael Rubinigg
IAO_0000118: geographische Länge @de
IAO_0000118: lengtegraad @nl
IAO_0000118: longitud @es
IAO_0000118: longitude
IAO_0000118: longitudine @it
IAO_0000118: zemljepisna dolžina @sl
id: EUPH:3338

Axiom
annotated source: decimal longitude
annotated property: IAO_0000115
annotated target: The geographic longitude (in decimal degrees, using the spatial reference system given in dwc:geodeticDatum) of the geographic center of a dcterms:Location. Positive values are east of the Greenwich Meridian, negative values are west of it. Legal values lie between -180 and 180, inclusive.
has db xref: 10.1371/journal.pone.0029715

weight
type: Class
subclass of: mass
IAO_0000115: A mass measurement made on the surface of the planet earth.
IAO_0000117: Michael Rubinigg
IAO_0000118: Gewicht @de
IAO_0000118: Teža @sl
IAO_0000118: poids @fr
IAO_0000118: weight
id: EUPH:3339

cleaning bee
type: Class
subclass of: behavioural role
subclass of: Restriction
  on property: role of
  some values from: adult worker bee
IAO_0000115: A cleaning bee is a worker bee carrying out the task of cleaning brood cells, typically in the first days after hatching from the brood cell.
IAO_0000117: Michael Rubinigg
IAO_0000118: Putzbiene @de
IAO_0000118: abelha higiênica @pt
IAO_0000118: abelha limpadeira @pt
IAO_0000118: abelha lixeira @pt
IAO_0000118: abelha varredora @pt
IAO_0000118: albină gospodină @ro
IAO_0000118: ape pulitrice @it
IAO_0000118: cleaning bee
IAO_0000118: limpiadora @es
IAO_0000118: nettoyeuse @fr
IAO_0000118: poetsbij @nl
IAO_0000118: pussebi @no
IAO_0000118: putsbi @sv
IAO_0000118: rengøringsbi @da
IAO_0000118: spazzina @it
id: EUPH:3340

honey bee disease
type: Class
subclass of: disease
subclass of: Restriction
  on property: disposition of
  some values from: https://www.gbif.org/species/1341976
IAO_0000115: A honey bee disease is the occurrence of infections and infestations by one or more disease agents causing dysfunction of honey bees, with or without clinical or pathological manifestations.
IAO_0000117: Michael Rubinigg
IAO_0000118: Bienenkrankheit @de
IAO_0000118: Krankheit der Honigbiene @de
IAO_0000118: bijenziekte @nl
IAO_0000118: disease of honey bees
IAO_0000118: maladie des abeilles @fr
IAO_0000118: malattia delle api @it
IAO_0000118: patologia dell'alveare @it
IAO_0000118: ziekte van de honingbij @nl
id: EUPH:3341

calendar month
type: Class
subclass of: time scale unit
subclass of: Restriction
  on property: member of
  some values from: https://w3id.org/euph/7639
subclass of: Restriction
  on property: member of
  some values from: https://w3id.org/euph/838
subclass of: Restriction
  on property: is unit of
  some values from: Gregorian calendar
IAO_0000115: time scale unit [...] resulting from a defined division of a calendar year [...], each containing a specific number of calendar days [...].
IAO_0000117: Michael Rubinigg
IAO_0000118: Kalendermonat @de
IAO_0000118: Monat @de
IAO_0000118: calendar month
IAO_0000118: koledarski mesec @sl
IAO_0000118: mesec @sl
IAO_0000118: month
id: EUPH:3342

Axiom
annotated source: calendar month
annotated property: IAO_0000115
annotated target: time scale unit [...] resulting from a defined division of a calendar year [...], each containing a specific number of calendar days [...].
has db xref: 10.1371/journal.pone.0029715
source: https://www.iso.org/standard/70907.html

postcode
type: Class
subclass of: identifier of geographical enities
subclass of: Restriction
  on property: quality of
  some values from: geopolitical region
IAO_0000115: A postal code (also known locally in various English-speaking countries throughout the world as a postcode, post code, PIN or ZIP Code) is a series of letters or digits or both, sometimes including spaces or punctuation, included in a postal address for the purpose of sorting mail.
IAO_0000117: Michael Rubinigg
IAO_0000118: Postleitzahl @de
IAO_0000118: postcode
id: EUPH:3343

geographic coordinate system
type: Class
subclass of: spatial reference system (SRS)
IAO_0000115: The geographic coordinate system is the reference system for locating spatial features on the Earth’s surface [...]. The geographic coordinate system is defined by longitude and latitude. Both longitude and latitude are angular measures: longitude measures the angle east or west from the prime meridian, and latitude measures the angle north or south of the equatorial plane.
IAO_0000117: Michael Rubinigg
IAO_0000118: geographic coordinate system
IAO_0000118: geographisches Koordinatensystem @de
IAO_0000118: sistema di coordinate geografiche @it
id: EUPH:3344

Axiom
annotated source: geographic coordinate system
annotated property: IAO_0000115
annotated target: The geographic coordinate system is the reference system for locating spatial features on the Earth’s surface [...]. The geographic coordinate system is defined by longitude and latitude. Both longitude and latitude are angular measures: longitude measures the angle east or west from the prime meridian, and latitude measures the angle north or south of the equatorial plane.
has db xref: ISBN:978-1-259-92964-9

projected coordinate system
type: Class
subclass of: geographic coordinate system
IAO_0000115: A projected coordinate system is built on a map projection. Projected coordinate systems and map projections are often used interchangeably.
IAO_0000117: Michael Rubinigg
IAO_0000118: projected coordinate system
IAO_0000118: projektiertes Koordinatensystem @de
IAO_0000118: système de coordonnées projetées @fr
id: EUPH:3345

Axiom
annotated source: projected coordinate system
annotated property: IAO_0000115
annotated target: A projected coordinate system is built on a map projection. Projected coordinate systems and map projections are often used interchangeably.
has db xref: ISBN:978-1-259-92964-9

spatial reference system (SRS)
type: Class
subclass of: plan specification in geography
IAO_0000115: A spatial reference system (SRS) or coordinate reference system (CRS) is a framework used to precisely measure locations on the surface of Earth as coordinates. It is thus the application of the abstract mathematics of coordinate systems and analytic geometry to geographic space.
IAO_0000117: Michael Rubinigg
IAO_0000118: Koordinatenreferenzsystem @de
IAO_0000118: geodetisch coördinatensysteem @nl
IAO_0000118: spatial reference system
IAO_0000118: système de coordonnées @fr
id: EUPH:3347

Axiom
annotated source: spatial reference system (SRS)
annotated property: IAO_0000115
annotated target: A spatial reference system (SRS) or coordinate reference system (CRS) is a framework used to precisely measure locations on the surface of Earth as coordinates. It is thus the application of the abstract mathematics of coordinate systems and analytic geometry to geographic space.
source: https://en.wikipedia.org/w/index.php

Universal Transverse Mercator (UTM) coordinate system
type: Class
subclass of: projected coordinate system
IAO_0000115: Used worldwide, the UTM grid system divides the Earth’s surface between 84° N and 80° S into 60 zones. Each zone covers 6° of longitude and is numbered sequentially with zone 1 beginning at 180° W. Each zone is further divided into the northern and southern hemispheres. The designation of a UTM zone therefore carries a number and a letter.
IAO_0000117: Michael Rubinigg
IAO_0000118: UTM grid system
IAO_0000118: UTM-Koordinatensystem @de
IAO_0000118: proiezione universale trasversa di Mercatore @it
IAO_0000118: sistema de coordenadas universal transversal de Mercator @es
IAO_0000118: transverse universelle de Mercator (UTM) @fr
IAO_0000118: universele transversale mercatorprojectie @nl
id: EUPH:3348

Axiom
annotated source: Universal Transverse Mercator (UTM) coordinate system
annotated property: IAO_0000115
annotated target: Used worldwide, the UTM grid system divides the Earth’s surface between 84° N and 80° S into 60 zones. Each zone covers 6° of longitude and is numbered sequentially with zone 1 beginning at 180° W. Each zone is further divided into the northern and southern hemispheres. The designation of a UTM zone therefore carries a number and a letter.
has db xref: ISBN:978-1-259-92964-9

calendar day
type: Class
subclass of: time scale unit
subclass of: Restriction
  on property: member of
  some values from: https://w3id.org/euph/838
subclass of: Restriction
  on property: is unit of
  some values from: Gregorian calendar
IAO_0000115: time scale unit [...] starting at the beginning of the day and ending with the beginning of the next day, the latter being the starting instant [...] of the next calendar day [...].
IAO_0000117: Michael Rubinigg
IAO_0000118: Kalendertag @de
IAO_0000118: Tag des Monats @de
IAO_0000118: calendar day
IAO_0000118: giorno del mese @it
IAO_0000118: jour calendaire @fr
id: EUPH:3349

Axiom
annotated source: calendar day
annotated property: IAO_0000115
annotated target: time scale unit [...] starting at the beginning of the day and ending with the beginning of the next day, the latter being the starting instant [...] of the next calendar day [...].
source: https://www.iso.org/standard/70907.html

start month
type: Class
subclass of: zero-dimensional temporal region in information science
IAO_0000115: dwc:month in which a dwc:Event starts.
IAO_0000117: Michael Rubinigg
IAO_0000118: Monat, in dem ein Ereignis beginnt @de
IAO_0000118: mois au cours duquel un événement commence @fr
IAO_0000118: month in which an event starts
id: EUPH:3350

EUROSTAT
type: Class
subclass of: https://w3id.org/euph/7722
subclass of: Restriction
  on property: functionally related to
  some values from: https://w3id.org/euph/7824
IAO_0000115: Eurostat is the statistical office of the European Union, responsible for publishing high-quality Europe-wide statistics and indicators that enable comparisons between countries and regions.
IAO_0000117: Michael Rubinigg
IAO_0000118: Eurostat @de
id: EUPH:3352

Axiom
annotated source: EUROSTAT
annotated property: IAO_0000115
annotated target: Eurostat is the statistical office of the European Union, responsible for publishing high-quality Europe-wide statistics and indicators that enable comparisons between countries and regions.
source: https://commission.europa.eu/about-european-commission/departments-and-executive-agencies/eurostat-european-statistics_en

CAS registry number
type: Class
subclass of: chemical identifier
IAO_0000115: A CAS Registry Number® is a unique and unambiguous identifier for a specific substance that allows clear communication and, with the help of CAS scientists, links together all available data and research about that substance. Governmental agencies rely on CAS Registry Numbers for substance identification in regulatory applications because they are unique, easy validated, and internationally recognized.
IAO_0000117: Michael Rubinigg
IAO_0000118: CAS registry number
IAO_0000118: CAS-Registernummer @de
id: EUPH:3353

Axiom
annotated source: CAS registry number
annotated property: IAO_0000115
annotated target: A CAS Registry Number® is a unique and unambiguous identifier for a specific substance that allows clear communication and, with the help of CAS scientists, links together all available data and research about that substance. Governmental agencies rely on CAS Registry Numbers for substance identification in regulatory applications because they are unique, easy validated, and internationally recognized.
source: https://www.cas.org/cas-data/cas-registry

generically dependent continuant in chemistry
type: Class
subclass of: continuant in chemistry
IAO_0000115: A generically dependent continuant in chemistry is an continuant entity in the chemistry domain that does not exist on its own, but does not require a specific single entity in any other domain to exist.
IAO_0000117: Michael Rubinigg
IAO_0000118: generically dependent continuant in chemistry
id: EUPH:3354

Axiom
annotated source: generically dependent continuant in chemistry
annotated property: IAO_0000115
annotated target: A generically dependent continuant in chemistry is an continuant entity in the chemistry domain that does not exist on its own, but does not require a specific single entity in any other domain to exist.
source: http://purl.obolibrary.org/obo/BFO_0000031

harmonised classification of substances
type: Class
subclass of: EU regulation 2017-269
IAO_0000115: The harmonised classification of substances, as defined in annex III of Regulation (EU) 2017/269 concerning statistics on pesticides in the EU.
IAO_0000117: Michael Rubinigg
IAO_0000118: Harmoniseret klassificering af stoffer @da
IAO_0000118: aineiden yhdenmukaistettu luokittelu @fi
IAO_0000118: ainete ühtlustatud klassifikatsioon @et
IAO_0000118: anyagok harmonizált besorolása @hu
IAO_0000118: clasificare armonizată a substanțelor @ro
IAO_0000118: classificación armonizada de sustancias @es
IAO_0000118: classification harmonisée des substances @fr
IAO_0000118: classificazione armonizzata delle sostanze @it
IAO_0000118: classificação harmonizada das substâncias @pt
IAO_0000118: eναρμονισμένη tαξινόμηση oυσιών @el
IAO_0000118: geharmoniseerde indeling van de stoffen @nl
IAO_0000118: harmonised classification of substances
IAO_0000118: harmoniserad klassificering av ämnen @sv
IAO_0000118: harmonisierten Klassifikation der Stoffe @de
IAO_0000118: harmonizovaná klasifikace látek @cs
IAO_0000118: harmonizovaná klasifikácia látok @sk
IAO_0000118: klassifikazzioni armonizzata ta' sustanzi @mt
IAO_0000118: saskaņotā vielu klasifikācija @lv
IAO_0000118: suderinta medžiagų klasifikacija @lt
IAO_0000118: usklajena razvrstitev snovi @sl
IAO_0000118: usklađena klasifikacija tvari @hr
IAO_0000118: zharmonizowana klasyfikacja substancji @pl
IAO_0000118: хармонизирана класификация на вещества @bg
id: EUPH:3355

Axiom
annotated source: harmonised classification of substances
annotated property: IAO_0000115
annotated target: The harmonised classification of substances, as defined in annex III of Regulation (EU) 2017/269 concerning statistics on pesticides in the EU.
source: https://eur-lex.europa.eu/legal-content/EN/TXT/HTML/

CIPAC code number
type: Class
subclass of: chemical identifier
IAO_0000115: The CIPAC (Collaborative International Pesticides Analytical Council) code number system is a simple approach for an unambiguous coding of active ingredients and variants used in the area/field of pesticides.
IAO_0000117: Michael Rubinigg
IAO_0000118: CIPAC code number
IAO_0000118: CIPAC-Code-Nummer @de
id: EUPH:3356

Axiom
annotated source: CIPAC code number
annotated property: IAO_0000115
annotated target: The CIPAC (Collaborative International Pesticides Analytical Council) code number system is a simple approach for an unambiguous coding of active ingredients and variants used in the area/field of pesticides.
source: https://www.cipac.org/index.php/code-numbers/code-numbers1

mineral oils [ZR01]
type: Class
subclass of: harmonised classification of substances categories of products
subclass of: Restriction
  on property: member of
  some values from: other plant protection products [PES_ZR]
IAO_0000115: The category of products 'mineral oils' (harmonised classification of substances code ZR01), a member of the major group 'other plant protection products' in the harmonised classification of substances of annex III of Regulation (EU) 2017/269 concerning statistics on pesticides in the EU.
IAO_0000117: Michael Rubinigg
IAO_0000118: Mineralöle @de
IAO_0000118: mineral oils
id: EUPH:3357
denoted by: //app.pollinatorhub.eu/vocabulary/classes/8165) the major group 'other plant protection products' in the harmonised classification of substances of annex III of Regulation (EU) 2017/269 concerning statistics on pesticides in the EU.

Axiom
annotated source: mineral oils [ZR01]
annotated property: IAO_0000115
annotated target: The category of products 'mineral oils' (harmonised classification of substances code ZR01), a member of the major group 'other plant protection products' in the harmonised classification of substances of annex III of Regulation (EU) 2017/269 concerning statistics on pesticides in the EU.
source: https://eur-lex.europa.eu/eli/reg/2017/269/oj

Axiom
annotated source: mineral oils [ZR01]
annotated property: denoted by
annotated target: //app.pollinatorhub.eu/vocabulary/classes/8165) the major group 'other plant protection products' in the harmonised classification of substances of annex III of Regulation (EU) 2017/269 concerning statistics on pesticides in the EU.
has db xref: harmonised classification of substances code

mineral oils [ZR01_01]
type: Class
subclass of: harmonised classification of substances chemical class
subclass of: Restriction
  on property: member of
  some values from: mineral oils [ZR01]
IAO_0000115: [Chemical class](The chemical class 'mineral oils' (harmonised classification of substances code ZR01_01), a member of the category of products 'mineral oils' in the harmonised classification of substances of annex III of Regulation (EU) 2017/269 concerning statistics on pesticides in the EU.
IAO_0000117: Michael Rubinigg
IAO_0000118: Mineralöle @de
IAO_0000118: mineral oils
id: EUPH:3358
denoted by: //app.pollinatorhub.eu/vocabulary/classes/8165) the category of products 'mineral oils' in the harmonised classification of substances of annex III of Regulation (EU) 2017/269 concerning statistics on pesticides in the EU.

Axiom
annotated source: mineral oils [ZR01_01]
annotated property: IAO_0000115
annotated target: [Chemical class](The chemical class 'mineral oils' (harmonised classification of substances code ZR01_01), a member of the category of products 'mineral oils' in the harmonised classification of substances of annex III of Regulation (EU) 2017/269 concerning statistics on pesticides in the EU.
source: https://eur-lex.europa.eu/eli/reg/2017/269/oj

Axiom
annotated source: mineral oils [ZR01_01]
annotated property: denoted by
annotated target: //app.pollinatorhub.eu/vocabulary/classes/8165) the category of products 'mineral oils' in the harmonised classification of substances of annex III of Regulation (EU) 2017/269 concerning statistics on pesticides in the EU.
has db xref: harmonised classification of substances code

inspection of apiary
type: Class
subclass of: apiary management
IAO_0000115: The (periodic) check of the condition (e.g. state of health, nutritional status, space requirements, presence of queen cells) of honey bee colonies in apiaries.
IAO_0000117: Michael Rubinigg
IAO_0000118: Standbesuch @de
IAO_0000118: Standkontrolle @de
IAO_0000118: bezichtiging @nl
IAO_0000118: bezichtiging van de volken @nl
IAO_0000118: control în stupină @ro
IAO_0000118: controle @nl
IAO_0000118: inspección @es
IAO_0000118: inspection
IAO_0000118: inspection of apiary
IAO_0000118: inspecção @pt
IAO_0000118: inspeksjon @no
IAO_0000118: inspektion @da
IAO_0000118: ispezione dell'apiario @it
IAO_0000118: kontroll @no
IAO_0000118: revizie @ro
IAO_0000118: undersökning @sv
IAO_0000118: visita @es
IAO_0000118: visita de inspecção @pt
IAO_0000118: visita del colmenar @es
IAO_0000118: visite de rucher @fr
id: EUPH:3366

introducing
type: Class
subclass of: queen management
IAO_0000115: Introducing is a queen management process by which a new queen is inserted into a queenless honey bee colony.
IAO_0000117: Michael Rubinigg
IAO_0000118: a introduce @ro
IAO_0000118: a introduce matca @ro
IAO_0000118: at indføre @da
IAO_0000118: att tillsätta @sv
IAO_0000118: inbrengen @nl
IAO_0000118: introducing
IAO_0000118: introducir @es
IAO_0000118: introduire @fr
IAO_0000118: introdurre @it
IAO_0000118: introduzir @pt
IAO_0000118: invoeren @nl
IAO_0000118: to introduce
IAO_0000118: zusetzen @de
IAO_0000118: å innføre @no
id: EUPH:3367

nosemosis caused by Nosema ceranae
type: Class
subclass of: nosemosis of honey bees
subclass of: Restriction
  on property: disposition of
  some values from: https://www.gbif.org/species/1341976
subclass of: Restriction
  on property: disease has infectious agent
  some values from: adult honey bee
IAO_0000115: The honey bee disease nosemosis caused by the intracellular parasite Nosema ceranae.
IAO_0000117: Michael Rubinigg
IAO_0000118: Nosemose verursacht durch Nosema ceranae @de
IAO_0000118: nosemosis caused by Nosema ceranae
id: EUPH:3368

Axiom
annotated source: nosemosis caused by Nosema ceranae
annotated property: IAO_0000115
annotated target: The honey bee disease nosemosis caused by the intracellular parasite Nosema ceranae.
has db xref: ISBN:978-88-470-5649-7

NUTS 2021 code
type: Class
subclass of: NUTS code
IAO_0000115: A NUTS code defined in the NUTS classification 2021, valid from 2021-01-01 to 2023-12-31, containing 92 regions at NUTS level 1, 244 regions at NUTS level 2 and 1165 regions at NUTS level 3 level.
IAO_0000117: Michael Rubinigg
IAO_0000118: NUTS 2021 code
id: EUPH:3369

Axiom
annotated source: NUTS 2021 code
annotated property: IAO_0000115
annotated target: A NUTS code defined in the NUTS classification 2021, valid from 2021-01-01 to 2023-12-31, containing 92 regions at NUTS level 1, 244 regions at NUTS level 2 and 1165 regions at NUTS level 3 level.
source: http://data.europa.eu/eli/reg_del/2019/1755/oj

dancing
type: Class
subclass of: https://w3id.org/euph/760
IAO_0000115: Dancing, also referred to as dance language, is a honey bee behavior used by woprker bees as a communication system with their nestmates in their nest. It is based on repetitive movements together with sound and vibrational signals.
IAO_0000117: Michael Rubinigg
IAO_0000118: Tanz @de
IAO_0000118: dance
IAO_0000118: dans @da
IAO_0000118: danse @fr
IAO_0000118: danza @es
IAO_0000118: dança @pt
id: EUPH:3370

grooming dance
type: Class
subclass of: dancing
IAO_0000115: The grooming dance is a dance observed in the Western honey bee (Apis mellifera), which consists of stationary side-to-side vibrations, sometimes mixed with short brief periods of self-grooming. It is performed by individual worker bees to invite other nestmates to groom her.
IAO_0000117: Michael Rubinigg
IAO_0000118: Putztanz @de
IAO_0000118: dans de curăţire @ro
IAO_0000118: danse de nettoyage @fr
IAO_0000118: danza de limpieza @es
IAO_0000118: danza del governo @it
IAO_0000118: dança de limpeza @pt
IAO_0000118: grooming dance
IAO_0000118: poetsdans @nl
IAO_0000118: pudsedans @da
IAO_0000118: pussedans @no
IAO_0000118: putsdans @sv
id: EUPH:3371

Axiom
annotated source: grooming dance
annotated property: IAO_0000115
annotated target: The grooming dance is a dance observed in the Western honey bee (Apis mellifera), which consists of stationary side-to-side vibrations, sometimes mixed with short brief periods of self-grooming. It is performed by individual worker bees to invite other nestmates to groom her.
has db xref: 10.1046/j.1439-0310.2003.00947.x

round dance
type: Class
subclass of: dancing
IAO_0000115: The round dance is a dance observed in the Western honey bee (Apis mellifera), which encodes maily the distance of a food source that is located at a short distance [generally assumed to be less than around 100 m] from the nest.
IAO_0000117: Michael Rubinigg
IAO_0000118: Rundtanz @de
IAO_0000118: dans circular @ro
IAO_0000118: danse en rond @fr
IAO_0000118: danza circolare @it
IAO_0000118: danza en redondo @es
IAO_0000118: dança em círculo @pt
IAO_0000118: ringdans @sv
IAO_0000118: rondedans @nl
IAO_0000118: round dance
IAO_0000118: runddans @da
id: EUPH:3372

Axiom
annotated source: round dance
annotated property: IAO_0000115
annotated target: The round dance is a dance observed in the Western honey bee (Apis mellifera), which encodes maily the distance of a food source that is located at a short distance [generally assumed to be less than around 100 m] from the nest.
has db xref: 10.1146/annurev.ento.47.091201.145306

waggle dance
type: Class
subclass of: dancing
IAO_0000115: The waggle dance is a dance is a dance observed in the Western honey bee (Apis mellifera), which encodes the direction and distance of a food source that is located at a long distance [generally assumed to be around 100 m and more] from the nest. Direction is encoded in the orientation of the waggling run relative to gravity [...]. Distance is encoded in the duration of the waggling run. Other bees observing the dance use the spatial information it contains to fly to the general location of the food and odors carried by the dancer to pinpoint the actual resource.
IAO_0000117: Michael Rubinigg
IAO_0000118: Schwänzeltanz @de
IAO_0000118: dans balansat @ro
IAO_0000118: danse frétillante @fr
IAO_0000118: danza de meneo de cola @es
IAO_0000118: danza dell'addome @it
IAO_0000118: dança do requebrado @pt
IAO_0000118: dança em oito @pt
IAO_0000118: dança frenética @pt
IAO_0000118: kwispeldans @nl
IAO_0000118: loggredans @no
IAO_0000118: schuddans @nl
IAO_0000118: sidderdans @nl
IAO_0000118: staartdans @nl
IAO_0000118: viftdans @sv
IAO_0000118: vippdans @sv
IAO_0000118: vrikkedans @da
IAO_0000118: waggle dance
IAO_0000118: wagtail dance
id: EUPH:3373

Axiom
annotated source: waggle dance
annotated property: IAO_0000115
annotated target: The waggle dance is a dance is a dance observed in the Western honey bee (Apis mellifera), which encodes the direction and distance of a food source that is located at a long distance [generally assumed to be around 100 m and more] from the nest. Direction is encoded in the orientation of the waggling run relative to gravity [...]. Distance is encoded in the duration of the waggling run. Other bees observing the dance use the spatial information it contains to fly to the general location of the food and odors carried by the dancer to pinpoint the actual resource.
has db xref: 10.1146/annurev.ento.47.091201.145306

commercial beekeeper
type: Class
subclass of: beekeeper
IAO_0000115: A beekeeper who carries out this activity with the aim of making a profit.
IAO_0000117: Michael Rubinigg
IAO_0000118: Berufsimker @de
IAO_0000118: Berufsimkerin @de
IAO_0000118: Erwerbsimker @de
IAO_0000118: Erwerbsimkerin @de
IAO_0000118: apicoltore industriale @it
IAO_0000118: apicoltore professionale @it
IAO_0000118: apiculteur professionel @fr
IAO_0000118: apicultor industrial @es
IAO_0000118: apicultor profesional @es
IAO_0000118: apicultor profesionist @ro
IAO_0000118: apicultor profissional @pt
IAO_0000118: bedrijfsimker @nl
IAO_0000118: beroepsimker @nl
IAO_0000118: commercial beekeeper
IAO_0000118: erhvervsbiavler @da
IAO_0000118: storbiavler @da
IAO_0000118: storbiodlare @sv
IAO_0000118: yrkesbiodlare @sv
IAO_0000118: yrkesbirøkter @no
id: EUPH:3374

brood rearing
type: Class
subclass of: reproductive behavior
subclass of: Restriction
  on property: characteristic of
  some values from: https://www.gbif.org/species/1334757
subclass of: Restriction
  on property: characteristic of
  some values from: https://www.gbif.org/species/1340278
IAO_0000115: Brood rearing is a behavior of many female bees, which either alone or in cooperation with other (usually related, more rarely unrelated) individuals of the same species care for their own offspring or that of another (usually related, more rarely unrelated) female by providing it with food and/or protecting it from predators, diseases, or other disorders.
IAO_0000117: Michael Rubinigg
IAO_0000118: Brutaufzucht @de
IAO_0000118: Brutgeschäft @de
IAO_0000118: Brutpflege @de
IAO_0000118: allevamento di covata @it
IAO_0000118: broedproductie @nl
IAO_0000118: broedverzorging @nl
IAO_0000118: brood rearing
IAO_0000118: creștere de puiet @ro
IAO_0000118: crianza de pollo @es
IAO_0000118: criação @pt
IAO_0000118: cría de pollo @es
IAO_0000118: desenvolvimento da postura @pt
IAO_0000118: desenvolvimento de crias @pt
IAO_0000118: yngeloppdrett @no
IAO_0000118: yngelproduktion @da
IAO_0000118: yngeluppfödning @sv
IAO_0000118: yngling @no
IAO_0000118: élevage du couvain @fr
id: EUPH:3375

honey bee mating station
type: Class
subclass of: generically dependent continuant in beekeeping
IAO_0000115: A mating station is a location in which only drones from selected queens may be kept and which is protected by geographical barriers against the entry of drones that are not descendants of the selected queens and where unmated queens are brought so that they can mate with these drones.
IAO_0000117: Michael Rubinigg
IAO_0000118: Belegstation @de
IAO_0000118: Belegstelle @de
IAO_0000118: bevruchtingsstation @nl
IAO_0000118: estación de fecundación @es
IAO_0000118: estação de fecundação @pt
IAO_0000118: mating station
IAO_0000118: parestasjon @no
IAO_0000118: parningsstation @sv
IAO_0000118: parringsstation @da
IAO_0000118: queen-mating station
IAO_0000118: station de fécondation @fr
IAO_0000118: stazione di fecondazione @it
IAO_0000118: staţiune de împerechere @ro
IAO_0000118: vatră de împerechere @ro
id: EUPH:3385

drone-rearing colony
type: Class
subclass of: honey bee colony
IAO_0000115: A honey bee colony headed by a queen, which descends from a selected queen that acts as a sire, and is used to produce drones on a mating station.
IAO_0000117: Michael Rubinigg
IAO_0000118: Drohnenvolk @de
IAO_0000118: Dröhnerich @de
IAO_0000118: alveare da fuchi @it
IAO_0000118: colonia de zánganos @es
IAO_0000118: colonie crescătoare de trîntori @ro
IAO_0000118: colonie à bourdons @fr
IAO_0000118: colónia de criação de zangões @pt
IAO_0000118: colónia de criação de zângãos @pt
IAO_0000118: darrenteeltvolk @nl
IAO_0000118: drone-rearing colony
IAO_0000118: dronefolk @da
IAO_0000118: drönarsamhälle @sv
IAO_0000118: ruche à bourdons @fr
id: EUPH:3386

drone comb
type: Class
subclass of: https://w3id.org/euph/803
subclass of: Restriction
  on property: produced by
  some values from: adult worker bee
IAO_0000115: A drone comb is a brood comb that contains mainly cells intended for drone brood.
IAO_0000117: Michael Rubinigg
IAO_0000118: Drohnenwabe @de
IAO_0000118: darrenraat @nl
IAO_0000118: drone comb
IAO_0000118: dronetavle @da
IAO_0000118: dronevoks @da
IAO_0000118: fagure de trîntori @ro
IAO_0000118: favo da fuchi @it
IAO_0000118: favo de zangões @pt
IAO_0000118: favo de zângãos @pt
IAO_0000118: kaka med drönarceller @sv
IAO_0000118: panal de zánganos @es
IAO_0000118: rayon de mâles @fr
id: EUPH:3387

warm way
type: Class
subclass of: function related to hive management
subclass of: Restriction
  on property: function of
  some values from: https://w3id.org/euph/8
IAO_0000115: An arrangement of combs in a beehive in which the combs are parallel to the hive entrance.
IAO_0000117: Michael Rubinigg
IAO_0000118: Querwabenstellung @de
IAO_0000118: Warmbau @de
IAO_0000118: batería caliente @es
IAO_0000118: bâtisse chaude @fr
IAO_0000118: construção quente @pt
IAO_0000118: disposição quente @pt
IAO_0000118: favo caldo @it
IAO_0000118: favos paralelos á entrada @pt
IAO_0000118: panales paralelos al frente @es
IAO_0000118: pat-cald @ro
IAO_0000118: tvärbygge @sv
IAO_0000118: varmbygg @no
IAO_0000118: varmbygge @sv
IAO_0000118: varmbygning @da
IAO_0000118: warm way
IAO_0000118: warme bouw @nl
id: EUPH:3388

cold way
type: Class
subclass of: function related to hive management
subclass of: Restriction
  on property: function of
  some values from: https://w3id.org/euph/8
IAO_0000115: An arrangement of combs in a beehive in which the combs are perpendicular to the hive entrance.
IAO_0000117: Michael Rubinigg
IAO_0000118: Kaltbau @de
IAO_0000118: Längswabenstellung @de
IAO_0000118: bateria fría @es
IAO_0000118: bâtisse froide @fr
IAO_0000118: cold way
IAO_0000118: construção fria @pt
IAO_0000118: disposição fria @pt
IAO_0000118: favo freddo @it
IAO_0000118: favos perpendiculares à entrada @pt
IAO_0000118: kaldbygg @no
IAO_0000118: kallbygge @sv
IAO_0000118: koldbygning @da
IAO_0000118: koude bouw @nl
IAO_0000118: längdbygge @sv
IAO_0000118: panales perpendiculares al frente @es
IAO_0000118: pat-rece @ro
id: EUPH:3389

copulation
type: Class
subclass of: reproductive behavior
IAO_0000115: In zoology, copulation is animal sexual behavior in which a male introduces sperm into the female's body, especially directly into her reproductive tract. This is an aspect of mating.
IAO_0000117: Michael Rubinigg
IAO_0000118: Kopulation @de
IAO_0000118: accouplement @fr
IAO_0000118: copulatie @nl
IAO_0000118: copulation
IAO_0000118: copulazione @it
IAO_0000118: copulaţie @ro
IAO_0000118: cópula @es
IAO_0000118: kopulasjon @no
IAO_0000118: kopulation @da
id: EUPH:3390

Axiom
annotated source: copulation
annotated property: IAO_0000115
annotated target: In zoology, copulation is animal sexual behavior in which a male introduces sperm into the female's body, especially directly into her reproductive tract. This is an aspect of mating.
source: https://en.wikipedia.org/w/index.php

honey bee colony development
type: Class
subclass of: https://w3id.org/euph/852
IAO_0000115: The process by which a honey bee colony changes in size (number of individuals, amount of space occupied) or in the composition of individuals aving different physiological or ethological characteristics.
IAO_0000117: Michael Rubinigg
IAO_0000118: Entwicklung @de
IAO_0000118: desarrollo @es
IAO_0000118: desenvolvimento @pt
IAO_0000118: development
IAO_0000118: dezvoltare @ro
IAO_0000118: développement @fr
IAO_0000118: ontwikkeling @nl
IAO_0000118: sviluppo @it
IAO_0000118: udvikling @da
IAO_0000118: utveckling @sv
IAO_0000118: utvikling @no
id: EUPH:3394

division of labor
type: Class
subclass of: social behavior
IAO_0000115: [...] [Division of labor] refers to biases in the propensity of individuals to perform different tasks within a group [...]. There are two basic classes of [...] [Division of labor] across the social insects: between queens and workers and amongst the workers for tasks unrelated to reproduction.
IAO_0000117: Michael Rubinigg
IAO_0000118: Arbeitsteilung @de
IAO_0000118: arbeidsfordeling @no
IAO_0000118: arbeidsverdeling @nl
IAO_0000118: arbejdsdeling @da
IAO_0000118: arbetsdelning @sv
IAO_0000118: arbetsfördelning @sv
IAO_0000118: division du travail @fr
IAO_0000118: division of labor
IAO_0000118: divisione del lavoro @it
IAO_0000118: división del trabajo @es
IAO_0000118: divisão de trabalho @pt
IAO_0000118: diviziunea muncii @ro
IAO_0000118: werkverdeling @nl
id: EUPH:3395

Axiom
annotated source: division of labor
annotated property: IAO_0000115
annotated target: [...] [Division of labor] refers to biases in the propensity of individuals to perform different tasks within a group [...]. There are two basic classes of [...] [Division of labor] across the social insects: between queens and workers and amongst the workers for tasks unrelated to reproduction.
has db xref: 10.1007/s00265-009-0874-7

drawing out
type: Class
subclass of: https://w3id.org/euph/810
IAO_0000115: Drawing out is a comb building behavior in which worker bees build comb on a foundation.
IAO_0000117: Michael Rubinigg
IAO_0000118: a clădi @ro
IAO_0000118: a clădi fagurele artificial @ro
IAO_0000118: at bygga ut @sv
IAO_0000118: at bygge ud @da
IAO_0000118: at udbygge @da
IAO_0000118: att utbygga @sv
IAO_0000118: ausbauen @de
IAO_0000118: costruire i favi @it
IAO_0000118: estirar @es
IAO_0000118: puxar @pt
IAO_0000118: puxar a cera moldada @pt
IAO_0000118: to draw out
IAO_0000118: trasformare in favo @it
IAO_0000118: uitbouwen @nl
IAO_0000118: å bygge ut @no
IAO_0000118: å trekke ut @no
IAO_0000118: étirer @fr
id: EUPH:3397

drifting
type: Class
subclass of: https://w3id.org/euph/760
IAO_0000115: Drifting is the return of honey bees to the wrong (nearby) beehive.
IAO_0000117: Michael Rubinigg
IAO_0000118: a se rătăci @ro
IAO_0000118: apartarse @es
IAO_0000118: at fejlflyve @da
IAO_0000118: at flyve fejl @da
IAO_0000118: att flyga fel @sv
IAO_0000118: drifting
IAO_0000118: essere trascinato dalla deriva @it
IAO_0000118: perder-se @pt
IAO_0000118: perderse @es
IAO_0000118: perdersi @it
IAO_0000118: s'égarer @fr
IAO_0000118: to drift
IAO_0000118: verfliegen @de
IAO_0000118: vervliegen @nl
IAO_0000118: å fly feil @no
id: EUPH:3398

drinking place
type: Class
subclass of: two-dimensional spatial region in beekeeping
IAO_0000115: A drinking place is an artificial water source, e.g. a container or a device containing water, which is provided by the beekeeper as a water source for managed honey bee colonies.
IAO_0000117: Michael Rubinigg
IAO_0000118: Bienentränke @de
IAO_0000118: abbeveratoio @it
IAO_0000118: abreuvoir @fr
IAO_0000118: abrevadero @es
IAO_0000118: adăpător @ro
IAO_0000118: bebedouro @pt
IAO_0000118: bijenkroeg @nl
IAO_0000118: drikkested @da
IAO_0000118: drinking place
IAO_0000118: drinkplaats @nl
IAO_0000118: vanningsplass @no
IAO_0000118: vattningsanordning @sv
id: EUPH:3399

capped queen cell
type: Class
subclass of: queen cell
subclass of: Restriction
  on property: location of
  some values from: immature queen bee
subclass of: Restriction
  on property: has part
  some values from: wax capping
IAO_0000115: A capped queen cell is a queen cell, which has been closed with a wax capping by worker bees.
IAO_0000117: Michael Rubinigg
IAO_0000118: capped queen cell
IAO_0000118: cella reale opercolata @it
IAO_0000118: cellule royale fermée @fr
IAO_0000118: gesloten moerdop @nl
IAO_0000118: verdeckelte Weiselzelle @de
id: EUPH:34

blossom honey
type: Class
subclass of: honey
subclass of: Restriction
  on property: derives from
  some values from: nectar
IAO_0000115: Blossom honey is a honey obtained from the nectar of plants.
IAO_0000117: Michael Rubinigg
IAO_0000118: Blütenhonig @de
IAO_0000118: Nektarhonig @de
IAO_0000118: bloemenhonig @nl
IAO_0000118: bloemenhoning @nl
IAO_0000118: blomhonung @sv
IAO_0000118: blomsterhonning @da
IAO_0000118: blossom honey
IAO_0000118: cvetlični med @sl
IAO_0000118: cvjetni med @hr
IAO_0000118: għasel tan-nektar @mt
IAO_0000118: għasel taż-żahar @mt
IAO_0000118: kukkaishunaja @fi
IAO_0000118: kvetový med @sk
IAO_0000118: květový med @cs
IAO_0000118: med z nektáru @sk
IAO_0000118: mel de flores @pt
IAO_0000118: mel de néctar @pt
IAO_0000118: mesihunaja @fi
IAO_0000118: miel de fleurs @fr
IAO_0000118: miel de flores @es
IAO_0000118: miel de nectar @fr
IAO_0000118: miel de néctar @es
IAO_0000118: miele di fiori @it
IAO_0000118: miele di nettare @it
IAO_0000118: miere din inflorescență @ro
IAO_0000118: miere din nectar @ro
IAO_0000118: miód kwiatowy @pl
IAO_0000118: miód nektarowy @pl
IAO_0000118: nectar honey
IAO_0000118: nectarhonig @nl
IAO_0000118: nectarhoning @nl
IAO_0000118: nektar med @sl
IAO_0000118: nektarhonung @sv
IAO_0000118: nektarni med @hr
IAO_0000118: nektaro medus @lt
IAO_0000118: nektarový med @cs
IAO_0000118: nektárméz @hu
IAO_0000118: nektāra medus @lv
IAO_0000118: virágméz @hu
IAO_0000118: ziedu medus @lv
IAO_0000118: õiemesi @et
IAO_0000118: žiedų medus @lt
IAO_0000118: μέλι ανθέων @el
IAO_0000118: μέλι νέκταρος @el
IAO_0000118: нектарен мед @bg
IAO_0000118: цветен мед @bg
id: EUPH:3458

Axiom
annotated source: blossom honey
annotated property: IAO_0000115
annotated target: Blossom honey is a honey obtained from the nectar of plants.
source: https://eur-lex.europa.eu/eli/dir/2001/110/2014-06-23

queen cell chewed at the bottom
type: Class
subclass of: queen cell
IAO_0000115: Queen cell in which a hatched queen has chewed a hole on the side, causing the workers to remove the larva or pupa inside.
IAO_0000117: Michael Rubinigg
IAO_0000118: cella reale rosicchiata dal basso @it
IAO_0000118: cellule royale grignotée par le bas @fr
IAO_0000118: open gebeten moerdop @nl
IAO_0000118: queen cell chewed at the bottom
IAO_0000118: unten aufgebissene Weiselzelle @de
id: EUPH:35

Axiom
annotated source: queen cell chewed at the bottom
annotated property: IAO_0000115
annotated target: Queen cell in which a hatched queen has chewed a hole on the side, causing the workers to remove the larva or pupa inside.
has db xref: ISBN:1-878075-65-4

drained honey
type: Class
subclass of: honey
subclass of: Restriction
  on property: derives from
  some values from: https://w3id.org/euph/802
IAO_0000115: Drained honey is honey obtained by draining decapped broodless honey combs.
IAO_0000117: Michael Rubinigg
IAO_0000118: Tropfhonig @de
IAO_0000118: afdryppet honning @da
IAO_0000118: cijeđeni med @hr
IAO_0000118: drained honey
IAO_0000118: għasel imsoffi @mt
IAO_0000118: lecsapolt méz @hu
IAO_0000118: lekhonig @nl
IAO_0000118: lekhoning @nl
IAO_0000118: mel escorrido @pt
IAO_0000118: miel escurrida @es
IAO_0000118: miel égoutté @fr
IAO_0000118: miele scolato @it
IAO_0000118: miere drenată @ro
IAO_0000118: miód odsączany @pl
IAO_0000118: nõrgunud mesi @et
IAO_0000118: odkvapkaný med @sk
IAO_0000118: odtočeni med @sl
IAO_0000118: samotok @sl
IAO_0000118: självrunnen honung @sv
IAO_0000118: tecināts medus @lv
IAO_0000118: valutettu hunaja @fi
IAO_0000118: varvintas medus @lt
IAO_0000118: vykapaný med @cs
IAO_0000118: μέλι στραγγισμένο @el
IAO_0000118: отцеден мед @bg
id: EUPH:3571

Axiom
annotated source: drained honey
annotated property: IAO_0000115
annotated target: Drained honey is honey obtained by draining decapped broodless honey combs.
source: https://eur-lex.europa.eu/eli/dir/2001/110/2014-06-23

extracted honey
type: Class
subclass of: honey
subclass of: Restriction
  on property: derives from
  some values from: https://w3id.org/euph/802
IAO_0000115: Extracted honey is honey obtained by centrifuging decapped broodless honey combs.
IAO_0000117: Michael Rubinigg
IAO_0000118: Schleuderhonig @de
IAO_0000118: extracted honey
IAO_0000118: għasel estratt @mt
IAO_0000118: izsviests medus @lv
IAO_0000118: išsuktas medus @lt
IAO_0000118: kivont méz @hu
IAO_0000118: lingottu hunaja @fi
IAO_0000118: mel centrifugado @pt
IAO_0000118: miel centrifugada @es
IAO_0000118: miel centrifugé @fr
IAO_0000118: miele centrifugato @it
IAO_0000118: miere extrasă @ro
IAO_0000118: miód odciągnięty @pl
IAO_0000118: slingerhonig @nl
IAO_0000118: slingerhoning @nl
IAO_0000118: slungad honung @sv
IAO_0000118: slynget honning @da
IAO_0000118: točeni med @sl
IAO_0000118: vrcani med @hr
IAO_0000118: vurrimesi @et
IAO_0000118: vytočený med @cs
IAO_0000118: μέλι φυγοκεντρήσεως @el
IAO_0000118: центрофугиран мед @bg
id: EUPH:3575

Axiom
annotated source: extracted honey
annotated property: IAO_0000115
annotated target: Extracted honey is honey obtained by centrifuging decapped broodless honey combs.
source: https://eur-lex.europa.eu/eli/dir/2001/110/2014-06-23

pressed honey
type: Class
subclass of: honey
subclass of: Restriction
  on property: derives from
  some values from: https://w3id.org/euph/802
IAO_0000115: Pressed honey is honey obtained by pressing broodless honey combs with or without the application of moderate heat not exceeding 45 °C.
IAO_0000117: Michael Rubinigg
IAO_0000118: Presshonig @de
IAO_0000118: għasel ippressat @mt
IAO_0000118: išspaustas medus @lt
IAO_0000118: lisovaný med @cs
IAO_0000118: mel prensado @pt
IAO_0000118: miel prensada @es
IAO_0000118: miel pressé @fr
IAO_0000118: miele torchiato @it
IAO_0000118: miere presată @ro
IAO_0000118: miód wyciskany @pl
IAO_0000118: pershonig @nl
IAO_0000118: pershoning @nl
IAO_0000118: pressad honung @sv
IAO_0000118: pressed honey
IAO_0000118: presset honning @da
IAO_0000118: pressitud mesi @et
IAO_0000118: prešani med @hr
IAO_0000118: puristettu hunaja @fi
IAO_0000118: sajtolt méz @hu
IAO_0000118: spiests medus @lv
IAO_0000118: μέλι πιέσεως @el
IAO_0000118: пресован мед @bg
id: EUPH:3591

Axiom
annotated source: pressed honey
annotated property: IAO_0000115
annotated target: Pressed honey is honey obtained by pressing broodless honey combs with or without the application of moderate heat not exceeding 45 °C.
source: https://eur-lex.europa.eu/eli/dir/2001/110/2014-06-23

filtered honey
type: Class
subclass of: processed hive product
subclass of: Restriction
  on property: derives from
  some values from: honey
IAO_0000115: Filtered honey is honey obtained by removing foreign inorganic or organic matter in such a way as to result in the significant removal of pollen.
IAO_0000117: Michael Rubinigg
IAO_0000118: filtered honey
IAO_0000118: filtreeritud mesi @et
IAO_0000118: filtreret honning @da
IAO_0000118: filtrirani med @hr
IAO_0000118: filtrovaný med @cs
IAO_0000118: filtruotas medus @lt
IAO_0000118: gefilterde honig @nl
IAO_0000118: gefilterde honing @nl
IAO_0000118: gefilterter Honig @de
IAO_0000118: għasel iffiltrat @mt
IAO_0000118: kāsts medus @lv
IAO_0000118: mel filtrado @pt
IAO_0000118: miel filtrada @es
IAO_0000118: miel filtré @fr
IAO_0000118: miele filtrato @it
IAO_0000118: miere filtrată @ro
IAO_0000118: miód filtrowany @pl
IAO_0000118: pollenszűrt méz @hu
IAO_0000118: silad honung @sv
IAO_0000118: suodatettu hunaja @fi
IAO_0000118: διηθημένο μέλι @el
IAO_0000118: филтриран мед @bg
id: EUPH:3596

Axiom
annotated source: filtered honey
annotated property: IAO_0000115
annotated target: Filtered honey is honey obtained by removing foreign inorganic or organic matter in such a way as to result in the significant removal of pollen.
source: https://eur-lex.europa.eu/eli/dir/2001/110/2014-06-23

swarm
type: Class
subclass of: honey bee colony
subclass of: Restriction
  on property: target participant in
  some values from: https://w3id.org/euph/899
subclass of: Restriction
  on property: derives from
  some values from: honey bee colony
IAO_0000115: A swarm is a honbey bee colony that derives from a parent colony. It has been defined as a temporary cluster of adult bees that have left a hive with the queen and full stomachs at a temporary bivouac site seeking to move to a new home.
IAO_0000117: Michael Rubinigg
IAO_0000118: Schwarm @de
IAO_0000118: enjambre @es
IAO_0000118: enxame @pt
IAO_0000118: essaim @fr
IAO_0000118: roi @ro
IAO_0000118: sciame @it
IAO_0000118: sverm @no
IAO_0000118: svärm @sv
IAO_0000118: sværm @da
IAO_0000118: swarm
IAO_0000118: zwerm @nl
id: EUPH:36

Axiom
annotated source: swarm
annotated property: IAO_0000115
annotated target: A swarm is a honbey bee colony that derives from a parent colony. It has been defined as a temporary cluster of adult bees that have left a hive with the queen and full stomachs at a temporary bivouac site seeking to move to a new home.
has db xref: ISBN:1-878075-65-4

baker's honey
type: Class
subclass of: honey
IAO_0000115: Baker's honey is honey which is suitable for industrial uses or as an ingredient in other foodstuffs which are then processed.
IAO_0000117: Michael Rubinigg
IAO_0000118: Backhonig @de
IAO_0000118: bagerihonning @da
IAO_0000118: bagerihonung @sv
IAO_0000118: baker's honey
IAO_0000118: bakkershoning @nl
IAO_0000118: għasel biex jinħadem @mt
IAO_0000118: ipari méz @hu
IAO_0000118: konditerinis medus @lt
IAO_0000118: mel para uso industrial @pt
IAO_0000118: miel destiné à l'industrie @fr
IAO_0000118: miel para uso industrial @es
IAO_0000118: miele per uso industriale @it
IAO_0000118: mierea destinată industriei alimentare @ro
IAO_0000118: miód piekarski @pl
IAO_0000118: pekarski med @hr
IAO_0000118: pekařský med @cs
IAO_0000118: pekovski med @sl
IAO_0000118: pekársky med @sk
IAO_0000118: rūpnieciskais medus @lv
IAO_0000118: taloushunaja @fi
IAO_0000118: tööstusmesi @et
IAO_0000118: μέλι ζαχαροπλαστικής @el
IAO_0000118: индустриален мед @bg
id: EUPH:3600

Axiom
annotated source: baker's honey
annotated property: IAO_0000115
annotated target: Baker's honey is honey which is suitable for industrial uses or as an ingredient in other foodstuffs which are then processed.
source: https://eur-lex.europa.eu/eli/dir/2001/110/2014-06-23

chunk honey
type: Class
subclass of: honey
IAO_0000115: Chunk honey is honey which contains one or more pieces of comb honey.
IAO_0000117: Michael Rubinigg
IAO_0000118: Honig mit Wabenteilen @de
IAO_0000118: Wabenstücke in Honig @de
IAO_0000118: brokhonig @nl
IAO_0000118: brokhoning @nl
IAO_0000118: chunk honey
IAO_0000118: cut comb in honey
IAO_0000118: darabos méz @hu
IAO_0000118: deli satja v medu @sl
IAO_0000118: fagure cu miere @ro
IAO_0000118: għasel fi blokki @mt
IAO_0000118: honning med stykker af honningtavler @da
IAO_0000118: honung i bitar av vaxkakor @sv
IAO_0000118: krojone plastry w miodzie @pl
IAO_0000118: kusový med @sk
IAO_0000118: kärjetükkidega mesi @et
IAO_0000118: leikattu kennohunaja @fi
IAO_0000118: lépet tartalmazó méz @hu
IAO_0000118: med s dijelovima saća @hr
IAO_0000118: med s plástečky @cs
IAO_0000118: med s satjem @sl
IAO_0000118: med sa saćem @hr
IAO_0000118: medus ar šūnu daļām @lv
IAO_0000118: medus su korio gabalais @lt
IAO_0000118: mel com pedaços de favos @pt
IAO_0000118: miel avec morceaux de rayons @fr
IAO_0000118: miel con trozos de panal @es
IAO_0000118: miele con pezzi di favo @it
IAO_0000118: miere cu bucăți de fagure @ro
IAO_0000118: miód w bryłkach @pl
IAO_0000118: palahunaja @fi
IAO_0000118: panal cortado en miel @es
IAO_0000118: qatgħat mix-xehda fl-għasel @mt
IAO_0000118: raatbrokken in honig @nl
IAO_0000118: raatbrokken in honing @nl
IAO_0000118: rezané plásty v mede @sk
IAO_0000118: sezioni di favo nel miele @it
IAO_0000118: šūnu gabalu medus @lv
IAO_0000118: μέλι με τεμάχια κηρήθρας @el
IAO_0000118: τεμάχια κηρήθρας με μέλι @el
IAO_0000118: мед с восъчна пита @bg
id: EUPH:3632

Axiom
annotated source: chunk honey
annotated property: IAO_0000115
annotated target: Chunk honey is honey which contains one or more pieces of comb honey.
source: https://eur-lex.europa.eu/eli/dir/2001/110/2014-06-23

swarming
type: Class
subclass of: honey bee colony reproduction
subclass of: Restriction
  on property: preceded by
  some values from: swarming fever
IAO_0000115: Swarming is a reproductive process in honey bee colonies in which the queen bee leaves the colony along with some of the worker bees to establish a new nest elsewhere, whilst the remaining worker bees and drone bees stay behind in the old nest with one or more unmated queens.
IAO_0000117: Michael Rubinigg
IAO_0000118: essaimer @fr
IAO_0000118: schwärmen @de
IAO_0000118: sciamare @it
IAO_0000118: swarming
IAO_0000118: zwermen @nl
id: EUPH:37

gamma-cyhalothrin
type: Class
subclass of: cyhalothrin
subclass of: Restriction
  on property: member of
  some values from: pyrethroid insecticides [I01_01]
IAO_0000115: gamma-Cyhalothrin is a cyhalothrin. The chemical substance gamma-cyhalothrin is described by the following attributes or identifiers: PIN: trans-[(S)-cyano-(3-phenoxyphenyl)methyl] (1R,3R)-3-[(Z)-2-chloro-3,3,3-trifluoroprop-1-enyl]-2,2-dimethylcyclopropane-1-carboxylate Molecular formula: C23H19ClF3NO3 SMILES: CC1(C
IAO_0000115: 76703
IAO_0000115: -62
IAO_0000115: -3
IAO_0000115: 435
IAO_0000115: -840
IAO_0000115: -0
IAO_0000117: Michael Rubinigg
IAO_0000118: GAMA CIHALOTRINAS @lt
IAO_0000118: GAMA-CIALOTRINA @pt
IAO_0000118: GAMA-CIHALOTRIN @hr
IAO_0000118: GAMA-CIHALOTRINA @es
IAO_0000118: GAMA-CYHALOTHRIN @cs
IAO_0000118: GAMA-CYHALOTRÍN @sk
IAO_0000118: GAMMA-CIALOTRINA @it
IAO_0000118: GAMMA-CIHALOTRIN @hu
IAO_0000118: GAMMA-CIHALOTRĪNS @lv
IAO_0000118: GAMMA-CYHALOTHRIN @da
IAO_0000118: GAMMA-CYHALOTHRINE @fr
IAO_0000118: GAMMA-CYHALOTRIN @sv
IAO_0000118: GAMMA-CYHALOTRYNA @pl
IAO_0000118: GAMMA-SYHALOTRIINI @fi
IAO_0000118: GAMMA-TSÜHALOTRIIN @et
IAO_0000118: GAMMA-ĊJALOTRINA @mt
IAO_0000118: ГАМА-ЦИХАЛОТРИН @bg
id: EUPH:3703
denoted by: 435-840-0
denoted by: 76703-62-3
denoted by: C23H19ClF3NO3
denoted by: CC1(C
denoted by: I01_01_10
denoted by: RF-0585-001-PPP
denoted by: trans-[(S)-cyano-(3-phenoxyphenyl)methyl] (1R,3R)-3-[(Z)-2-chloro-3,3,3-trifluoroprop-1-enyl]-2,2-dimethylcyclopropane-1-carboxylate

Axiom
annotated source: gamma-cyhalothrin
annotated property: IAO_0000115
annotated target: gamma-Cyhalothrin is a cyhalothrin. The chemical substance gamma-cyhalothrin is described by the following attributes or identifiers: PIN: trans-[(S)-cyano-(3-phenoxyphenyl)methyl] (1R,3R)-3-[(Z)-2-chloro-3,3,3-trifluoroprop-1-enyl]-2,2-dimethylcyclopropane-1-carboxylate Molecular formula: C23H19ClF3NO3 SMILES: CC1(C
annotated target: 76703
annotated target: -62
annotated target: -3
annotated target: 435
annotated target: -840
annotated target: -0
has db xref: 10.5281/zenodo.7590216
source: https://eur-lex.europa.eu/eli/reg/2017/269/oj
source: https://pubchem.ncbi.nlm.nih.gov/compound/6440554

Axiom
annotated source: gamma-cyhalothrin
annotated property: denoted by
annotated target: 435-840-0
has db xref: https://w3id.org/euph/8101

Axiom
annotated source: gamma-cyhalothrin
annotated property: denoted by
annotated target: 76703-62-3
has db xref: CAS registry number

Axiom
annotated source: gamma-cyhalothrin
annotated property: denoted by
annotated target: C23H19ClF3NO3
has db xref: molecular formula

Axiom
annotated source: gamma-cyhalothrin
annotated property: denoted by
annotated target: CC1(C
has db xref: simplified molecular input line entry system (SMILES)

Axiom
annotated source: gamma-cyhalothrin
annotated property: denoted by
annotated target: I01_01_10
has db xref: harmonised classification of substances code

Axiom
annotated source: gamma-cyhalothrin
annotated property: denoted by
annotated target: RF-0585-001-PPP
has db xref: EFSA DCF term code

Axiom
annotated source: gamma-cyhalothrin
annotated property: denoted by
annotated target: trans-[(S)-cyano-(3-phenoxyphenyl)methyl] (1R,3R)-3-[(Z)-2-chloro-3,3,3-trifluoroprop-1-enyl]-2,2-dimethylcyclopropane-1-carboxylate
has db xref: preferred IUPAC name (PIN)

ISO 8601 basic concepts
type: Class
subclass of: https://w3id.org/euph/7587
IAO_0000115: The subset of terms used by the ISO 8601 standard, which are considered basic concepts.
IAO_0000117: Michael Rubinigg
IAO_0000118: ISO 8601 basic concepts
id: EUPH:371

Axiom
annotated source: ISO 8601 basic concepts
annotated property: IAO_0000115
annotated target: The subset of terms used by the ISO 8601 standard, which are considered basic concepts.
source: https://www.iso.org/standard/70907.html

methiocarb
type: Class
subclass of: carbamate ester
subclass of: Restriction
  on property: directly negatively regulates activity of
  some values from: acetylcholinesterase
subclass of: Restriction
  on property: member of
  some values from: carbamate insecticides [I03_02]
IAO_0000115: Methiocarb is a carbamate ester. It acts as an inhibitor of acetylcholinesterase. The chemical substance methiocarb is described by the following attributes or identifiers: PIN: (3,5-dimethyl-4-methylsulfanylphenyl) N-methylcarbamate Molecular formula: C11H15NO2S InChI: InChI=1S/C11H15NO2S/c1-7-5-9(14-11(13)12-3)6-8(2)10(7)15-4/h5-6H,1-4H3,(H,12,13) SMILES: CC1=CC(=CC(=C1SC)C)OC(=O)NC CAS Registry Number: 2032-65-7 EC Number: 217-991-2 EFSA DCF: RF-0291-001-PPP harmonised classification of substances code: I03_02_03
IAO_0000117: Michael Rubinigg
IAO_0000118: METHIOCARB @da
IAO_0000118: METHIOKARB @cs
IAO_0000118: METIOCARB @es
IAO_0000118: METIOCARBE @pt
IAO_0000118: METIOKARB @et
IAO_0000118: METIOKARBAS @lt
IAO_0000118: METIOKARBI @fi
IAO_0000118: METIOKARBS @lv
IAO_0000118: METJOKARB @mt
IAO_0000118: MÉTHIOCARBE @fr
IAO_0000118: МЕТИОКАРБ @bg
id: EUPH:3716
denoted by: (3,5-dimethyl-4-methylsulfanylphenyl) N-methylcarbamate
denoted by: 2032-65-7
denoted by: 217-991-2
denoted by: C11H15NO2S
denoted by: CC1=CC(=CC(=C1SC)C)OC(=O)NC
denoted by: I03_02_03
denoted by: InChI=1S/C11H15NO2S/c1-7-5-9(14-11(13)12-3)6-8(2)10(7)15-4/h5-6H,1-4H3,(H,12,13)
denoted by: RF-0291-001-PPP

Axiom
annotated source: methiocarb
annotated property: IAO_0000115
annotated target: Methiocarb is a carbamate ester. It acts as an inhibitor of acetylcholinesterase. The chemical substance methiocarb is described by the following attributes or identifiers: PIN: (3,5-dimethyl-4-methylsulfanylphenyl) N-methylcarbamate Molecular formula: C11H15NO2S InChI: InChI=1S/C11H15NO2S/c1-7-5-9(14-11(13)12-3)6-8(2)10(7)15-4/h5-6H,1-4H3,(H,12,13) SMILES: CC1=CC(=CC(=C1SC)C)OC(=O)NC CAS Registry Number: 2032-65-7 EC Number: 217-991-2 EFSA DCF: RF-0291-001-PPP harmonised classification of substances code: I03_02_03
has db xref: 10.5281/zenodo.7590216
source: https://eur-lex.europa.eu/eli/reg/2017/269/oj
source: https://pubchem.ncbi.nlm.nih.gov/compound/16248

Axiom
annotated source: methiocarb
annotated property: denoted by
annotated target: (3,5-dimethyl-4-methylsulfanylphenyl) N-methylcarbamate
has db xref: preferred IUPAC name (PIN)

Axiom
annotated source: methiocarb
annotated property: denoted by
annotated target: 2032-65-7
has db xref: CAS registry number

Axiom
annotated source: methiocarb
annotated property: denoted by
annotated target: 217-991-2
has db xref: https://w3id.org/euph/8101

Axiom
annotated source: methiocarb
annotated property: denoted by
annotated target: C11H15NO2S
has db xref: molecular formula

Axiom
annotated source: methiocarb
annotated property: denoted by
annotated target: CC1=CC(=CC(=C1SC)C)OC(=O)NC
has db xref: simplified molecular input line entry system (SMILES)

Axiom
annotated source: methiocarb
annotated property: denoted by
annotated target: I03_02_03
has db xref: harmonised classification of substances code

Axiom
annotated source: methiocarb
annotated property: denoted by
annotated target: InChI=1S/C11H15NO2S/c1-7-5-9(14-11(13)12-3)6-8(2)10(7)15-4/h5-6H,1-4H3,(H,12,13)
has db xref: International Chemical Identifier (InChI)

Axiom
annotated source: methiocarb
annotated property: denoted by
annotated target: RF-0291-001-PPP
has db xref: EFSA DCF term code

honey hydroxymethylfurfural content
type: Class
subclass of: hive product quality
subclass of: Restriction
  on property: member of
  some values from: EU directive 2001-110
subclass of: Restriction
  on property: quality of
  some values from: honey
IAO_0000115: The hydroxymethylfurfural content is a honey quality parameter. In honey it is used as an indicator for storage conditions and heat treatment.
IAO_0000117: Michael Rubinigg
IAO_0000118: Hydroxymethylfurfurolgehalt @de
IAO_0000118: contenido en hidroximetilfurfural @es
IAO_0000118: conținut de hidroximetilfurfural @ro
IAO_0000118: gehalte aan hydroxymethylfurfural @nl
IAO_0000118: hidroksimetilfurfurola @lv
IAO_0000118: hidroksimetilfurfurolas @lt
IAO_0000118: hidroxi-metil-korpa-tartalom @hu
IAO_0000118: hydroksimetyylifurfuraalipitoisuus @fi
IAO_0000118: hydroximetylfurfurhalt @sv
IAO_0000118: hydroxymethylfurfural content
IAO_0000118: hüdroksümetüülfurfuraali sisaldus @et
IAO_0000118: indhold af hydroxymethylfurfural @da
IAO_0000118: količina hidroksimetilfurfurala @hr
IAO_0000118: kontenut hydroxymethylfurfural @mt
IAO_0000118: obsah hydroxymethylfurfuralu @cs
IAO_0000118: obsah hydroxymetylfurfuralu @sk
IAO_0000118: teneur en hydroxyméthylfurfural @fr
IAO_0000118: tenore di idrossimetilfurfurale @it
IAO_0000118: teor de hidroximetilfurfural @pt
IAO_0000118: vsebnost hidroksi metil furfurala @sl
IAO_0000118: zawartość hydroksymetylofurfuralu @pl
IAO_0000118: περιεκτικότητας σε υδροξυμεθυλοφουρφουράλη @el
IAO_0000118: съдържание на хидроксиметилфурфурол @bg
id: EUPH:3718

Axiom
annotated source: honey hydroxymethylfurfural content
annotated property: IAO_0000115
annotated target: The hydroxymethylfurfural content is a honey quality parameter. In honey it is used as an indicator for storage conditions and heat treatment.
has db xref: 10.1080/00218839.2017.1338444

honey moisture content
type: Class
subclass of: hive product quality
subclass of: Restriction
  on property: member of
  some values from: EU directive 2001-110
subclass of: Restriction
  on property: quality of
  some values from: honey
IAO_0000115: Moisture content is a honey quality parameter related to the shelf-life of honey.
IAO_0000117: Michael Rubinigg
IAO_0000118: Wassergehalt @de
IAO_0000118: contenido de agua @es
IAO_0000118: drėgmės kiekis @lt
IAO_0000118: količina vode @hr
IAO_0000118: kontenut ta' ndewwa @mt
IAO_0000118: kosteuspitoisuus @fi
IAO_0000118: moisture content
IAO_0000118: nedvességtartalom @hu
IAO_0000118: niiskusesisaldus @et
IAO_0000118: obsah hmotnostného percenta vody @sk
IAO_0000118: obsah vlhkosti @cs
IAO_0000118: teneur en eau @fr
IAO_0000118: tenore d'acqua @it
IAO_0000118: teor de água @pt
IAO_0000118: umiditate @ro
IAO_0000118: vandindhold @da
IAO_0000118: vattenhalt @sv
IAO_0000118: vochtgehalte @nl
IAO_0000118: vsebnost vlage @sl
IAO_0000118: zawartość wilgoci @pl
IAO_0000118: ūdens saturs @lv
IAO_0000118: υγρασία @el
IAO_0000118: съдържание на влага @bg
id: EUPH:3726

Axiom
annotated source: honey moisture content
annotated property: IAO_0000115
annotated target: Moisture content is a honey quality parameter related to the shelf-life of honey.
has db xref: 10.1080/00218839.2017.1338444

orange oil
type: Class
subclass of: herbal extract
subclass of: Restriction
  on property: member of
  some values from: botanical insecticides [I05_02]
IAO_0000115: Orange oil is a herbal pharmaceutical extracted from plants of the genus Citrus. Orange oil is described by the following attributes or identifiers: EFSA DCF: RF-00005784-PAR harmonised classification of substances code: I05_02_01
IAO_0000117: Michael Rubinigg
IAO_0000118: ACEITE DE NARANJA @es
IAO_0000118: APELSINIÕLI @et
IAO_0000118: APELSINOLJA @sv
IAO_0000118: APELSINŲ ALIEJUS @lt
IAO_0000118: APELSĪNU EĻĻA @lv
IAO_0000118: APPELSIINIÖLJY @fi
IAO_0000118: HUILE ESSENTIELLE D'ORANGE @fr
IAO_0000118: NARANCSOLAJ @hu
IAO_0000118: NARANČINO ULJE @hr
IAO_0000118: OLEJ Z POMERANČOVÉ KŮRY @cs
IAO_0000118: OLEJEK POMARAŃCZOWY @pl
IAO_0000118: OLIO DI ARANCIO @it
IAO_0000118: OLJE POMARANČEVCA @sl
IAO_0000118: ORANGE OIL
IAO_0000118: ORANGENÖL @de
IAO_0000118: ORANGEOLIE @da
IAO_0000118: POMARANČOVÝ OLEJ @sk
IAO_0000118: SINAASAPPELOLIE @nl
IAO_0000118: ULEI DE PORTOCALE @ro
IAO_0000118: ÓLEO DE LARANJA @pt
IAO_0000118: ŻEJT TAL-LARINĠ @mt
IAO_0000118: ΠΟΡΤΟΚΑΛΕΛΑΙΟ @el
IAO_0000118: ПОРТОКАЛОВО МАСЛО @bg
id: EUPH:3743
denoted by: I05_02_01
denoted by: RF-00005784-PAR

Axiom
annotated source: orange oil
annotated property: IAO_0000115
annotated target: Orange oil is a herbal pharmaceutical extracted from plants of the genus Citrus. Orange oil is described by the following attributes or identifiers: EFSA DCF: RF-00005784-PAR harmonised classification of substances code: I05_02_01
has db xref: 10.5281/zenodo.7590216
source: https://eur-lex.europa.eu/eli/reg/2017/269/oj

Axiom
annotated source: orange oil
annotated property: denoted by
annotated target: I05_02_01
has db xref: harmonised classification of substances code

Axiom
annotated source: orange oil
annotated property: denoted by
annotated target: RF-00005784-PAR
has db xref: EFSA DCF term code

tagetes oil
type: Class
subclass of: herbal extract
subclass of: Restriction
  on property: member of
  some values from: botanical insecticides [I05_02]
IAO_0000115: Tagetes oil is a herbal pharmaceutical extracted from plants of the genus Tagetes. Tagetes oil is described by the following attributes or identifiers: harmonised classification of substances code: I05_02_02
IAO_0000117: Michael Rubinigg
IAO_0000118: ACEITE DE TAGETES @es
IAO_0000118: AKSAMIETNICOVÝ OLEJ @sk
IAO_0000118: HUILE ESSENTIELLE DE TAGÈTE @fr
IAO_0000118: OLEJ Z AKSAMITNÍKU @cs
IAO_0000118: OLEJEK AKSAMITKOWY @pl
IAO_0000118: OLIO DI TAGETE @it
IAO_0000118: OLJE ŽAMETNIC @sl
IAO_0000118: PEIULILLEÕLI @et
IAO_0000118: SAMETTIKUKKAÖLJY @fi
IAO_0000118: SAMTEŅU EĻĻA @lv
IAO_0000118: SERENČIŲ ALIEJUS @lt
IAO_0000118: TAGETES OIL @el
IAO_0000118: TAGETES OLAJ @hu
IAO_0000118: TAGETESOLIE @da
IAO_0000118: TAGETESOLJA @sv
IAO_0000118: TAGETESÖL @de
IAO_0000118: ULEI DE CRĂIȚĂ @ro
IAO_0000118: ULJE KADIFICE @hr
IAO_0000118: ÓLEO DE TAGETES @pt
IAO_0000118: ŻEJT TAT-TAGETES @mt
IAO_0000118: МАСЛО ОТ ТАГЕТЕС @bg
id: EUPH:3744
denoted by: I05_02_02

Axiom
annotated source: tagetes oil
annotated property: IAO_0000115
annotated target: Tagetes oil is a herbal pharmaceutical extracted from plants of the genus Tagetes. Tagetes oil is described by the following attributes or identifiers: harmonised classification of substances code: I05_02_02
source: https://eur-lex.europa.eu/eli/reg/2017/269/oj

Axiom
annotated source: tagetes oil
annotated property: denoted by
annotated target: I05_02_02
has db xref: harmonised classification of substances code

honey electrical conductivity
type: Class
subclass of: hive product quality
subclass of: Restriction
  on property: member of
  some values from: EU directive 2001-110
subclass of: Restriction
  on property: quality of
  some values from: honey
IAO_0000115: Electrical conductivity is a honey quality parameter related to the botanical origin of honey, which is based on the content of minerals (inorganic ions) as well as any other component that can act as electrolyte.
IAO_0000117: Michael Rubinigg
IAO_0000118: conductividad eléctrica @es
IAO_0000118: conductivitate electrică @ro
IAO_0000118: conductivité électrique @fr
IAO_0000118: condutividade eléctrica @pt
IAO_0000118: conduttività elettrica @it
IAO_0000118: electrical conductivity
IAO_0000118: elektrická vodivost @cs
IAO_0000118: elektrická vodivosť @sk
IAO_0000118: elektrijuhtivus @et
IAO_0000118: elektrinis laidumas @lt
IAO_0000118: elektrische Leitfähigkeit @de
IAO_0000118: elektrisk ledningsevne @da
IAO_0000118: elektrisk ledningsförmåga @sv
IAO_0000118: električna vodljivost @hr
IAO_0000118: elektrolitska prevodnost @sl
IAO_0000118: elektrovadītspēja @lv
IAO_0000118: johtavuus @fi
IAO_0000118: konduttività elettrika @mt
IAO_0000118: przewodność elektryczna @pl
IAO_0000118: soortelijke elektrische geleiding @nl
IAO_0000118: áramvezető képesség @hu
IAO_0000118: ηλεκτρική αγωγιμότητα @el
IAO_0000118: електропроводимост @bg
id: EUPH:3747

Axiom
annotated source: honey electrical conductivity
annotated property: IAO_0000115
annotated target: Electrical conductivity is a honey quality parameter related to the botanical origin of honey, which is based on the content of minerals (inorganic ions) as well as any other component that can act as electrolyte.
has db xref: 10.1080/00218839.2017.1338444

acetamiprid
type: Class
subclass of: chloropyridine
subclass of: Restriction
  on property: member of
  some values from: pyridymethylamine insecticides [I99_14]
IAO_0000115: Acetamiprid is a chloropyridine. The chemical substance acetamiprid is described by the following attributes or identifiers: PIN: N-[(6-chloro-3-pyridinyl)methyl]-N'-cyano-N-methylethanimidamide Molecular formula: C10H11ClN4 InChI: InChI=1S/C10H11ClN4/c1-8(14-7-12)15(2)6-9-3-4-10(11)13-5-9/h3-5H,6H2,1-2H3/b14-8+ SMILES: C(N(/C(=N/C#N)/C)C)C=1C=CC(Cl)=NC1 CAS Registry Number: 135410-20-7 EC Number: 682-791-8 EFSA DCF: RF-0014-001-PPP harmonised classification of substances code: I99_14_01
IAO_0000117: Michael Rubinigg
IAO_0000118: ACETAMIPRID @cs
IAO_0000118: ACETAMIPRIDAS @lt
IAO_0000118: ACETAMIPRIDE @pt
IAO_0000118: ACETAMIPRYD @pl
IAO_0000118: ACETAMIPRĪDS @lv
IAO_0000118: ACÉTAMIPRIDE @fr
IAO_0000118: ASETAMIPRIDI @fi
IAO_0000118: ATSEETAMIPRIID @et
IAO_0000118: AĊETAMIPRID @mt
IAO_0000118: АЦЕТАМИПРИД @bg
id: EUPH:3779
denoted by: 135410-20-7
denoted by: 682-791-8
denoted by: C(N(/C(=N/C#N)/C)C)C=1C=CC(Cl)=NC1
denoted by: C10H11ClN4
denoted by: I99_14_01
denoted by: InChI=1S/C10H11ClN4/c1-8(14-7-12)15(2)6-9-3-4-10(11)13-5-9/h3-5H,6H2,1-2H3/b14-8+
denoted by: N-[(6-chloro-3-pyridinyl)methyl]-N'-cyano-N-methylethanimidamide
denoted by: RF-0014-001-PPP

Axiom
annotated source: acetamiprid
annotated property: IAO_0000115
annotated target: Acetamiprid is a chloropyridine. The chemical substance acetamiprid is described by the following attributes or identifiers: PIN: N-[(6-chloro-3-pyridinyl)methyl]-N'-cyano-N-methylethanimidamide Molecular formula: C10H11ClN4 InChI: InChI=1S/C10H11ClN4/c1-8(14-7-12)15(2)6-9-3-4-10(11)13-5-9/h3-5H,6H2,1-2H3/b14-8+ SMILES: C(N(/C(=N/C#N)/C)C)C=1C=CC(Cl)=NC1 CAS Registry Number: 135410-20-7 EC Number: 682-791-8 EFSA DCF: RF-0014-001-PPP harmonised classification of substances code: I99_14_01
has db xref: 10.5281/zenodo.7590216
source: https://eur-lex.europa.eu/eli/reg/2017/269/oj
source: https://pubchem.ncbi.nlm.nih.gov/compound/213021

Axiom
annotated source: acetamiprid
annotated property: denoted by
annotated target: 135410-20-7
has db xref: CAS registry number

Axiom
annotated source: acetamiprid
annotated property: denoted by
annotated target: 682-791-8
has db xref: https://w3id.org/euph/8101

Axiom
annotated source: acetamiprid
annotated property: denoted by
annotated target: C(N(/C(=N/C#N)/C)C)C=1C=CC(Cl)=NC1
has db xref: simplified molecular input line entry system (SMILES)

Axiom
annotated source: acetamiprid
annotated property: denoted by
annotated target: C10H11ClN4
has db xref: molecular formula

Axiom
annotated source: acetamiprid
annotated property: denoted by
annotated target: I99_14_01
has db xref: harmonised classification of substances code

Axiom
annotated source: acetamiprid
annotated property: denoted by
annotated target: InChI=1S/C10H11ClN4/c1-8(14-7-12)15(2)6-9-3-4-10(11)13-5-9/h3-5H,6H2,1-2H3/b14-8+
has db xref: International Chemical Identifier (InChI)

Axiom
annotated source: acetamiprid
annotated property: denoted by
annotated target: N-[(6-chloro-3-pyridinyl)methyl]-N'-cyano-N-methylethanimidamide
has db xref: preferred IUPAC name (PIN)

Axiom
annotated source: acetamiprid
annotated property: denoted by
annotated target: RF-0014-001-PPP
has db xref: EFSA DCF term code

codlemone
type: Class
subclass of: fatty alcohol
subclass of: Restriction
  on property: member of
  some values from: insect attractants straight chain lepidopteran pheromones (SCLPS) [I99_18]
IAO_0000115: Codlemone is a fatty alcohol. It has similar properties to a pheromone produced by female codling moths (Cydia pomonella) that acts as sex-attractant for males. The chemical substance codlemone is described by the following attributes or identifiers: PIN: (8E,10E)-dodeca-8,10-dien-1-ol Molecular formula: C12H22O InChI: InChI=1S/C12H22O/c1-2-3-4-5-6-7-8-9-10-11-12-13/h2-5,13H,6-12H2,1H3/b3-2+,5-4+ SMILES: C/C=C/C=C/CCCCCCCO CAS Registry Number: 33956-49-9 EC Number: 251-761-2 EFSA DCF: RF-00007850-PAR harmonised classification of substances code: I99_18_01
IAO_0000117: Michael Rubinigg
IAO_0000118: (8E,10E)-DODEKA-8,10-DIEN-1-OL @cs
IAO_0000118: (8E,10E)-DODEKA-8,10-DIÉN-1-OL @sk
IAO_0000118: (E,E)-8,10-DODECADIEEN-1-OL @nl
IAO_0000118: (E,E)-8,10-DODECADIEN-1-OL @da
IAO_0000118: (E,E)-8,10-DODECADIEN-1-OLO @it
IAO_0000118: (E,E)-8,10-DODEKADIEEN-1-OOL @et
IAO_0000118: (E,E)-8,10-DODEKADIEN-1-OL @hr
IAO_0000118: (E,E)-8,10-DODEKADIEN-1-OLI @fi
IAO_0000118: (E,E)-8,10-DODEKADIEN-1-OLIS @lt
IAO_0000118: (E,E)-8,10-DODEKADIÉN-1-OL @hu
IAO_0000118: (E,E)-8,10-DODEKADIĒN-1-OLS @lv
IAO_0000118: (E,E)-8,10-DODÉCADIÉN-1-OL @fr
IAO_0000118: (E,E)-8,10-ΔΩΔΕΚΑΝΟΔΙΕΝ-1-ΟΛΗ @el
IAO_0000118: (E,E)-8,10-ДОДЕКАДИЕН-1-ОЛ @bg
id: EUPH:3785
denoted by: (8E,10E)-dodeca-8,10-dien-1-ol
denoted by: 251-761-2
denoted by: 33956-49-9
denoted by: C/C=C/C=C/CCCCCCCO
denoted by: C12H22O
denoted by: I99_18_01
denoted by: InChI=1S/C12H22O/c1-2-3-4-5-6-7-8-9-10-11-12-13/h2-5,13H,6-12H2,1H3/b3-2+,5-4+
denoted by: RF-00007850-PAR

Axiom
annotated source: codlemone
annotated property: IAO_0000115
annotated target: Codlemone is a fatty alcohol. It has similar properties to a pheromone produced by female codling moths (Cydia pomonella) that acts as sex-attractant for males. The chemical substance codlemone is described by the following attributes or identifiers: PIN: (8E,10E)-dodeca-8,10-dien-1-ol Molecular formula: C12H22O InChI: InChI=1S/C12H22O/c1-2-3-4-5-6-7-8-9-10-11-12-13/h2-5,13H,6-12H2,1H3/b3-2+,5-4+ SMILES: C/C=C/C=C/CCCCCCCO CAS Registry Number: 33956-49-9 EC Number: 251-761-2 EFSA DCF: RF-00007850-PAR harmonised classification of substances code: I99_18_01
has db xref: 10.1126/science.174.4006.297
has db xref: 10.5281/zenodo.7590216
source: https://eur-lex.europa.eu/eli/reg/2017/269/oj
source: https://pubchem.ncbi.nlm.nih.gov/compound/1787910

Axiom
annotated source: codlemone
annotated property: denoted by
annotated target: (8E,10E)-dodeca-8,10-dien-1-ol
has db xref: preferred IUPAC name (PIN)

Axiom
annotated source: codlemone
annotated property: denoted by
annotated target: 251-761-2
has db xref: https://w3id.org/euph/8101

Axiom
annotated source: codlemone
annotated property: denoted by
annotated target: 33956-49-9
has db xref: CAS registry number

Axiom
annotated source: codlemone
annotated property: denoted by
annotated target: C/C=C/C=C/CCCCCCCO
has db xref: simplified molecular input line entry system (SMILES)

Axiom
annotated source: codlemone
annotated property: denoted by
annotated target: C12H22O
has db xref: molecular formula

Axiom
annotated source: codlemone
annotated property: denoted by
annotated target: I99_18_01
has db xref: harmonised classification of substances code

Axiom
annotated source: codlemone
annotated property: denoted by
annotated target: InChI=1S/C12H22O/c1-2-3-4-5-6-7-8-9-10-11-12-13/h2-5,13H,6-12H2,1H3/b3-2+,5-4+
has db xref: International Chemical Identifier (InChI)

Axiom
annotated source: codlemone
annotated property: denoted by
annotated target: RF-00007850-PAR
has db xref: EFSA DCF term code

queenless
type: Class
subclass of: relational quality of colonies
subclass of: Restriction
  on property: towards
  some values from: adult queen bee
subclass of: Restriction
  on property: quality of
  some values from: honey bee colony
IAO_0000115: The condition of a colony lacking a queen.
IAO_0000117: Michael Rubinigg
IAO_0000118: dronningløs @da
IAO_0000118: fără matcă @ro
IAO_0000118: huérfano @es
IAO_0000118: königinnenlos @de
IAO_0000118: moerloos @nl
IAO_0000118: orfan @ro
IAO_0000118: orfano @it
IAO_0000118: orphelin @fr
IAO_0000118: queenless
IAO_0000118: viselös @sv
IAO_0000118: weisellos @de
IAO_0000118: weiselunrichtig @de
IAO_0000118: órfão @pt
id: EUPH:38

Axiom
annotated source: queenless
annotated property: IAO_0000115
annotated target: The condition of a colony lacking a queen.
has db xref: ISBN:1-878075-65-4

queenright
type: Class
subclass of: relational quality of colonies
subclass of: Restriction
  on property: towards
  some values from: adult queen bee
subclass of: Restriction
  on property: quality of
  some values from: honey bee colony
IAO_0000115: A colony with a healthy, worker egg-laying queen. The opposite of queenless.
IAO_0000117: Michael Rubinigg
IAO_0000118: colonie normală @ro
IAO_0000118: colónia normal com rainha @pt
IAO_0000118: con regina @it
IAO_0000118: cu matcă @ro
IAO_0000118: dronningret @da
IAO_0000118: dronningrett @no
IAO_0000118: dronningriktig @no
IAO_0000118: drottningriktig @sv
IAO_0000118: en posesiòn de reina @es
IAO_0000118: en possession d'une reine @fr
IAO_0000118: en possession de mère @fr
IAO_0000118: in possesso di una regina @it
IAO_0000118: moergoed @nl
IAO_0000118: queenright
IAO_0000118: viseriktig @sv
IAO_0000118: viserrigtig @da
IAO_0000118: weiselrichtig @de
id: EUPH:39

Axiom
annotated source: queenright
annotated property: IAO_0000115
annotated target: A colony with a healthy, worker egg-laying queen. The opposite of queenless.
has db xref: ISBN:1-878075-65-4

honey bee colony
type: Class
subclass of: object in beekeeping
IAO_0000115: A group of honey bees of the genus Apis living together in the same nest.
IAO_0000117: Michael Rubinigg
IAO_0000118: Bienenvolk @de
IAO_0000118: Honigbienenvolk @de
IAO_0000118: honey bee colony
id: EUPH:3932

play cup
type: Class
subclass of: cell
IAO_0000115: Empty, queen cup-like beeswax structure in which the queen does not lay an egg.
IAO_0000117: Michael Rubinigg
IAO_0000118: Spielnäpfchen @de
IAO_0000118: amusette @fr
IAO_0000118: play cup
IAO_0000118: speeldopje @nl
id: EUPH:3933

requeening by bees
type: Class
subclass of: queen management
IAO_0000115: Replacement of a queen by the bees without deliberate intervention by the beekeeper.
IAO_0000117: Michael Rubinigg
IAO_0000118: Nachziehen @de
IAO_0000118: dronningskifte @da
IAO_0000118: drottningbyte @sv
IAO_0000118: moerwisseling @nl
IAO_0000118: reemplazo de la reina @es
IAO_0000118: remplacement de la reine @fr
IAO_0000118: renovación de la reina @es
IAO_0000118: requeening by bees
IAO_0000118: schimbarea mătcii @ro
IAO_0000118: selvskiftning @no
IAO_0000118: stille Umweiselung @de
IAO_0000118: substituição de la rainha @pt
IAO_0000118: înlocuirea mătcii de către albine @ro
id: EUPH:3935

uncapping fork
type: Class
subclass of: uncapping equipment
subclass of: Restriction
  on property: involved in
  some values from: uncapping
IAO_0000115: A fork-like tool used for manually removing wax cappings from honey frames.
IAO_0000117: Michael Rubinigg
IAO_0000118: Entdeckelungsgabel @de
IAO_0000118: avtäckningsgaffel @sv
IAO_0000118: forchetta disopercolatrice @it
IAO_0000118: fourchette à désoperculer @fr
IAO_0000118: furculiță de descăpăcit @ro
IAO_0000118: garfo de desopercular @pt
IAO_0000118: horquilla de desopercular @es
IAO_0000118: ontzegelvork @nl
IAO_0000118: skrellegaffel @no
IAO_0000118: skrællegaffel @da
IAO_0000118: uncapping fork
id: EUPH:3936

intermediate
type: Class
subclass of: qualitative attribute
IAO_0000115: being or happening between to things, places, stages, etc.; in thee middle
IAO_0000117: Michael Rubinigg
IAO_0000118: intermediair @nl
IAO_0000118: intermediate
IAO_0000118: intermedio @it
IAO_0000118: intermediär @de
IAO_0000118: intermédiaire @fr
id: EUPH:4

supersedure
type: Class
subclass of: queen management
IAO_0000115: The replacement of a weak or old queen in a colony by a daughter queen - a natural occurrence.
IAO_0000117: Michael Rubinigg
IAO_0000118: remplacement par les abeilles @fr
IAO_0000118: remérage naturel @fr
IAO_0000118: rinnovo della regina @it
IAO_0000118: sostituzione naturale della regina @it
IAO_0000118: stilla drottningbyte @sv
IAO_0000118: stille Umweiselung @de
IAO_0000118: stille dronningskifte @da
IAO_0000118: stille moerwisseling @nl
IAO_0000118: substitución natural de la reina @es
IAO_0000118: substituição @pt
IAO_0000118: supercédure @fr
IAO_0000118: supersedure
IAO_0000118: vernieuwing @nl
IAO_0000118: înlocuirea liniștită a mătcii @ro
id: EUPH:40

Axiom
annotated source: supersedure
annotated property: IAO_0000115
annotated target: The replacement of a weak or old queen in a colony by a daughter queen - a natural occurrence.
has db xref: ISBN:1-878075-65-4

ontology representation language
type: Class
subclass of: plan specification
IAO_0000115: An ontology representation language is a formal language used to encode ontologies by providing syntax and semantics for defining classes, properties, and axioms.
IAO_0000117: Michael Rubinigg
IAO_0000118: ontology representation language
id: EUPH:4029

preferred IUPAC name (PIN)
type: Class
subclass of: IUPAC nomenclature
IAO_0000115: The preferred IUPAC name (PIN) of an organic chemical compound is a single name in IUPAC nomenclature, which is to be preferred in legal situations.
IAO_0000117: Michael Rubinigg
IAO_0000118: PIN
IAO_0000118: preferred IUPAC name
id: EUPH:4079
denoted by: //app.pollinatorhub.eu/vocabulary/classes/6303), which is to be preferred in legal situations.

Axiom
annotated source: preferred IUPAC name (PIN)
annotated property: IAO_0000115
annotated target: The preferred IUPAC name (PIN) of an organic chemical compound is a single name in IUPAC nomenclature, which is to be preferred in legal situations.
has db xref: ISBN:978-0-85404-182-4

Axiom
annotated source: preferred IUPAC name (PIN)
annotated property: denoted by
annotated target: //app.pollinatorhub.eu/vocabulary/classes/6303), which is to be preferred in legal situations.
has db xref: preferred IUPAC name (PIN)

requeening by beekeeper
type: Class
subclass of: queen management
IAO_0000115: Requeening by beekeeper is the intentional replacement of a queen by the beekeeper.
IAO_0000117: Michael Rubinigg
IAO_0000118: Königinnenerneuerung @de
IAO_0000118: Umweiselung @de
IAO_0000118: cambio de la reina @es
IAO_0000118: cambio della regina @it
IAO_0000118: dronningfornyelse @da
IAO_0000118: dronningskifte @no
IAO_0000118: drottningbyte @sv
IAO_0000118: reemplazo de la reina @es
IAO_0000118: remplacement de la reine @fr
IAO_0000118: remérage @fr
IAO_0000118: requeening by beekeeper
IAO_0000118: sostitutione @it
IAO_0000118: substituição de la rainha @pt
IAO_0000118: vervangen van de moer @nl
IAO_0000118: verwisseling van de koningin @nl
IAO_0000118: înlocuirea mătcii de către apicultor @ro
id: EUPH:41

role in information science
type: Class
subclass of: realisable entitiy in information science
IAO_0000115: A realizable entity the manifestation of which brings about some result or end that is not essential to a continuant in virtue of the kind of thing that it is but that can be served or participated in by that kind of continuant in some kinds of natural, social or institutional contexts.
IAO_0000117: Michael Rubinigg
IAO_0000118: role in information science
id: EUPH:4140

Axiom
annotated source: role in information science
annotated property: IAO_0000115
annotated target: A realizable entity the manifestation of which brings about some result or end that is not essential to a continuant in virtue of the kind of thing that it is but that can be served or participated in by that kind of continuant in some kinds of natural, social or institutional contexts.
source: http://purl.obolibrary.org/obo/BFO_0000023

worker bee
type: Class
subclass of: member of honey bee colony
subclass of: Restriction
  on property: has role
  some values from: caste
IAO_0000115: A worker bee is a member of honey bee colony [...] whose reproductive organs are only partially developed; responsible for carrying on all inside-hive duties except egg-laying, and all outside foraging for food, water, and propolis.
IAO_0000117: Michael Rubinigg
IAO_0000118: Arbeiterin @de
IAO_0000118: Arbeitsbiene @de
IAO_0000118: abelha abreira @pt
IAO_0000118: abelha operária @pt
IAO_0000118: albină lucrătoare @ro
IAO_0000118: arbeider @no
IAO_0000118: arbeidsbi @no
IAO_0000118: arbeidster @nl
IAO_0000118: arbejder @da
IAO_0000118: arbetsbi @sv
IAO_0000118: obreira @pt
IAO_0000118: obrera @es
IAO_0000118: operaia @it
IAO_0000118: operária @pt
IAO_0000118: ouvrière @fr
IAO_0000118: werkbij @nl
IAO_0000118: werkster @nl
IAO_0000118: worker
IAO_0000118: worker bee
id: EUPH:42

Axiom
annotated source: worker bee
annotated property: IAO_0000115
annotated target: A worker bee is a member of honey bee colony [...] whose reproductive organs are only partially developed; responsible for carrying on all inside-hive duties except egg-laying, and all outside foraging for food, water, and propolis.
has db xref: ISBN:1-878075-65-4

measurement unit ID
type: Class
subclass of: identifier of information resources
subclass of: Restriction
  on property: quality of
  some values from: measurement unit
IAO_0000115: Identifier of a measurement unit. May be a global unique identifier or an identifier specific to a collection or institution.
IAO_0000117: Michael Rubinigg
IAO_0000118: measurement unit ID
IAO_0000118: measurement unit identifier
id: EUPH:422

applicability
type: Class
subclass of: physical quantity
IAO_0000115: The quantity applicability
IAO_0000117: Michael Rubinigg
IAO_0000118: Anwendbarkeit @de
IAO_0000118: applicability
id: EUPH:423

share
type: Class
subclass of: physical quantity
IAO_0000115: The quantity share
IAO_0000117: Michael Rubinigg
IAO_0000118: Anteil @de
IAO_0000118: share
id: EUPH:424

monetary value
type: Class
subclass of: physical quantity
IAO_0000115: The economic quantity monetary value
IAO_0000117: Michael Rubinigg
IAO_0000118: Geldwert @de
IAO_0000118: denarna vrednost @sl
IAO_0000118: monetary value
id: EUPH:425

smoking
type: Class
subclass of: https://w3id.org/euph/8084
IAO_0000115: Smoking is a technique used in beekeeping to reduce the defensive behaviour of a bee colony during hive inspections by applying smoke.
IAO_0000117: Michael Rubinigg
IAO_0000118: a afuma @ro
IAO_0000118: affumicare @it
IAO_0000118: ahumar @es
IAO_0000118: at give røg @da
IAO_0000118: att röka @sv
IAO_0000118: beroken @nl
IAO_0000118: enfumer @fr
IAO_0000118: fumigar @pt
IAO_0000118: rauchen @de
IAO_0000118: räuchern @de
IAO_0000118: smoking
IAO_0000118: to smoke
IAO_0000118: å røke @no
IAO_0000118: å røyke @no
id: EUPH:426

length
type: Class
subclass of: physical quantity
IAO_0000115: The physical quantity length
IAO_0000117: Michael Rubinigg
IAO_0000118: Länge @de
IAO_0000118: length
id: EUPH:427

Axiom
annotated source: length
annotated property: IAO_0000115
annotated target: The physical quantity length
source: https://www.bipm.org/en/publications/si-brochure

area
type: Class
subclass of: physical quantity
IAO_0000115: The physical quantity area
IAO_0000117: Michael Rubinigg
IAO_0000118: Fläche @de
IAO_0000118: area
id: EUPH:428

Axiom
annotated source: area
annotated property: IAO_0000115
annotated target: The physical quantity area
source: https://www.bipm.org/en/publications/si-brochure

volume
type: Class
subclass of: physical quantity
IAO_0000115: The physical quantity volume
IAO_0000117: Michael Rubinigg
IAO_0000118: Volumen @de
IAO_0000118: volume
id: EUPH:429

Axiom
annotated source: volume
annotated property: IAO_0000115
annotated target: The physical quantity volume
source: https://www.bipm.org/en/publications/si-brochure

drone layer
type: Class
subclass of: intrinsic role in beekeeping
IAO_0000115: A queen which lays only unfertilized, drone eggs, resulting from improperly or non-mated queen or an older queen that has run out of sperm.
IAO_0000117: Michael Rubinigg
IAO_0000118: darrenbroedige moer @nl
IAO_0000118: darrenmoer @nl
IAO_0000118: donemor @no
IAO_0000118: drohnenbrütige Königin @de
IAO_0000118: drone laying queen
IAO_0000118: drone-breeding queen
IAO_0000118: droneleggende dronning @no
IAO_0000118: dronemoder @da
IAO_0000118: matcă trîntoriță @ro
IAO_0000118: puckelynglande drottning @sv
IAO_0000118: rainha zanganeira @pt
IAO_0000118: rainha zangueira @pt
IAO_0000118: regina fucaiola @it
IAO_0000118: reina zanganera @es
IAO_0000118: reine bourdonneuse @fr
id: EUPH:43

Axiom
annotated source: drone layer
annotated property: IAO_0000115
annotated target: A queen which lays only unfertilized, drone eggs, resulting from improperly or non-mated queen or an older queen that has run out of sperm.
has db xref: ISBN:1-878075-65-4

amount
type: Class
subclass of: physical quantity
IAO_0000115: The physical quantity amount
IAO_0000117: Michael Rubinigg
IAO_0000118: Menge @de
IAO_0000118: amount
id: EUPH:430

Axiom
annotated source: amount
annotated property: IAO_0000115
annotated target: The physical quantity amount
source: https://www.bipm.org/en/publications/si-brochure

energy
type: Class
subclass of: physical quantity
IAO_0000115: The physical quantity energy
IAO_0000117: Michael Rubinigg
IAO_0000118: Energie @de
IAO_0000118: energy
id: EUPH:431

Axiom
annotated source: energy
annotated property: IAO_0000115
annotated target: The physical quantity energy
source: https://www.bipm.org/en/publications/si-brochure

power
type: Class
subclass of: physical quantity
IAO_0000115: The physical quantity power
IAO_0000117: Michael Rubinigg
IAO_0000118: Leistung @de
IAO_0000118: power
id: EUPH:432

Axiom
annotated source: power
annotated property: IAO_0000115
annotated target: The physical quantity power
source: https://www.bipm.org/en/publications/si-brochure

Celsius temperature
type: Class
subclass of: temperature
IAO_0000115: The physical quantity Celsius temperature expressed in the derived SI unit with special name and symbol degree Celcius.
IAO_0000117: Michael Rubinigg
IAO_0000118: Celsius temperature
IAO_0000118: Temperatur @de
IAO_0000118: temperature
id: EUPH:433

Axiom
annotated source: Celsius temperature
annotated property: IAO_0000115
annotated target: The physical quantity Celsius temperature expressed in the derived SI unit with special name and symbol degree Celcius.
source: https://www.bipm.org/en/publications/si-brochure

speed
type: Class
subclass of: physical quantity
IAO_0000115: The physical quantity speed
IAO_0000117: Michael Rubinigg
IAO_0000118: Geschwindigkeit @de
IAO_0000118: speed
id: EUPH:435

Axiom
annotated source: speed
annotated property: IAO_0000115
annotated target: The physical quantity speed
source: https://www.bipm.org/en/publications/si-brochure

acceleration
type: Class
subclass of: physical quantity
IAO_0000115: The physical quantity acceleration.
IAO_0000117: Michael Rubinigg
IAO_0000118: Beschleunigung @de
IAO_0000118: acceleration
id: EUPH:436

Axiom
annotated source: acceleration
annotated property: IAO_0000115
annotated target: The physical quantity acceleration.
source: https://www.bipm.org/en/publications/si-brochure

time
type: Class
subclass of: physical quantity
subclass of: Restriction
  on property: member of
  some values from: ISO 8601 basic concepts
IAO_0000115: The physical quantity time, attributed to an instant or a time interval on a specified time scale.
IAO_0000117: Michael Rubinigg
IAO_0000118: Zeit @de
IAO_0000118: time
IAO_0000118: čas @sl
id: EUPH:437

Axiom
annotated source: time
annotated property: IAO_0000115
annotated target: The physical quantity time, attributed to an instant or a time interval on a specified time scale.
source: https://www.bipm.org/en/publications/si-brochure
source: https://www.iso.org/standard/70907.html

mass
type: Class
subclass of: physical quantity
IAO_0000115: The physical quantity mass
IAO_0000117: Michael Rubinigg
IAO_0000118: Masse @de
IAO_0000118: masa @sl
IAO_0000118: mass
id: EUPH:438

Axiom
annotated source: mass
annotated property: IAO_0000115
annotated target: The physical quantity mass
source: https://www.bipm.org/en/publications/si-brochure

mass of nutrients
type: Class
subclass of: mass
IAO_0000115: The physical quantity mass of nutrients
IAO_0000117: Michael Rubinigg
IAO_0000118: Masse von Nährstoffen @de
IAO_0000118: masa hranil @sl
IAO_0000118: mass of nutrients
id: EUPH:439

laying worker
type: Class
subclass of: intrinsic role in beekeeping
subclass of: Restriction
  on property: role of
  some values from: adult worker bee
IAO_0000115: A laying worker is a worker bee which lays unfertilised eggs, usually in a queenless colony.
IAO_0000117: Michael Rubinigg
IAO_0000118: Afterkönigin @de
IAO_0000118: Aftermütterchen @de
IAO_0000118: Afterweisel @de
IAO_0000118: Drohnenmütterchen @de
IAO_0000118: ape fucaiola @it
IAO_0000118: eggleggende arbeider @no
IAO_0000118: eierlegende Arbeiterin @de
IAO_0000118: eierleggende werkbij @nl
IAO_0000118: eierleggende werkster @nl
IAO_0000118: laying worker
IAO_0000118: lucrătoare ouătoare @ro
IAO_0000118: malle moer @nl
IAO_0000118: obreira poedeira @pt
IAO_0000118: obrera ponedora @es
IAO_0000118: operaia figliatrice @it
IAO_0000118: operaia ovificatrice @it
IAO_0000118: operária poedeira @pt
IAO_0000118: ouvrière pondeuse @fr
IAO_0000118: äggläggande arbetsbi @sv
IAO_0000118: æglæggende arbejder @da
id: EUPH:44

mass of methane
type: Class
subclass of: mass
IAO_0000115: The physical quantity mass of methane
IAO_0000117: Michael Rubinigg
IAO_0000118: Masse von Methan @de
IAO_0000118: masa metana @sl
IAO_0000118: mass of methane
id: EUPH:440

mass of nitrous oxide
type: Class
subclass of: mass
IAO_0000115: The physical quantity mass of nitrous oxide
IAO_0000117: Michael Rubinigg
IAO_0000118: Masse von Distickstoffmonoxid @de
IAO_0000118: masa dušikovega oksida @sl
IAO_0000118: mass of nitrous oxide
id: EUPH:441

mass of nitrous-oxide nitrogen
type: Class
subclass of: mass
IAO_0000115: The physical quantity mass of nitrous-oxide nitrogen
IAO_0000117: Michael Rubinigg
IAO_0000118: Masse von Distickstoffmonoxid @de
IAO_0000118: mass of nitrous-oxide nitrogen
id: EUPH:442

mass of carbon dioxide equivalent
type: Class
subclass of: mass
IAO_0000115: The physical quantity mass of carbon dioxide equivalent
IAO_0000117: Michael Rubinigg
IAO_0000118: Masse an Kohlendioxidäquivalent @de
IAO_0000118: mass of carbon dioxide equivalent
id: EUPH:443

plane and phase angle
type: Class
subclass of: physical quantity
IAO_0000115: The physical quantity plane and phase angle
IAO_0000117: Michael Rubinigg
IAO_0000118: plane and phase angle
id: EUPH:444

Axiom
annotated source: plane and phase angle
annotated property: IAO_0000115
annotated target: The physical quantity plane and phase angle
source: https://www.bipm.org/en/publications/si-brochure

plane angle
type: Class
subclass of: physical quantity
IAO_0000115: The physical quantity plane angle
IAO_0000117: Michael Rubinigg
IAO_0000118: plane angle
id: EUPH:445

Axiom
annotated source: plane angle
annotated property: IAO_0000115
annotated target: The physical quantity plane angle
source: https://www.bipm.org/en/publications/si-brochure

solid angle
type: Class
subclass of: physical quantity
IAO_0000115: The physical quantity solid angle
IAO_0000117: Michael Rubinigg
IAO_0000118: Raumwinkel @de
IAO_0000118: solid angle
id: EUPH:446

Axiom
annotated source: solid angle
annotated property: IAO_0000115
annotated target: The physical quantity solid angle
source: https://www.bipm.org/en/publications/si-brochure

electric current
type: Class
subclass of: physical quantity
IAO_0000115: The physical quantity electric current
IAO_0000117: Michael Rubinigg
IAO_0000118: electric current
id: EUPH:447

Axiom
annotated source: electric current
annotated property: IAO_0000115
annotated target: The physical quantity electric current
source: https://www.bipm.org/en/publications/si-brochure

settling of swarms
type: Class
subclass of: clustering behavior
IAO_0000115: Settling of a swarm is a clustering behavior exhibited by a honey bee swarm when it temporarily gathers on a branch or some other object, or permanently colonises a new nesting cavity.
IAO_0000117: Michael Rubinigg
IAO_0000118: a se aduna @ro
IAO_0000118: a se instala @ro
IAO_0000118: agglomerarsi @it
IAO_0000118: agrupar-se @pt
IAO_0000118: agruparse @es
IAO_0000118: amontonarse @es
IAO_0000118: arracimarse @es
IAO_0000118: at samle sig @da
IAO_0000118: at sætte sig @da
IAO_0000118: att klasa sig @sv
IAO_0000118: att klunga sig @sv
IAO_0000118: formar cacho @pt
IAO_0000118: formare il grappolo @it
IAO_0000118: gaan hangen @nl
IAO_0000118: s'amasser @fr
IAO_0000118: se grouper @fr
IAO_0000118: settling of swarms
IAO_0000118: sich niederlassen @de
IAO_0000118: sich sammeln @de
IAO_0000118: to cluster
IAO_0000118: to settle
IAO_0000118: zich zetten @nl
IAO_0000118: å klase seg @no
IAO_0000118: å sette seg @no
id: EUPH:4473

electric potential difference
type: Class
subclass of: physical quantity
IAO_0000115: The physical quantity electric potential difference
IAO_0000117: Michael Rubinigg
IAO_0000118: electric potential difference
id: EUPH:448

Axiom
annotated source: electric potential difference
annotated property: IAO_0000115
annotated target: The physical quantity electric potential difference
source: https://www.bipm.org/en/publications/si-brochure

capacitance
type: Class
subclass of: physical quantity
IAO_0000115: The physical quantity capacitance
IAO_0000117: Michael Rubinigg
IAO_0000118: Elektrische Kapazität @de
IAO_0000118: capacitance
id: EUPH:449

Axiom
annotated source: capacitance
annotated property: IAO_0000115
annotated target: The physical quantity capacitance
source: https://www.bipm.org/en/publications/si-brochure

drone laying colony
type: Class
subclass of: honey bee colony
IAO_0000115: A drone laying colony is a colony in which the queen lays only unfertilized eggs developing into drones.
IAO_0000117: Michael Rubinigg
IAO_0000118: colonia fucaiola @it
IAO_0000118: colonie bourdonneuse @fr
IAO_0000118: darrenbroedig volk @nl
IAO_0000118: drohnenbrütiges Volk @de
IAO_0000118: drone laying colony
id: EUPH:45

electric resistance
type: Class
subclass of: physical quantity
IAO_0000115: The physical quantity electric resistance
IAO_0000117: Michael Rubinigg
IAO_0000118: electric resistance
IAO_0000118: elektrischer Widerstand @de
id: EUPH:450

Axiom
annotated source: electric resistance
annotated property: IAO_0000115
annotated target: The physical quantity electric resistance
source: https://www.bipm.org/en/publications/si-brochure

electric conductance
type: Class
subclass of: physical quantity
IAO_0000115: The physical quantity electric conductance
IAO_0000117: Michael Rubinigg
IAO_0000118: electric conductance
IAO_0000118: elektrische Leitfähigkeit @de
id: EUPH:451

Axiom
annotated source: electric conductance
annotated property: IAO_0000115
annotated target: The physical quantity electric conductance
source: https://www.bipm.org/en/publications/si-brochure

amount of substance
type: Class
subclass of: physical quantity
IAO_0000115: The physical quantity amount of substance
IAO_0000117: Michael Rubinigg
IAO_0000118: Stoffmenge @de
IAO_0000118: amount of substance
id: EUPH:452

Axiom
annotated source: amount of substance
annotated property: IAO_0000115
annotated target: The physical quantity amount of substance
source: https://www.bipm.org/en/publications/si-brochure

amount of substance concentration
type: Class
subclass of: physical quantity
IAO_0000115: The physical quantity amount of substance concentration, typical symbol c, expressed in the derived unit mol/m3.
IAO_0000117: Michael Rubinigg
IAO_0000118: Stoffmengenkonzentration @de
IAO_0000118: amount of substance concentration
id: EUPH:453

Axiom
annotated source: amount of substance concentration
annotated property: IAO_0000115
annotated target: The physical quantity amount of substance concentration, typical symbol c, expressed in the derived unit mol/m3.
source: https://www.bipm.org/en/publications/si-brochure

thermodynamic temperature
type: Class
subclass of: temperature
IAO_0000115: The physical quantity thermodynamic temperature
IAO_0000117: Michael Rubinigg
IAO_0000118: Thermodynamische Temperatur @de
IAO_0000118: thermodynamic temperature
id: EUPH:454

Axiom
annotated source: thermodynamic temperature
annotated property: IAO_0000115
annotated target: The physical quantity thermodynamic temperature
source: https://www.bipm.org/en/publications/si-brochure

force
type: Class
subclass of: physical quantity
IAO_0000115: The physical quantity force
IAO_0000117: Michael Rubinigg
IAO_0000118: Kraft @de
IAO_0000118: force
id: EUPH:456

Axiom
annotated source: force
annotated property: IAO_0000115
annotated target: The physical quantity force
source: https://www.bipm.org/en/publications/si-brochure

pressure
type: Class
subclass of: physical quantity
IAO_0000115: The physical quantity pressure
IAO_0000117: Michael Rubinigg
IAO_0000118: Druck @de
IAO_0000118: pressure
id: EUPH:457

Axiom
annotated source: pressure
annotated property: IAO_0000115
annotated target: The physical quantity pressure
source: https://www.bipm.org/en/publications/si-brochure

illuminance
type: Class
subclass of: physical quantity
IAO_0000115: The physical quantity illuminance
IAO_0000117: Michael Rubinigg
IAO_0000118: Beleuchtungsstärke @de
IAO_0000118: illuminance
id: EUPH:458

Axiom
annotated source: illuminance
annotated property: IAO_0000115
annotated target: The physical quantity illuminance
source: https://www.bipm.org/en/publications/si-brochure

activity referred to a radionuclide
type: Class
subclass of: physical quantity
IAO_0000115: The physical quantity activity, referred to a radionuclide.
IAO_0000117: Michael Rubinigg
IAO_0000118: Aktivität bezogen auf ein Radionuklid @de
IAO_0000118: activity referred to a radionuclide
id: EUPH:459

Axiom
annotated source: activity referred to a radionuclide
annotated property: IAO_0000115
annotated target: The physical quantity activity, referred to a radionuclide.
source: https://www.bipm.org/en/publications/si-brochure

laying worker colony
type: Class
subclass of: honey bee colony
IAO_0000115: A laying worker colony is a queenless colony in which worker bees lay unfertilised eggs.
IAO_0000117: Michael Rubinigg
IAO_0000118: buckelbrütiges Volk @de
IAO_0000118: bulkbroedig volk @nl
IAO_0000118: colonia fucaiola @it
IAO_0000118: colonia zanganera @es
IAO_0000118: colonie à ouvrières pondeuses @fr
IAO_0000118: laying worker colony
id: EUPH:46

dose equivalent
type: Class
subclass of: physical quantity
IAO_0000115: The physical quantity dose equivalent
IAO_0000117: Michael Rubinigg
IAO_0000118: dose equivalent
IAO_0000118: Äquivalentdosis @de
id: EUPH:460

Axiom
annotated source: dose equivalent
annotated property: IAO_0000115
annotated target: The physical quantity dose equivalent
source: https://www.bipm.org/en/publications/si-brochure

density
type: Class
subclass of: physical quantity
IAO_0000115: Density [...] is the ratio of a substance's mass to its volume. The symbol most often used for density is ρ (the lower case Greek letter rho), although the Latin letter D (or d) can also be used.
IAO_0000117: Michael Rubinigg
IAO_0000118: Dichte @de
IAO_0000118: densidad @es
IAO_0000118: densidade @pt
IAO_0000118: densitate @ro
IAO_0000118: density
IAO_0000118: densità @it
IAO_0000118: densité @fr
IAO_0000118: dichtheid @nl
IAO_0000118: specific mass
IAO_0000118: tetthet @no
IAO_0000118: täthet @sv
IAO_0000118: tæthed @da
IAO_0000118: volumetric mass density
id: EUPH:462

Axiom
annotated source: density
annotated property: IAO_0000115
annotated target: Density [...] is the ratio of a substance's mass to its volume. The symbol most often used for density is ρ (the lower case Greek letter rho), although the Latin letter D (or d) can also be used.
source: https://en.wikipedia.org/w/index.php
source: https://www.bipm.org/en/publications/si-brochure

specific volume
type: Class
subclass of: physical quantity
IAO_0000115: The physical quantity specific volume
IAO_0000117: Michael Rubinigg
IAO_0000118: Spezifisches Volumen @de
IAO_0000118: specific volume
id: EUPH:463

Axiom
annotated source: specific volume
annotated property: IAO_0000115
annotated target: The physical quantity specific volume
source: https://www.bipm.org/en/publications/si-brochure

luminous intensity
type: Class
subclass of: physical quantity
IAO_0000115: The physical quantity luminous intensity
IAO_0000117: Michael Rubinigg
IAO_0000118: Lichtstärke @de
IAO_0000118: luminous intensity
id: EUPH:464

Axiom
annotated source: luminous intensity
annotated property: IAO_0000115
annotated target: The physical quantity luminous intensity
source: https://www.bipm.org/en/publications/si-brochure

irradiance
type: Class
subclass of: physical quantity
IAO_0000115: The physical quantity irradiance
IAO_0000117: Michael Rubinigg
IAO_0000118: Bestrahlungsstärke @de
IAO_0000118: irradiance
id: EUPH:465

Axiom
annotated source: irradiance
annotated property: IAO_0000115
annotated target: The physical quantity irradiance
source: https://www.bipm.org/en/publications/si-brochure

luminance
type: Class
subclass of: physical quantity
IAO_0000115: The physical quantity luminance
IAO_0000117: Michael Rubinigg
IAO_0000118: Leuchtdichte @de
IAO_0000118: luminance
id: EUPH:466

Axiom
annotated source: luminance
annotated property: IAO_0000115
annotated target: The physical quantity luminance
source: https://www.bipm.org/en/publications/si-brochure

electric charge
type: Class
subclass of: physical quantity
IAO_0000115: The physical quantity electric charge
IAO_0000117: Michael Rubinigg
IAO_0000118: Elektrische Ladung @de
IAO_0000118: electric charge
id: EUPH:467

Axiom
annotated source: electric charge
annotated property: IAO_0000115
annotated target: The physical quantity electric charge
source: https://www.bipm.org/en/publications/si-brochure

magnetic flux
type: Class
subclass of: physical quantity
IAO_0000115: The physical quantity magnetic flux
IAO_0000117: Michael Rubinigg
IAO_0000118: Magnetischer Fluss @de
IAO_0000118: magnetic flux
id: EUPH:468

Axiom
annotated source: magnetic flux
annotated property: IAO_0000115
annotated target: The physical quantity magnetic flux
source: https://www.bipm.org/en/publications/si-brochure

magnetic flux density
type: Class
subclass of: physical quantity
IAO_0000115: The physical quantity magnetic flux density
IAO_0000117: Michael Rubinigg
IAO_0000118: magnetic flux density
id: EUPH:469

Axiom
annotated source: magnetic flux density
annotated property: IAO_0000115
annotated target: The physical quantity magnetic flux density
source: https://www.bipm.org/en/publications/si-brochure

inductance
type: Class
subclass of: physical quantity
IAO_0000115: The physical quantity inductance
IAO_0000117: Michael Rubinigg
IAO_0000118: Induktivität @de
IAO_0000118: inductance
id: EUPH:470

Axiom
annotated source: inductance
annotated property: IAO_0000115
annotated target: The physical quantity inductance
source: https://www.bipm.org/en/publications/si-brochure

luminous flux
type: Class
subclass of: physical quantity
IAO_0000115: The physical quantity luminous flux
IAO_0000117: Michael Rubinigg
IAO_0000118: Lichtstrom @de
IAO_0000118: luminous flux
id: EUPH:471

Axiom
annotated source: luminous flux
annotated property: IAO_0000115
annotated target: The physical quantity luminous flux
source: https://www.bipm.org/en/publications/si-brochure

absorbed dose
type: Class
subclass of: physical quantity
IAO_0000115: The physical quantity absorbed dose
IAO_0000117: Michael Rubinigg
IAO_0000118: Energiedosis @de
IAO_0000118: absorbed dose
id: EUPH:472

Axiom
annotated source: absorbed dose
annotated property: IAO_0000115
annotated target: The physical quantity absorbed dose
source: https://www.bipm.org/en/publications/si-brochure

wavenumber
type: Class
subclass of: physical quantity
IAO_0000115: The physical quantity wavenumber
IAO_0000117: Michael Rubinigg
IAO_0000118: Wellenzahl @de
IAO_0000118: wavenumber
id: EUPH:473

Axiom
annotated source: wavenumber
annotated property: IAO_0000115
annotated target: The physical quantity wavenumber
source: https://www.bipm.org/en/publications/si-brochure

surface density
type: Class
subclass of: physical quantity
IAO_0000115: The physical quantity surface density
IAO_0000117: Michael Rubinigg
IAO_0000118: Massenbelegung @de
IAO_0000118: surface density
id: EUPH:474

Axiom
annotated source: surface density
annotated property: IAO_0000115
annotated target: The physical quantity surface density
source: https://www.bipm.org/en/publications/si-brochure

current density
type: Class
subclass of: physical quantity
IAO_0000115: The physical quantity current density
IAO_0000117: Michael Rubinigg
IAO_0000118: Elektrische Stromdichte @de
IAO_0000118: current density
id: EUPH:475

Axiom
annotated source: current density
annotated property: IAO_0000115
annotated target: The physical quantity current density
source: https://www.bipm.org/en/publications/si-brochure

magnetic field strength
type: Class
subclass of: physical quantity
IAO_0000115: The physical quantity magnetic field strength
IAO_0000117: Michael Rubinigg
IAO_0000118: magnetic field strength
id: EUPH:476

Axiom
annotated source: magnetic field strength
annotated property: IAO_0000115
annotated target: The physical quantity magnetic field strength
source: https://www.bipm.org/en/publications/si-brochure

dynamic viscosity
type: Class
subclass of: physical quantity
IAO_0000115: The physical quantity dynamic viscosity
IAO_0000117: Michael Rubinigg
IAO_0000118: dynamic viscosity
id: EUPH:477

Axiom
annotated source: dynamic viscosity
annotated property: IAO_0000115
annotated target: The physical quantity dynamic viscosity
source: https://www.bipm.org/en/publications/si-brochure

moment of force
type: Class
subclass of: physical quantity
IAO_0000115: The physical quantity moment of force
IAO_0000117: Michael Rubinigg
IAO_0000118: moment of force
id: EUPH:478

Axiom
annotated source: moment of force
annotated property: IAO_0000115
annotated target: The physical quantity moment of force
source: https://www.bipm.org/en/publications/si-brochure

surface tension
type: Class
subclass of: physical quantity
IAO_0000115: The physical quantity surface tension
IAO_0000117: Michael Rubinigg
IAO_0000118: Oberflächenspannung @de
IAO_0000118: surface tension
id: EUPH:479

Axiom
annotated source: surface tension
annotated property: IAO_0000115
annotated target: The physical quantity surface tension
source: https://www.bipm.org/en/publications/si-brochure

escape board
type: Class
subclass of: https://w3id.org/euph/8163
subclass of: Restriction
  on property: involved in
  some values from: honey harvesting
subclass of: Restriction
  on property: part of
  some values from: https://w3id.org/euph/8
IAO_0000115: An escape board is a board with a maze placed between the upper deep box and the honey super. It serves to clear overlaying honey supers from bees.
IAO_0000117: Michael Rubinigg
IAO_0000118: Bienenflucht @de
IAO_0000118: Bienenfluchtbrett @de
IAO_0000118: apiscampo @it
IAO_0000118: bee escape
IAO_0000118: bijenuitlaat @nl
IAO_0000118: bitömmarbotten @sv
IAO_0000118: bitömmare @sv
IAO_0000118: bitømmer @da
IAO_0000118: bitømmerbrett @no
IAO_0000118: bitømmerbræt @da
IAO_0000118: chasse-abeille @fr
IAO_0000118: chasse-abeilles @fr
IAO_0000118: clearer-board
IAO_0000118: escapa-abelhas @pt
IAO_0000118: escape board
IAO_0000118: escape de abejas @es
IAO_0000118: escape de abelhas @pt
IAO_0000118: fugapi @it
IAO_0000118: izgonitor de albine @ro
IAO_0000118: izgonitor de albine podișor @ro
IAO_0000118: plateau chasse-abeille @fr
IAO_0000118: prancheta com escapa-abelhas @pt
IAO_0000118: super-clearer
IAO_0000118: tablero escape @es
IAO_0000118: tampa com escapa-abelhas @pt
IAO_0000118: tavoletta con apiscampo @it
IAO_0000118: tavoletta con fugàpi @it
IAO_0000118: uitlaatbord @nl
id: EUPH:48

angular velocity
type: Class
subclass of: physical quantity
IAO_0000115: The physical quantity angular velocity
IAO_0000117: Michael Rubinigg
IAO_0000118: Winkelgeschwindigkeit @de
IAO_0000118: angular velocity
id: EUPH:480

Axiom
annotated source: angular velocity
annotated property: IAO_0000115
annotated target: The physical quantity angular velocity
source: https://www.bipm.org/en/publications/si-brochure

angular acceleration
type: Class
subclass of: physical quantity
IAO_0000115: The physical quantity angular acceleration
IAO_0000117: Michael Rubinigg
IAO_0000118: Winkelbeschleunigung @de
IAO_0000118: angular acceleration
id: EUPH:481

Axiom
annotated source: angular acceleration
annotated property: IAO_0000115
annotated target: The physical quantity angular acceleration
source: https://www.bipm.org/en/publications/si-brochure

herbal extract
type: Class
subclass of: mixture
IAO_0000115: A herbal insecticide is a mixture extracted from plants or plant parts.
IAO_0000117: Michael Rubinigg
IAO_0000118: Pflanzenextrakt @de
IAO_0000118: herbal extract
id: EUPH:4814

heat capacity
type: Class
subclass of: physical quantity
IAO_0000115: The physical quantity heat capacity
IAO_0000117: Michael Rubinigg
IAO_0000118: Wärmekapazität @de
IAO_0000118: heat capacity
id: EUPH:482

Axiom
annotated source: heat capacity
annotated property: IAO_0000115
annotated target: The physical quantity heat capacity
source: https://www.bipm.org/en/publications/si-brochure

specific heat capacity
type: Class
subclass of: physical quantity
IAO_0000115: The physical quantity specific heat capacity
IAO_0000117: Michael Rubinigg
IAO_0000118: Spezifische Wärmekapazität @de
IAO_0000118: specific heat capacity
id: EUPH:483

Axiom
annotated source: specific heat capacity
annotated property: IAO_0000115
annotated target: The physical quantity specific heat capacity
source: https://www.bipm.org/en/publications/si-brochure

specific energy
type: Class
subclass of: physical quantity
IAO_0000115: The physical quantity specific energy
IAO_0000117: Michael Rubinigg
IAO_0000118: specific energy
id: EUPH:484

Axiom
annotated source: specific energy
annotated property: IAO_0000115
annotated target: The physical quantity specific energy
source: https://www.bipm.org/en/publications/si-brochure

thermal conductivity
type: Class
subclass of: physical quantity
IAO_0000115: The physical quantity thermal conductivity
IAO_0000117: Michael Rubinigg
IAO_0000118: Wärmeleitfähigkeit @de
IAO_0000118: thermal conductivity
id: EUPH:485

Axiom
annotated source: thermal conductivity
annotated property: IAO_0000115
annotated target: The physical quantity thermal conductivity
source: https://www.bipm.org/en/publications/si-brochure

energy density
type: Class
subclass of: physical quantity
IAO_0000115: The physical quantity energy density
IAO_0000117: Michael Rubinigg
IAO_0000118: Energiedichte @de
IAO_0000118: energy density
id: EUPH:486

Axiom
annotated source: energy density
annotated property: IAO_0000115
annotated target: The physical quantity energy density
source: https://www.bipm.org/en/publications/si-brochure

electric field strength
type: Class
subclass of: physical quantity
IAO_0000115: The physical quantity electric field strength
IAO_0000117: Michael Rubinigg
IAO_0000118: electric field strength
id: EUPH:487

Axiom
annotated source: electric field strength
annotated property: IAO_0000115
annotated target: The physical quantity electric field strength
source: https://www.bipm.org/en/publications/si-brochure

electric charge density
type: Class
subclass of: physical quantity
IAO_0000115: The physical quantity electric charge density
IAO_0000117: Michael Rubinigg
IAO_0000118: electric charge density
id: EUPH:488

Axiom
annotated source: electric charge density
annotated property: IAO_0000115
annotated target: The physical quantity electric charge density
source: https://www.bipm.org/en/publications/si-brochure

surface charge density
type: Class
subclass of: physical quantity
IAO_0000115: The physical quantity surface charge density
IAO_0000117: Michael Rubinigg
IAO_0000118: surface charge density
id: EUPH:489

Axiom
annotated source: surface charge density
annotated property: IAO_0000115
annotated target: The physical quantity surface charge density
source: https://www.bipm.org/en/publications/si-brochure

absconded swarm
type: Class
subclass of: swarm
IAO_0000115: An absconded swarm is a swarm that a beekeeper has lost after hiving it.
IAO_0000117: Michael Rubinigg
IAO_0000118: Ausreisser @de
IAO_0000118: absconded swarm
IAO_0000118: ausgerissener Schwarm @de
IAO_0000118: ausreissender Schwarm @de
IAO_0000118: enjambre desertor @es
IAO_0000118: enxame desertor @pt
IAO_0000118: essaim déserteur @fr
IAO_0000118: ontsnapte zwerm @nl
IAO_0000118: roi dezertor @ro
IAO_0000118: roi fugar @ro
IAO_0000118: rymsvärm @sv
IAO_0000118: rømmet sværm @da
IAO_0000118: rømt sverm @no
IAO_0000118: sciame disertore @it
id: EUPH:49

electric flux density
type: Class
subclass of: physical quantity
IAO_0000115: The physical quantity electric flux density
IAO_0000117: Michael Rubinigg
IAO_0000118: electric flux density
id: EUPH:490

Axiom
annotated source: electric flux density
annotated property: IAO_0000115
annotated target: The physical quantity electric flux density
source: https://www.bipm.org/en/publications/si-brochure

permittivity
type: Class
subclass of: physical quantity
IAO_0000115: The physical quantity permittivity
IAO_0000117: Michael Rubinigg
IAO_0000118: Permittivität @de
IAO_0000118: permittivity
id: EUPH:491

Axiom
annotated source: permittivity
annotated property: IAO_0000115
annotated target: The physical quantity permittivity
source: https://www.bipm.org/en/publications/si-brochure

permeability
type: Class
subclass of: physical quantity
IAO_0000115: The physical quantity permeability
IAO_0000117: Michael Rubinigg
IAO_0000118: Permeabilität @de
IAO_0000118: permeability
id: EUPH:492

Axiom
annotated source: permeability
annotated property: IAO_0000115
annotated target: The physical quantity permeability
source: https://www.bipm.org/en/publications/si-brochure

molar energy
type: Class
subclass of: physical quantity
IAO_0000115: The physical quantity molar energy
IAO_0000117: Michael Rubinigg
IAO_0000118: molar energy
id: EUPH:493

Axiom
annotated source: molar energy
annotated property: IAO_0000115
annotated target: The physical quantity molar energy
source: https://www.bipm.org/en/publications/si-brochure

molar entropy
type: Class
subclass of: physical quantity
IAO_0000115: The physical quantity molar entropy
IAO_0000117: Michael Rubinigg
IAO_0000118: molar entropy
id: EUPH:494

Axiom
annotated source: molar entropy
annotated property: IAO_0000115
annotated target: The physical quantity molar entropy
source: https://www.bipm.org/en/publications/si-brochure

exposure (x- and gamma-rays)
type: Class
subclass of: physical quantity
IAO_0000115: The physical quantity exposure (x- and γ-rays)
IAO_0000117: Michael Rubinigg
IAO_0000118: x- and gamma-rays exposure
id: EUPH:495

Axiom
annotated source: exposure (x- and gamma-rays)
annotated property: IAO_0000115
annotated target: The physical quantity exposure (x- and γ-rays)
source: https://www.bipm.org/en/publications/si-brochure

absorbed dose rate
type: Class
subclass of: physical quantity
IAO_0000115: The physical quantity absorbed dose rate
IAO_0000117: Michael Rubinigg
IAO_0000118: Energiedosisleistung @de
IAO_0000118: absorbed dose rate
id: EUPH:496

Axiom
annotated source: absorbed dose rate
annotated property: IAO_0000115
annotated target: The physical quantity absorbed dose rate
source: https://www.bipm.org/en/publications/si-brochure

radiant intensity
type: Class
subclass of: physical quantity
IAO_0000115: The physical quantity radiant intensity
IAO_0000117: Michael Rubinigg
IAO_0000118: Strahlungsstärke @de
IAO_0000118: radiant intensity
id: EUPH:497

Axiom
annotated source: radiant intensity
annotated property: IAO_0000115
annotated target: The physical quantity radiant intensity
source: https://www.bipm.org/en/publications/si-brochure

radiance
type: Class
subclass of: physical quantity
IAO_0000115: The physical quantity radiance
IAO_0000117: Michael Rubinigg
IAO_0000118: Strahldichte @de
IAO_0000118: radiance
id: EUPH:498

Axiom
annotated source: radiance
annotated property: IAO_0000115
annotated target: The physical quantity radiance
source: https://www.bipm.org/en/publications/si-brochure

catalytic activity concentration
type: Class
subclass of: physical quantity
IAO_0000115: The physical quantity catalytic activity concentration
IAO_0000117: Michael Rubinigg
IAO_0000118: catalytic activity concentration
id: EUPH:499

Axiom
annotated source: catalytic activity concentration
annotated property: IAO_0000115
annotated target: The physical quantity catalytic activity concentration
source: https://www.bipm.org/en/publications/si-brochure

honey bee forage
type: Class
subclass of: object in beekeeping
IAO_0000115: Honey bee forage is any food collected by honey bees, including nectar and other secretions from living parts of plants, honeydew, pollen.
IAO_0000117: Michael Rubinigg
IAO_0000118: Bienenweide @de
IAO_0000118: bază meliferă @ro
IAO_0000118: bee forage
IAO_0000118: bee pasture
IAO_0000118: bibeite @no
IAO_0000118: bifoder @sv
IAO_0000118: bijenweide @nl
IAO_0000118: biväxter @sv
IAO_0000118: cules @ro
IAO_0000118: flora apistica @it
IAO_0000118: flora apícola @es
IAO_0000118: flora apífila @pt
IAO_0000118: flora melífera @pt
IAO_0000118: floră apicolă @ro
IAO_0000118: pasto das abelhas @pt
IAO_0000118: source de miellée @fr
IAO_0000118: sursă de cules @ro
IAO_0000118: trækkilde @da
id: EUPH:50

logarithmic ratio quantities
type: Class
subclass of: physical quantity
IAO_0000115: The physical quantity logarithmic ratio quantities
IAO_0000117: Michael Rubinigg
IAO_0000118: logarithmic ratio quantities
IAO_0000118: logarithmische Verhältnisgrößen @de
id: EUPH:500

Axiom
annotated source: logarithmic ratio quantities
annotated property: IAO_0000115
annotated target: The physical quantity logarithmic ratio quantities
source: https://www.bipm.org/en/publications/si-brochure

not availabe
type: Class
subclass of: https://w3id.org/euph/911
IAO_0000115: Not available is an expression that is used to code missing values in a dataset.
IAO_0000117: Michael Rubinigg
IAO_0000118: N/A
IAO_0000118: N/V @de
IAO_0000118: n.a.
IAO_0000118: n.v. @de
IAO_0000118: n/a
IAO_0000118: n/v @de
IAO_0000118: nicht verfügbar @de
IAO_0000118: not available
id: EUPH:501

percent of total livestock units
type: Class
subclass of: percent
IAO_0000115: A unit adopeted by FAOSTAT, referred to as percent of total livestock units.
IAO_0000117: Michael Rubinigg
IAO_0000118: Prozent der gesamten Nutztiereinheiten @de
IAO_0000118: percent of total livestock units
id: EUPH:503

Axiom
annotated source: percent of total livestock units
annotated property: IAO_0000115
annotated target: A unit adopeted by FAOSTAT, referred to as percent of total livestock units.
source: https://www.fao.org/faostat/en/#definitions

trillion Euros
type: Class
subclass of: multiple of Euro
IAO_0000115: The currency Euro (ISO 4217:2015 Alphabetic Code EUR) expressed in trillion EUR.
IAO_0000117: Michael Rubinigg
IAO_0000118: Billionen Euro @de
IAO_0000118: bilijon Evrov @sl
IAO_0000118: trillion Euros
id: EUPH:504

billion Euros
type: Class
subclass of: multiple of Euro
IAO_0000115: The currency Euro (ISO 4217:2015 Alphabetic Code EUR) expresssed in billion EUR.
IAO_0000117: Michael Rubinigg
IAO_0000118: Milliarden Euro @de
IAO_0000118: billion Euros
IAO_0000118: milijarda Evrov @sl
id: EUPH:505

million Euros
type: Class
subclass of: multiple of Euro
IAO_0000115: The currency Euro (ISO 4217:2015 Alphabetic Code EUR), expresed in million EUR.
IAO_0000117: Michael Rubinigg
IAO_0000118: Millionen Euro @de
IAO_0000118: milijon Evrov @sl
IAO_0000118: million Euros
id: EUPH:506

thousand Euros
type: Class
subclass of: multiple of Euro
IAO_0000115: The currency Euro (ISO 4217:2015 Alphabetic Code EUR),expressed in thousand EUR,
IAO_0000117: Michael Rubinigg
IAO_0000118: Tausend Euro @de
IAO_0000118: thousand Euros
IAO_0000118: tisoč Evrov @sl
id: EUPH:507

Euro per kilogram
type: Class
subclass of: https://w3id.org/euph/985
subclass of: Restriction
  on property: depends on
  some values from: kilogram
IAO_0000115: The monetary unit Euro per kilogramm expressed in the currency Euro (ISO 4217:2015 Alphabetic Code EUR).
IAO_0000117: Michael Rubinigg
IAO_0000118: Euro per kilogram
IAO_0000118: Euro pro Kilogramm @de
id: EUPH:509

honey bee forage plant
type: Class
subclass of: extrinsic role in beekeeping
subclass of: Restriction
  on property: provides nutrients for
  some values from: https://www.gbif.org/species/1341976
subclass of: Restriction
  on property: produces
  some values from: pollen grain
subclass of: Restriction
  on property: produces
  some values from: nectar
IAO_0000115: A honey bee forage plant is a plant on which honey bees obtain forage.
IAO_0000117: Michael Rubinigg
IAO_0000118: Trachtpflanze @de
IAO_0000118: drachtplant @de
IAO_0000118: honey bee forage plant
IAO_0000118: pianta apicola @it
IAO_0000118: plante apicole @fr
id: EUPH:51

trillion United States Dollars
type: Class
subclass of: https://w3id.org/euph/966
IAO_0000115: The currency US Dollar (ISO 4217:2015 Alphabetic Code USD), expressed in trillion USD.
IAO_0000117: Michael Rubinigg
IAO_0000118: Billionen US Dollar @de
IAO_0000118: trillion United States Dollars
id: EUPH:510

billion United States Dollars
type: Class
subclass of: https://w3id.org/euph/966
IAO_0000115: The currency US Dollar (ISO 4217:2015 Alphabetic Code USD), expressed in billion USD.
IAO_0000117: Michael Rubinigg
IAO_0000118: Milliarden US Dollar @de
IAO_0000118: billion United States Dollars
id: EUPH:511

million United States Dollars
type: Class
subclass of: https://w3id.org/euph/966
IAO_0000115: The currency US Dollar (ISO 4217:2015 Alphabetic Code USD), expressed in million USD.
IAO_0000117: Michael Rubinigg
IAO_0000118: Millionen US-Dollar @de
IAO_0000118: million United States Dollars
id: EUPH:512

thousand United States Dollars
type: Class
subclass of: https://w3id.org/euph/966
IAO_0000115: The currency US Dollar (ISO 4217:2015 Alphabetic Code USD), expressed in thousand USD.
IAO_0000117: Michael Rubinigg
IAO_0000118: Tausend US-Dollar @de
IAO_0000118: thousand United States Dollars
id: EUPH:513

United States Dollar per cubic metre
type: Class
subclass of: https://w3id.org/euph/985
subclass of: Restriction
  on property: depends on
  some values from: cubic metre
IAO_0000115: The monetary unit United States Dollar per cubic metre, expresssed in the currency US Dollar (ISO 4217:2015 Alphabetic Code USD).
IAO_0000117: Michael Rubinigg
IAO_0000118: US-Dollar pro Kubikmeter @de
IAO_0000118: United States Dollar per cubic metre
id: EUPH:515

local currency unit per thousand kilocalories
type: Class
subclass of: https://w3id.org/euph/985
subclass of: Restriction
  on property: depends on
  some values from: kilocalories
IAO_0000115: A monetary unit adopetd by FAOSTAT to refer to any local currency unit (LCU per thousand kilocaloriest.
IAO_0000117: Michael Rubinigg
IAO_0000118: local currency unit per thousand kilocalories
IAO_0000118: lokale Währungseinheit pro tausend Kilokalorien @de
id: EUPH:517

Axiom
annotated source: local currency unit per thousand kilocalories
annotated property: IAO_0000115
annotated target: A monetary unit adopetd by FAOSTAT to refer to any local currency unit (LCU per thousand kilocaloriest.
source: https://www.fao.org/faostat/en/#definitions

local currency unit per Joule
type: Class
subclass of: https://w3id.org/euph/985
subclass of: Restriction
  on property: depends on
  some values from: joule
IAO_0000115: A monetary unit adopetd by FAOSTAT to refer to any local currency unit (LCU) per Joule.
IAO_0000117: Michael Rubinigg
IAO_0000118: local currency unit per Joule @de
id: EUPH:518

Axiom
annotated source: local currency unit per Joule
annotated property: IAO_0000115
annotated target: A monetary unit adopetd by FAOSTAT to refer to any local currency unit (LCU) per Joule.
source: https://www.fao.org/faostat/en/#definitions

local currency unit per tonne
type: Class
subclass of: https://w3id.org/euph/985
subclass of: Restriction
  on property: depends on
  some values from: tonne
IAO_0000115: A monetary unit adopetd by FAOSTAT to refer to any local currency unit (LCU) per tonne.
IAO_0000117: Michael Rubinigg
IAO_0000118: local currency unit per tonne
IAO_0000118: lokale Währungseinheit pro Tonne @de
id: EUPH:519

Axiom
annotated source: local currency unit per tonne
annotated property: IAO_0000115
annotated target: A monetary unit adopetd by FAOSTAT to refer to any local currency unit (LCU) per tonne.
source: https://www.fao.org/faostat/en/#definitions

fruit tree
type: Class
subclass of: object aggregate in plant production
IAO_0000115: A fruit tree is a tree which bears fruit that is consumed or used by animals and humans.
IAO_0000117: Michael Rubinigg
IAO_0000118: Obstbaum @de
IAO_0000118: albero da frutto @it
IAO_0000118: arbre fruitier @fr
IAO_0000118: fruit tree
IAO_0000118: fruitboom @nl
id: EUPH:52

Axiom
annotated source: fruit tree
annotated property: IAO_0000115
annotated target: A fruit tree is a tree which bears fruit that is consumed or used by animals and humans.
source: https://en.wikipedia.org/w/index.php

local currency unit per kilogram
type: Class
subclass of: https://w3id.org/euph/985
subclass of: Restriction
  on property: depends on
  some values from: kilogram
IAO_0000115: A monetary unit adopetd by FAOSTAT to refer to any local currency unit (LCU) per kilogram.
IAO_0000117: Michael Rubinigg
IAO_0000118: local currency unit per kilogram
IAO_0000118: lokale Währungseinheit pro Kilogramm @de
id: EUPH:520

Axiom
annotated source: local currency unit per kilogram
annotated property: IAO_0000115
annotated target: A monetary unit adopetd by FAOSTAT to refer to any local currency unit (LCU) per kilogram.
source: https://www.fao.org/faostat/en/#definitions

local currency unit per person per day
type: Class
subclass of: https://w3id.org/euph/985
subclass of: Restriction
  on property: depends on
  some values from: day
subclass of: Restriction
  on property: depends on
  some values from: number of persons
IAO_0000115: A monetary unit adopetd by FAOSTAT to refer to any local currency unit (LCU) per person per day.
IAO_0000117: Michael Rubinigg
IAO_0000118: local currency unit per person per day
IAO_0000118: lokale Währungseinheit pro Person und Tag @de
id: EUPH:521

Axiom
annotated source: local currency unit per person per day
annotated property: IAO_0000115
annotated target: A monetary unit adopetd by FAOSTAT to refer to any local currency unit (LCU) per person per day.
source: https://www.fao.org/faostat/en/#definitions

thousand International Dollars
type: Class
subclass of: multiple of International Dollar
IAO_0000115: A standardised monetary unit adopetd by FAOSTAT, referred to as thousand International Dollars
IAO_0000117: Michael Rubinigg
IAO_0000118: Tausend Internationale Dollar @de
IAO_0000118: thousand International Dollars
id: EUPH:523

Axiom
annotated source: thousand International Dollars
annotated property: IAO_0000115
annotated target: A standardised monetary unit adopetd by FAOSTAT, referred to as thousand International Dollars
source: https://www.fao.org/faostat/en/#definitions

International Dollar per person
type: Class
subclass of: https://w3id.org/euph/985
subclass of: Restriction
  on property: depends on
  some values from: number of persons
IAO_0000115: A standardised monetary unit adopetd by FAOSTAT, referred to as International Dollar per person.
IAO_0000117: Michael Rubinigg
IAO_0000118: International Dollar per person
IAO_0000118: Internationale Dollar pro Person @de
id: EUPH:525

Axiom
annotated source: International Dollar per person
annotated property: IAO_0000115
annotated target: A standardised monetary unit adopetd by FAOSTAT, referred to as International Dollar per person.
source: https://www.fao.org/faostat/en/#definitions

unit per hundred square kilometer land area
type: Class
subclass of: https://w3id.org/euph/926
IAO_0000115: A not specified unit, expressed per hundred square kilometer land area.
IAO_0000117: Michael Rubinigg
IAO_0000118: Einheit pro Hundert Quadratkilometer Landfläche @de
IAO_0000118: unit per hundred square kilometer land area
id: EUPH:526

unit per ha land area
type: Class
subclass of: https://w3id.org/euph/926
IAO_0000115: A not specified unit, expressed hectare land area.
IAO_0000117: Michael Rubinigg
IAO_0000118: Einheit pro Hektar Landfläche @de
IAO_0000118: unit per ha land area
id: EUPH:527

kilometre
type: Class
subclass of: https://w3id.org/euph/965
subclass of: Restriction
  on property: quality of
  some values from: metre
IAO_0000115: The physical quantity length, expressed in kilometre, a decimal multiple of the base unit metre.
IAO_0000117: Michael Rubinigg
IAO_0000118: Kilometer @de
IAO_0000118: kilometer @sl
IAO_0000118: kilometre
id: EUPH:528

Axiom
annotated source: kilometre
annotated property: IAO_0000115
annotated target: The physical quantity length, expressed in kilometre, a decimal multiple of the base unit metre.
source: https://www.bipm.org/en/publications/si-brochure

decimetre
type: Class
subclass of: https://w3id.org/euph/965
subclass of: Restriction
  on property: quality of
  some values from: metre
IAO_0000115: The physical quantity length, expressed in the unit decimetre.
IAO_0000117: Michael Rubinigg
IAO_0000118: Dezimeter @de
IAO_0000118: decimeter @sl
IAO_0000118: decimetre
IAO_0000118: décimètre @fr
id: EUPH:530

Axiom
annotated source: decimetre
annotated property: IAO_0000115
annotated target: The physical quantity length, expressed in the unit decimetre.
source: https://www.bipm.org/en/publications/si-brochure

centimetre
type: Class
subclass of: https://w3id.org/euph/965
subclass of: Restriction
  on property: quality of
  some values from: metre
IAO_0000115: The physical quantity length, expressed in the unit centimetre.
IAO_0000117: Michael Rubinigg
IAO_0000118: Zentimeter @de
IAO_0000118: centimeter @sl
IAO_0000118: centimetre
id: EUPH:531

Axiom
annotated source: centimetre
annotated property: IAO_0000115
annotated target: The physical quantity length, expressed in the unit centimetre.
source: https://www.bipm.org/en/publications/si-brochure

millimetre
type: Class
subclass of: https://w3id.org/euph/965
subclass of: Restriction
  on property: quality of
  some values from: metre
IAO_0000115: The physical quantity length, expressed in the unit millimetre.
IAO_0000117: Michael Rubinigg
IAO_0000118: Millimeter @de
IAO_0000118: milimeter @sl
IAO_0000118: millimetre
IAO_0000118: millimètre @fr
id: EUPH:532

Axiom
annotated source: millimetre
annotated property: IAO_0000115
annotated target: The physical quantity length, expressed in the unit millimetre.
source: https://www.bipm.org/en/publications/si-brochure

micrometre
type: Class
subclass of: https://w3id.org/euph/965
subclass of: Restriction
  on property: quality of
  some values from: metre
IAO_0000115: The physical quantity length, expressed in the unit micrometre.
IAO_0000117: Michael Rubinigg
IAO_0000118: Mikrometer @de
IAO_0000118: micrometre
IAO_0000118: micromètre @fr
IAO_0000118: mikrometer @sl
id: EUPH:533

Axiom
annotated source: micrometre
annotated property: IAO_0000115
annotated target: The physical quantity length, expressed in the unit micrometre.
source: https://www.bipm.org/en/publications/si-brochure

nanometre
type: Class
subclass of: https://w3id.org/euph/965
subclass of: Restriction
  on property: quality of
  some values from: metre
IAO_0000115: The physical quantity length, expressed in the unit nanometre.
IAO_0000117: Michael Rubinigg
IAO_0000118: Namometer @de
IAO_0000118: nanometer @sl
IAO_0000118: nanometre
id: EUPH:534

Axiom
annotated source: nanometre
annotated property: IAO_0000115
annotated target: The physical quantity length, expressed in the unit nanometre.
source: https://www.bipm.org/en/publications/si-brochure

thousand hectares
type: Class
subclass of: https://w3id.org/euph/963
subclass of: Restriction
  on property: quality of
  some values from: hectare
IAO_0000115: The physical quantity area, expressed in the unit thousand hectares
IAO_0000117: Michael Rubinigg
IAO_0000118: Tausend Hektar @de
IAO_0000118: thousand hectares
id: EUPH:535

Axiom
annotated source: thousand hectares
annotated property: IAO_0000115
annotated target: The physical quantity area, expressed in the unit thousand hectares
source: https://www.bipm.org/en/publications/si-brochure

square metre
type: Class
subclass of: https://w3id.org/euph/8127
subclass of: Restriction
  on property: is unit of
  some values from: area
IAO_0000115: The physical quantity area, expressed in the derived unit square metre.
IAO_0000117: Michael Rubinigg
IAO_0000118: Quadratmeter @de
IAO_0000118: square metre
id: EUPH:537

Axiom
annotated source: square metre
annotated property: IAO_0000115
annotated target: The physical quantity area, expressed in the derived unit square metre.
source: https://www.bipm.org/en/publications/si-brochure

square decimetre
type: Class
subclass of: https://w3id.org/euph/968
subclass of: Restriction
  on property: quality of
  some values from: square metre
IAO_0000115: The physical quantity area, expressed in the unit square decimetre.
IAO_0000117: Michael Rubinigg
IAO_0000118: Quadratdezimeter @de
IAO_0000118: kvadratni decimeter @sl
IAO_0000118: square decimetre
id: EUPH:538

Axiom
annotated source: square decimetre
annotated property: IAO_0000115
annotated target: The physical quantity area, expressed in the unit square decimetre.
source: https://www.bipm.org/en/publications/si-brochure

square centimetre
type: Class
subclass of: https://w3id.org/euph/968
subclass of: Restriction
  on property: quality of
  some values from: square metre
IAO_0000115: The physical quantity area, expressed in the unit square centimetre.
IAO_0000117: Michael Rubinigg
IAO_0000118: Quadratzentimeter @de
IAO_0000118: kvadratni centimeter @sl
IAO_0000118: square centimetre
id: EUPH:539

Axiom
annotated source: square centimetre
annotated property: IAO_0000115
annotated target: The physical quantity area, expressed in the unit square centimetre.
source: https://www.bipm.org/en/publications/si-brochure

square millimetre
type: Class
subclass of: https://w3id.org/euph/968
subclass of: Restriction
  on property: quality of
  some values from: square metre
IAO_0000115: The physical quantity area, expressed in the unit square millimetre.
IAO_0000117: Michael Rubinigg
IAO_0000118: Quadratmillimeter @de
IAO_0000118: kvadratni milimeter @sl
IAO_0000118: square millimetre
id: EUPH:540

Axiom
annotated source: square millimetre
annotated property: IAO_0000115
annotated target: The physical quantity area, expressed in the unit square millimetre.
source: https://www.bipm.org/en/publications/si-brochure

cubic metre
type: Class
subclass of: https://w3id.org/euph/8127
subclass of: Restriction
  on property: is unit of
  some values from: volume
IAO_0000115: The physical quantity volume, expressed in the derived unit cubic metre.
IAO_0000117: Michael Rubinigg
IAO_0000118: Kubikmeter @de
IAO_0000118: cubic metre
IAO_0000118: kubični meter @sl
id: EUPH:542

Axiom
annotated source: cubic metre
annotated property: IAO_0000115
annotated target: The physical quantity volume, expressed in the derived unit cubic metre.
source: https://www.bipm.org/en/publications/si-brochure

thousand heads
type: Class
subclass of: https://w3id.org/euph/998
subclass of: Restriction
  on property: quality of
  some values from: heads
IAO_0000115: The quantity amount, expressed in thousand heads.
IAO_0000117: Michael Rubinigg
IAO_0000118: Tausend Köpfe @de
IAO_0000118: thousand heads
id: EUPH:543

heads
type: Class
subclass of: number of specified items
IAO_0000115: The quantity amount, expressed in number of heads.
IAO_0000117: Michael Rubinigg
IAO_0000118: Köpfe @de
IAO_0000118: heads
id: EUPH:544

wax gland
type: Class
subclass of: gland
subclass of: Restriction
  on property: produces
  some values from: wax scale
subclass of: Restriction
  on property: located in
  some values from: worker bee
IAO_0000115: A wax gland is an exocrine gland complex consisting of epithelial cells, oenocytes and adipocytes. In honey bees they are located at the anterior part of the sternites 4, 5, 6 and 7 in the abdomen that discharges beeswax on two epithelial areas referred to as wax plates or wax mirrors. See also: Wax glands © Adam Tofilski www.honeybee.drawwing.org
IAO_0000117: Michael Rubinigg
IAO_0000118: Wachsdrüse @de
IAO_0000118: ghiandola ceripara @it
IAO_0000118: ghiandola della cera @it
IAO_0000118: glande cirière @fr
IAO_0000118: glandă cerieră @ro
IAO_0000118: glándula cerera @es
IAO_0000118: glândula cerífera @pt
IAO_0000118: glândula cerígena @pt
IAO_0000118: vaxkörtel @sv
IAO_0000118: vokskirtel @da
IAO_0000118: vokskjertel @no
IAO_0000118: wasklier @nl
IAO_0000118: wax gland
id: EUPH:5443
denoted by: Wax glands © Adam Tofilski www.honeybee.drawwing.org

Axiom
annotated source: wax gland
annotated property: IAO_0000115
annotated target: A wax gland is an exocrine gland complex consisting of epithelial cells, oenocytes and adipocytes. In honey bees they are located at the anterior part of the sternites 4, 5, 6 and 7 in the abdomen that discharges beeswax on two epithelial areas referred to as wax plates or wax mirrors. See also: Wax glands © Adam Tofilski www.honeybee.drawwing.org
has db xref: 10.1051/apido:19950103

Axiom
annotated source: wax gland
annotated property: denoted by
annotated target: Wax glands © Adam Tofilski www.honeybee.drawwing.org
has db xref: see also

number per animal
type: Class
subclass of: https://w3id.org/euph/985
IAO_0000115: The quantity amount, expressed in number per animal.
IAO_0000117: Michael Rubinigg
IAO_0000118: Anzahl pro Tier @de
IAO_0000118: number per animal
id: EUPH:545

million numbers of items
type: Class
subclass of: multiple of number of unspecified items
subclass of: Restriction
  on property: quality of
  some values from: number of unspecified items
IAO_0000115: The quantity amount, expressed in million numbers.
IAO_0000117: Michael Rubinigg
IAO_0000118: Millionen Stück @de
IAO_0000118: million numbers of items
id: EUPH:546

thousand numbers of items
type: Class
subclass of: multiple of number of unspecified items
subclass of: Restriction
  on property: quality of
  some values from: number of unspecified items
IAO_0000115: The quantity amount, expressed in thousand numbers.
IAO_0000117: Michael Rubinigg
IAO_0000118: Tausend Stück @de
IAO_0000118: thousand numbers of items
id: EUPH:547

thousand number of persons
type: Class
subclass of: https://w3id.org/euph/998
subclass of: Restriction
  on property: quality of
  some values from: number of persons
IAO_0000115: The quantity amount, expressed in thousand persons.
IAO_0000117: Michael Rubinigg
IAO_0000118: Tausend Personen @de
IAO_0000118: thousand persons
id: EUPH:549

number of persons
type: Class
subclass of: number of specified items
IAO_0000115: The quantity amount, expressed in number of persons.
IAO_0000117: Michael Rubinigg
IAO_0000118: Anzahl Personen @de
IAO_0000118: number of persons
id: EUPH:550

index
type: Class
subclass of: https://w3id.org/euph/916
IAO_0000115: The quantity amount, expressed as index.
IAO_0000117: Michael Rubinigg
IAO_0000118: Index @de
IAO_0000118: index
id: EUPH:551

number of pairs
type: Class
subclass of: number of specified items
IAO_0000115: The quantity amount, expressed in number of pairs.
IAO_0000117: Michael Rubinigg
IAO_0000118: Anzahl Paare @de
IAO_0000118: number of pairs
id: EUPH:552

dozen number of items
type: Class
subclass of: multiple of number of unspecified items
subclass of: Restriction
  on property: quality of
  some values from: number of unspecified items
IAO_0000115: The quantity amount, expressed in dozen of items.
IAO_0000117: Michael Rubinigg
IAO_0000118: Dutzend Stück @de
IAO_0000118: dozen of items
id: EUPH:553

million number of persons
type: Class
subclass of: https://w3id.org/euph/998
subclass of: Restriction
  on property: quality of
  some values from: number of persons
IAO_0000115: The quantity amount, expressed in million numbers of persons.
IAO_0000117: Michael Rubinigg
IAO_0000118: Millionen Peronen @de
IAO_0000118: million persons
id: EUPH:554

number of items
type: Class
subclass of: https://w3id.org/euph/970
subclass of: Restriction
  on property: is unit of
  some values from: amount
IAO_0000115: The quantity amount, expressed in number of items.
IAO_0000117: Michael Rubinigg
IAO_0000118: Stückzahl @de
IAO_0000118: number of items
id: EUPH:555

number of packages
type: Class
subclass of: number of specified items
IAO_0000115: The quantity amount, expressed in number of packages.
IAO_0000117: Michael Rubinigg
IAO_0000118: Anzahl Pakete @de
IAO_0000118: number of packages
id: EUPH:556

kilocalories per capita per day
type: Class
subclass of: https://w3id.org/euph/985
IAO_0000115: The quantity energy uptake, expressed in kilocalories per capita per day.
IAO_0000117: Michael Rubinigg
IAO_0000118: Kilokalorien pro Kopf und Tag @de
IAO_0000118: kilocalories per capita per day
id: EUPH:557

joule per capita per day
type: Class
subclass of: https://w3id.org/euph/985
IAO_0000115: The quantity energy uptake, expressed in joule per capita per day.
IAO_0000117: Michael Rubinigg
IAO_0000118: Joule per person per day @de
IAO_0000118: joule per capita per day
id: EUPH:558

million kilocalories
type: Class
subclass of: https://w3id.org/euph/997
subclass of: Restriction
  on property: quality of
  some values from: kilocalories
IAO_0000115: The quantity energy, expressed in million kilocalories.
IAO_0000117: Michael Rubinigg
IAO_0000118: Millionen Kilokalorien @de
IAO_0000118: million kilocalories
id: EUPH:559

kilocalories
type: Class
subclass of: https://w3id.org/euph/970
IAO_0000115: The quantity energy, expressed in kilocalories.
IAO_0000117: Michael Rubinigg
IAO_0000118: Kilokalorien @de
IAO_0000118: kilocalories
IAO_0000118: kilokalorije @sl
id: EUPH:560

terajoule
type: Class
subclass of: https://w3id.org/euph/968
subclass of: Restriction
  on property: quality of
  some values from: joule
IAO_0000115: The quantity energy, expressed in Terajoule, a decimal multiple of the derived unit with special name joule.
IAO_0000117: Michael Rubinigg
IAO_0000118: Terajoule @de
id: EUPH:561

Axiom
annotated source: terajoule
annotated property: IAO_0000115
annotated target: The quantity energy, expressed in Terajoule, a decimal multiple of the derived unit with special name joule.
source: https://www.bipm.org/en/publications/si-brochure

kilowatt hours
type: Class
subclass of: https://w3id.org/euph/985
IAO_0000115: The quantity energy, expressed in kilowatt hours.
IAO_0000117: Michael Rubinigg
IAO_0000118: Kilowattstunde @de
IAO_0000118: kilovatne ure @sl
IAO_0000118: kilowatt hours
id: EUPH:562

natural Varroa mite fall
type: Class
subclass of: https://w3id.org/euph/914
IAO_0000115: The quantity infestation rate of adult honey bee colonies with Varroa mites (Varroa destructor), measured as natural mite fall on a sticky board placed under the brood nest of a honey bee colony, expressed in number of Varroa mites per day.
IAO_0000117: Michael Rubinigg
IAO_0000118: caduta naturale @it
IAO_0000118: natural mite fall
IAO_0000118: natürlicher Milbenfall @de
id: EUPH:567

Axiom
annotated source: natural Varroa mite fall
annotated property: IAO_0000115
annotated target: The quantity infestation rate of adult honey bee colonies with Varroa mites (Varroa destructor), measured as natural mite fall on a sticky board placed under the brood nest of a honey bee colony, expressed in number of Varroa mites per day.
has db xref: 10.3896/IBRA.1.52.1.09

kilometre per hour
type: Class
subclass of: https://w3id.org/euph/8128
IAO_0000115: The physical quantity speed, velocity, expressed in kilometre per hour.
IAO_0000117: Michael Rubinigg
IAO_0000118: Kilometer pro Stunde @de
IAO_0000118: kilometre per hour
id: EUPH:568

metre per second
type: Class
subclass of: https://w3id.org/euph/8127
subclass of: Restriction
  on property: is unit of
  some values from: speed
IAO_0000115: The physical quantity speed, velocity, expressed in the derived unit metre per second.
IAO_0000117: Michael Rubinigg
IAO_0000118: Meter pro Sekunde @de
IAO_0000118: metre per second
id: EUPH:569

Axiom
annotated source: metre per second
annotated property: IAO_0000115
annotated target: The physical quantity speed, velocity, expressed in the derived unit metre per second.
source: https://www.bipm.org/en/publications/si-brochure

metre per square second
type: Class
subclass of: https://w3id.org/euph/8127
subclass of: Restriction
  on property: is unit of
  some values from: acceleration
IAO_0000115: The physical quantity acceleration, expressed in the derived unit metre per square second.
IAO_0000117: Michael Rubinigg
IAO_0000118: Meter pro Sekunde zum Quadrat @de
IAO_0000118: metre per square second
id: EUPH:570

Axiom
annotated source: metre per square second
annotated property: IAO_0000115
annotated target: The physical quantity acceleration, expressed in the derived unit metre per square second.
source: https://www.bipm.org/en/publications/si-brochure

calendar year
type: Class
subclass of: time scale unit
subclass of: Restriction
  on property: member of
  some values from: https://w3id.org/euph/7639
subclass of: Restriction
  on property: member of
  some values from: https://w3id.org/euph/838
subclass of: Restriction
  on property: is unit of
  some values from: Gregorian calendar
IAO_0000115: time scale unit [...] defined by the calendar [...] system
IAO_0000117: Michael Rubinigg
IAO_0000118: Jahr @de
IAO_0000118: Kalenderjahr @de
IAO_0000118: anno @it
IAO_0000118: anno solare @it
IAO_0000118: année @fr
IAO_0000118: année civile @fr
IAO_0000118: calendar year
IAO_0000118: jaar @nl
IAO_0000118: kalenderjaar @nl
IAO_0000118: koledarsko leto @sl
IAO_0000118: leto @sl
IAO_0000118: year
id: EUPH:571

Axiom
annotated source: calendar year
annotated property: IAO_0000115
annotated target: time scale unit [...] defined by the calendar [...] system
has db xref: 10.1371/journal.pone.0029715
source: https://www.iso.org/standard/70907.html

honey extraction
type: Class
subclass of: honey harvesting
subclass of: Restriction
  on property: has output
  some values from: honey
IAO_0000115: Honey extraction is a process for harvesting honey in which honey is extracted from honeycombs using some kind of mechanical method.
IAO_0000117: Michael Rubinigg
IAO_0000118: a extrage @ro
IAO_0000118: a recolta @ro
IAO_0000118: at høste @da
IAO_0000118: att utvinna @sv
IAO_0000118: colher @pt
IAO_0000118: cosechar @es
IAO_0000118: ernten @de
IAO_0000118: estrarre @it
IAO_0000118: extraer @es
IAO_0000118: extraheren @nl
IAO_0000118: extrair @pt
IAO_0000118: gewinnen @de
IAO_0000118: raccogliere @it
IAO_0000118: récolter @fr
IAO_0000118: to extract
IAO_0000118: å utvinne @no
id: EUPH:572

generically dependent continuant in beekeeping
type: Class
subclass of: continuant in beekeeping
IAO_0000115: A generically dependent contiunant in beekeeping is a continuant in the beekeeping domain that does not exist on its own, but does not require a specific single entity in any other domain to exist.
IAO_0000117: Michael Rubinigg
IAO_0000118: generically dependent continuant in beekeeping
id: EUPH:573

Axiom
annotated source: generically dependent continuant in beekeeping
annotated property: IAO_0000115
annotated target: A generically dependent contiunant in beekeeping is a continuant in the beekeeping domain that does not exist on its own, but does not require a specific single entity in any other domain to exist.
source: http://purl.obolibrary.org/obo/BFO_0000031

hundred milligrams per animal
type: Class
subclass of: https://w3id.org/euph/985
IAO_0000115: The quantity mass, expressed in hundred milligrams per animal.
IAO_0000117: Michael Rubinigg
IAO_0000118: Hundert Milligramm pro Tier @de
IAO_0000118: hundred milligrams per animal
IAO_0000118: sto miligramov na žival @sl
id: EUPH:578

hundred grams per animal
type: Class
subclass of: https://w3id.org/euph/985
IAO_0000115: The quantity mass, expressed in hundred grams per animal.
IAO_0000117: Michael Rubinigg
IAO_0000118: Hundert Gramm pro Tier @de
IAO_0000118: hundred grams per animal
IAO_0000118: sto gramov na žival @sl
id: EUPH:579

milligram per animal
type: Class
subclass of: https://w3id.org/euph/985
IAO_0000115: The quantity mass, expressed in milligram per animal.
IAO_0000117: Michael Rubinigg
IAO_0000118: Milligramm pro Tier @de
IAO_0000118: miligram na žival @sl
IAO_0000118: milligram per animal
id: EUPH:580

hundred grams per tonne
type: Class
subclass of: https://w3id.org/euph/8128
IAO_0000115: The quantity mass, expressed in hundred grams per tonne.
IAO_0000117: Michael Rubinigg
IAO_0000118: Hundert Gramm pro Tonne @de
IAO_0000118: hundred grams per tonne
IAO_0000118: sto gramov na tono @sl
id: EUPH:581

tonnes per hectare
type: Class
subclass of: https://w3id.org/euph/985
IAO_0000115: The quantity mass, expressed in tonnes per hectare.
IAO_0000117: Michael Rubinigg
IAO_0000118: Tonnen pro Hektar @de
IAO_0000118: ton na hektar @sl
IAO_0000118: tonnes per hectare
id: EUPH:582

hundred grams per hectare
type: Class
subclass of: https://w3id.org/euph/8128
IAO_0000115: The quantity mass, expressed in hundred grams per hectare.
IAO_0000117: Michael Rubinigg
IAO_0000118: Hundert Gramm pro Hektar @de
IAO_0000118: hundred grams per hectare
IAO_0000118: sto gramov na hektar @sl
id: EUPH:583

kilogram per hectare
type: Class
subclass of: https://w3id.org/euph/8128
IAO_0000115: The quantity mass, expressed in kilogram per hectare.
IAO_0000117: Michael Rubinigg
IAO_0000118: Kilogramm pro Hektar @de
IAO_0000118: kilogram na hektar @sl
IAO_0000118: kilogram per hectare
id: EUPH:584

kilogram per person
type: Class
subclass of: https://w3id.org/euph/985
IAO_0000115: The quantity mass, expressed in kilogram per person.
IAO_0000117: Michael Rubinigg
IAO_0000118: Kilogramm pro Person @de
IAO_0000118: kilogram per person
IAO_0000118: kilogramov na osebo @sl
id: EUPH:585

gram per kilogram of dry matter
type: Class
subclass of: https://w3id.org/euph/985
IAO_0000115: The quantity mass, expressed in gram per kilogram of dry matter.
IAO_0000117: Michael Rubinigg
IAO_0000118: Gramm pro Kilogramm Trockenmasse @de
IAO_0000118: gram per kilogram of dry matter
id: EUPH:587

kilogram per head
type: Class
subclass of: https://w3id.org/euph/985
IAO_0000115: The quantity mass, expressed in kilogram per head.
IAO_0000117: Michael Rubinigg
IAO_0000118: Kilogramm pro Kopf @de
IAO_0000118: kilogram per head
id: EUPH:588

hypopharyngeal gland
type: Class
subclass of: gland
subclass of: Restriction
  on property: in taxon
  some values from: https://www.gbif.org/species/1457
subclass of: Restriction
  on property: located in
  some values from: insect adult head
IAO_0000115: A hypopharyngeal gland is an exocrine, non-pheromone producing gland located in the head of hymenopterans that discharges its secretions into the oral cavity. See also: Hypopharyngeal glands © Adam Tofilski www.honeybee.drawwing.org
IAO_0000117: Michael Rubinigg
IAO_0000118: Futtersaftdrüse @de
IAO_0000118: Hypopharynxdrüse @de
IAO_0000118: Schlunddrüse @de
IAO_0000118: brood-food gland
IAO_0000118: fodersaftkirtel @da
IAO_0000118: fodersaftkörtel @sv
IAO_0000118: fórsaftkjertel @no
IAO_0000118: ghiandola faringea @it
IAO_0000118: ghiandola ipofaringea @it
IAO_0000118: ghiandola sopracerebrale @it
IAO_0000118: glande nourricière @fr
IAO_0000118: glandă faringiană @ro
IAO_0000118: glándula faríngea @es
IAO_0000118: glándula nuricia @es
IAO_0000118: glândula faríngea @pt
IAO_0000118: hypopharyngeal gland
IAO_0000118: pharyngeal gland
IAO_0000118: voedersap klier @nl
id: EUPH:5882
denoted by: Hypopharyngeal glands © Adam Tofilski www.honeybee.drawwing.org

Axiom
annotated source: hypopharyngeal gland
annotated property: IAO_0000115
annotated target: A hypopharyngeal gland is an exocrine, non-pheromone producing gland located in the head of hymenopterans that discharges its secretions into the oral cavity. See also: Hypopharyngeal glands © Adam Tofilski www.honeybee.drawwing.org
has db xref: 10.3389/fphys.2020.615830

Axiom
annotated source: hypopharyngeal gland
annotated property: denoted by
annotated target: Hypopharyngeal glands © Adam Tofilski www.honeybee.drawwing.org
has db xref: see also

kilogram per kilogram nitrogen
type: Class
subclass of: https://w3id.org/euph/985
IAO_0000115: The quantity mass, expressed in kilogram per kilogram nitrogen.
IAO_0000117: Michael Rubinigg
IAO_0000118: Kilogramm pro Kilogramm Stickstoff @de
IAO_0000118: kilogram per kilogram nitrogen
id: EUPH:589

honey bee water source
type: Class
subclass of: extrinsic role in beekeeping
subclass of: Restriction
  on property: role of
  some values from: multipurpose water
IAO_0000115: A honey bee water source is a natural source (ponds, streams, dew, nectar, honeydew) or an artificial source from which honey bees collect water.
IAO_0000117: Michael Rubinigg
IAO_0000118: honey bee water source
id: EUPH:5894

kilogram per kilogram of a product
type: Class
subclass of: https://w3id.org/euph/985
IAO_0000115: The quantity mass, expressed in kilogram per kilogram of a product.
IAO_0000117: Michael Rubinigg
IAO_0000118: Kilogramm pro Kilogramm Produkt @de
IAO_0000118: kilogram per kilogram of a product
id: EUPH:590

gram per capita per day
type: Class
subclass of: https://w3id.org/euph/985
IAO_0000115: The quantity mass, expressed in gram per capita per day.
IAO_0000117: Michael Rubinigg
IAO_0000118: Gramm pro Kopf pro Tag @de
IAO_0000118: gram per capita per day
IAO_0000118: gramov na prebivalca na dan @sl
id: EUPH:591

million tonnes
type: Class
subclass of: https://w3id.org/euph/963
subclass of: Restriction
  on property: quality of
  some values from: tonne
IAO_0000115: The physical quantity mass, expressed in the accepted non-SI unit million tonnes.
IAO_0000117: Michael Rubinigg
IAO_0000118: Millionen Tonnen @de
IAO_0000118: million tonnes
id: EUPH:592

Axiom
annotated source: million tonnes
annotated property: IAO_0000115
annotated target: The physical quantity mass, expressed in the accepted non-SI unit million tonnes.
source: https://www.bipm.org/en/publications/si-brochure

thousand tonnes
type: Class
subclass of: https://w3id.org/euph/963
subclass of: Restriction
  on property: quality of
  some values from: tonne
IAO_0000115: The physical quantity mass, expressed in the accepted non-SI unit thousand tonnes.
IAO_0000117: Michael Rubinigg
IAO_0000118: Tausend Tonnen @de
IAO_0000118: thousand tonnes
IAO_0000118: tisoč ton @sl
id: EUPH:593

Axiom
annotated source: thousand tonnes
annotated property: IAO_0000115
annotated target: The physical quantity mass, expressed in the accepted non-SI unit thousand tonnes.
source: https://www.bipm.org/en/publications/si-brochure

tonne
type: Class
subclass of: https://w3id.org/euph/8129
subclass of: Restriction
  on property: is unit of
  some values from: mass
IAO_0000115: The physical quantity mass, expressed in the accepted non-SI unit tonne.
IAO_0000117: Michael Rubinigg
IAO_0000118: Tonne @de
IAO_0000118: tona @sl
IAO_0000118: tonne
id: EUPH:594

Axiom
annotated source: tonne
annotated property: IAO_0000115
annotated target: The physical quantity mass, expressed in the accepted non-SI unit tonne.
source: https://www.bipm.org/en/publications/si-brochure

hectogram
type: Class
subclass of: https://w3id.org/euph/965
subclass of: Restriction
  on property: quality of
  some values from: kilogram
IAO_0000115: The physical quantity mass, expressed in hectogram, a decimal submultiple of the the base unit kilogram.
IAO_0000117: Michael Rubinigg
IAO_0000118: Hektogramm @de
IAO_0000118: hectogram
IAO_0000118: hektogram @sl
id: EUPH:595

Axiom
annotated source: hectogram
annotated property: IAO_0000115
annotated target: The physical quantity mass, expressed in hectogram, a decimal submultiple of the the base unit kilogram.
source: https://www.bipm.org/en/publications/si-brochure

dekagram
type: Class
subclass of: https://w3id.org/euph/965
subclass of: Restriction
  on property: quality of
  some values from: kilogram
IAO_0000115: The physical quantity mass, expressed in dekagram, a decimal submultiple of the the base unit kilogram.
IAO_0000117: Michael Rubinigg
IAO_0000118: Dekagramm @de
IAO_0000118: dekagram
id: EUPH:596

Axiom
annotated source: dekagram
annotated property: IAO_0000115
annotated target: The physical quantity mass, expressed in dekagram, a decimal submultiple of the the base unit kilogram.
source: https://www.bipm.org/en/publications/si-brochure

gram
type: Class
subclass of: https://w3id.org/euph/965
subclass of: Restriction
  on property: quality of
  some values from: kilogram
IAO_0000115: The physical quantity mass, expressed in gram, a decimal submultiple of the the base unit kilogram.
IAO_0000117: Michael Rubinigg
IAO_0000118: Gramm @de
IAO_0000118: gram
id: EUPH:597

Axiom
annotated source: gram
annotated property: IAO_0000115
annotated target: The physical quantity mass, expressed in gram, a decimal submultiple of the the base unit kilogram.
source: https://www.bipm.org/en/publications/si-brochure

milligram
type: Class
subclass of: https://w3id.org/euph/965
subclass of: Restriction
  on property: quality of
  some values from: kilogram
IAO_0000115: The physical quantity mass, expressed in milligram, a decimal submultiple of the the base unit kilogram.
IAO_0000117: Michael Rubinigg
IAO_0000118: Milligramm @de
IAO_0000118: miligram @sl
IAO_0000118: milligram
id: EUPH:598

Axiom
annotated source: milligram
annotated property: IAO_0000115
annotated target: The physical quantity mass, expressed in milligram, a decimal submultiple of the the base unit kilogram.
source: https://www.bipm.org/en/publications/si-brochure

microgram
type: Class
subclass of: https://w3id.org/euph/965
subclass of: Restriction
  on property: quality of
  some values from: kilogram
IAO_0000115: The physical quantity mass, expressed in microgram, a decimal submultiple of the the base unit kilogram.
IAO_0000117: Michael Rubinigg
IAO_0000118: Mikrogramm @de
IAO_0000118: microgram
IAO_0000118: mikrogram @sl
id: EUPH:599

Axiom
annotated source: microgram
annotated property: IAO_0000115
annotated target: The physical quantity mass, expressed in microgram, a decimal submultiple of the the base unit kilogram.
source: https://www.bipm.org/en/publications/si-brochure

colony
type: Class
subclass of: object aggregate in biology
IAO_0000115: A colony is a group of two or more organisms living in close association with, or connected to, one another.
IAO_0000117: Michael Rubinigg
IAO_0000118: Bienenvolk @de
IAO_0000118: Volk @de
IAO_0000118: alveare @it
IAO_0000118: bifolk @no
IAO_0000118: colonia @es
IAO_0000118: colonie @fr
IAO_0000118: colony
IAO_0000118: colónia @pt
IAO_0000118: famiglia di api @it
IAO_0000118: familia @pt
IAO_0000118: familie @da
IAO_0000118: folk @da
IAO_0000118: kolonie @nl
IAO_0000118: samfund @da
IAO_0000118: samhälle @sv
IAO_0000118: volk @nl
id: EUPH:6

Axiom
annotated source: colony
annotated property: IAO_0000115
annotated target: A colony is a group of two or more organisms living in close association with, or connected to, one another.
source: https://en.wikipedia.org/w/index.php

nanogram
type: Class
subclass of: https://w3id.org/euph/965
subclass of: Restriction
  on property: quality of
  some values from: kilogram
IAO_0000115: The physical quantity mass, expressed in nanogram, a decimal submultiple of the the base unit kilogram.
IAO_0000117: Michael Rubinigg
IAO_0000118: Nanogramm @de
IAO_0000118: nanogram
id: EUPH:600

Axiom
annotated source: nanogram
annotated property: IAO_0000115
annotated target: The physical quantity mass, expressed in nanogram, a decimal submultiple of the the base unit kilogram.
source: https://www.bipm.org/en/publications/si-brochure

carat
type: Class
subclass of: https://w3id.org/euph/970
subclass of: Restriction
  on property: is unit of
  some values from: mass
IAO_0000115: The physical quantity mass, expressed in carat.
IAO_0000117: Michael Rubinigg
IAO_0000118: Karat @de
IAO_0000118: carat
IAO_0000118: karat @sl
id: EUPH:601

EFSA DCF term code
type: Class
subclass of: https://w3id.org/euph/7886
IAO_0000115: The EFSA DCF term code is a unique identifier for a term in the EFSA DCF.
IAO_0000117: Michael Rubinigg
IAO_0000118: EFSA DCF term code
id: EUPH:6052
denoted by: //app.pollinatorhub.eu/vocabulary/classes/7886).

Axiom
annotated source: EFSA DCF term code
annotated property: IAO_0000115
annotated target: The EFSA DCF term code is a unique identifier for a term in the EFSA DCF.
has db xref: 10.5281/zenodo.7590216

Axiom
annotated source: EFSA DCF term code
annotated property: denoted by
annotated target: //app.pollinatorhub.eu/vocabulary/classes/7886).
has db xref: EFSA DCF term code

farad
type: Class
subclass of: https://w3id.org/euph/8126
subclass of: Restriction
  on property: is unit of
  some values from: capacitance
IAO_0000115: The physical quantity capacitance, expressed by the derived unit with special name farad
IAO_0000117: Michael Rubinigg
IAO_0000118: Farad @de
IAO_0000118: farad
id: EUPH:607

Axiom
annotated source: farad
annotated property: IAO_0000115
annotated target: The physical quantity capacitance, expressed by the derived unit with special name farad
source: https://www.bipm.org/en/publications/si-brochure

relation ontology
type: Class
subclass of: ontology
IAO_0000115: A relation ontology is an ontology whose main content consists of formally defined relations (object properties) that can link classes, individuals, or data values, often with defined domain, range, and logical characteristics.
IAO_0000117: Michael Rubinigg
IAO_0000118: relation ontology
id: EUPH:6072

ohm
type: Class
subclass of: https://w3id.org/euph/8126
subclass of: Restriction
  on property: is unit of
  some values from: electric resistance
IAO_0000115: The physical quantity electric resistance, expressed by the derived unit with special name ohm
IAO_0000117: Michael Rubinigg
IAO_0000118: Ohm @de
IAO_0000118: ohm
id: EUPH:608

Axiom
annotated source: ohm
annotated property: IAO_0000115
annotated target: The physical quantity electric resistance, expressed by the derived unit with special name ohm
source: https://www.bipm.org/en/publications/si-brochure

linden honey
type: Class
subclass of: unifloral honey
subclass of: https://w3id.org/euph/75
subclass of: Restriction
  on property: derives from part of
  some values from: https://www.gbif.org/species/2076990
subclass of: Restriction
  on property: derives from part of
  some values from: https://www.gbif.org/species/3152041
IAO_0000115: Linden honey is a unifloral honey as well as honeydew honey deriving mainly from nectar produced by Tilia sp. and honeydew produced by ectoparasites of Tilia sp..
IAO_0000117: Michael Rubinigg
IAO_0000118: Lindenhonig @de
IAO_0000118: linden honey
id: EUPH:6088

mole per cubic metre
type: Class
subclass of: https://w3id.org/euph/8127
subclass of: Restriction
  on property: is unit of
  some values from: amount of substance concentration
IAO_0000115: The physical quantity amount of substance concentration, expressed in the derived unit mole per cubic metre.
IAO_0000117: Michael Rubinigg
IAO_0000118: Mol pro Kubikmeter @de
IAO_0000118: mole per cubic metre
id: EUPH:611

Axiom
annotated source: mole per cubic metre
annotated property: IAO_0000115
annotated target: The physical quantity amount of substance concentration, expressed in the derived unit mole per cubic metre.
source: https://www.bipm.org/en/publications/si-brochure

hertz
type: Class
subclass of: https://w3id.org/euph/8126
subclass of: Restriction
  on property: is unit of
  some values from: frequency
IAO_0000115: The physical quantity frequency, expressed by the derived unit with special name hertz
IAO_0000117: Michael Rubinigg
IAO_0000118: Hertz @de
IAO_0000118: hertz
id: EUPH:613

Axiom
annotated source: hertz
annotated property: IAO_0000115
annotated target: The physical quantity frequency, expressed by the derived unit with special name hertz
source: https://www.bipm.org/en/publications/si-brochure

newton
type: Class
subclass of: https://w3id.org/euph/8126
subclass of: Restriction
  on property: is unit of
  some values from: force
IAO_0000115: The physical quantity force, expressed by the derived unit with special name newton
IAO_0000117: Michael Rubinigg
IAO_0000118: Newton @de
IAO_0000118: newton
id: EUPH:614

Axiom
annotated source: newton
annotated property: IAO_0000115
annotated target: The physical quantity force, expressed by the derived unit with special name newton
source: https://www.bipm.org/en/publications/si-brochure

lux
type: Class
subclass of: https://w3id.org/euph/8126
subclass of: Restriction
  on property: is unit of
  some values from: illuminance
IAO_0000115: The physical quantity illuminance, expressed by the derived unit with special name lux
IAO_0000117: Michael Rubinigg
IAO_0000118: Lux @de
IAO_0000118: lux
id: EUPH:616

Axiom
annotated source: lux
annotated property: IAO_0000115
annotated target: The physical quantity illuminance, expressed by the derived unit with special name lux
source: https://www.bipm.org/en/publications/si-brochure

becquerel
type: Class
subclass of: https://w3id.org/euph/8126
subclass of: Restriction
  on property: is unit of
  some values from: activity referred to a radionuclide
IAO_0000115: The physical quantity activity referred to radionucleotide, expressed by the derived unit with special name becquerel
IAO_0000117: Michael Rubinigg
IAO_0000118: Becquerel @de
IAO_0000118: becquerel
id: EUPH:617

Axiom
annotated source: becquerel
annotated property: IAO_0000115
annotated target: The physical quantity activity referred to radionucleotide, expressed by the derived unit with special name becquerel
source: https://www.bipm.org/en/publications/si-brochure

sievert
type: Class
subclass of: https://w3id.org/euph/8126
subclass of: Restriction
  on property: is unit of
  some values from: dose equivalent
IAO_0000115: The physical quantity dose equivalent, expressed by the derived unit with special name sievert
IAO_0000117: Michael Rubinigg
IAO_0000118: Sievert @de
IAO_0000118: sievert
id: EUPH:618

Axiom
annotated source: sievert
annotated property: IAO_0000115
annotated target: The physical quantity dose equivalent, expressed by the derived unit with special name sievert
source: https://www.bipm.org/en/publications/si-brochure

katal
type: Class
subclass of: https://w3id.org/euph/8126
subclass of: Restriction
  on property: is unit of
  some values from: catalytic activity
IAO_0000115: The physical quantity catalytic activity, expressed by the derived unit with special name katal
IAO_0000117: Michael Rubinigg
IAO_0000118: Katal @de
IAO_0000118: katal
id: EUPH:619

Axiom
annotated source: katal
annotated property: IAO_0000115
annotated target: The physical quantity catalytic activity, expressed by the derived unit with special name katal
source: https://www.bipm.org/en/publications/si-brochure

kilogram per cubic metre
type: Class
subclass of: https://w3id.org/euph/8127
subclass of: Restriction
  on property: is unit of
  some values from: mass concentration
subclass of: Restriction
  on property: is unit of
  some values from: density
IAO_0000115: The physical quantity mass concentration, expressed in the derived unit kilogram per cubic metre.
IAO_0000117: Michael Rubinigg
IAO_0000118: Kilogramm pro Kubikmeter @de
IAO_0000118: kilogram per cubic metre
id: EUPH:620

Axiom
annotated source: kilogram per cubic metre
annotated property: IAO_0000115
annotated target: The physical quantity mass concentration, expressed in the derived unit kilogram per cubic metre.
source: https://www.bipm.org/en/publications/si-brochure

cubic metre per kilogram
type: Class
subclass of: https://w3id.org/euph/8127
subclass of: Restriction
  on property: is unit of
  some values from: specific volume
IAO_0000115: The physical quantity specific volume, expressed in teh derived unit cubic metre per kilogram.
IAO_0000117: Michael Rubinigg
IAO_0000118: Kubikmeter pro Kilogramm @de
IAO_0000118: cubic metre per kilogram
id: EUPH:621

Axiom
annotated source: cubic metre per kilogram
annotated property: IAO_0000115
annotated target: The physical quantity specific volume, expressed in teh derived unit cubic metre per kilogram.
source: https://www.bipm.org/en/publications/si-brochure

watt per square metre
type: Class
subclass of: https://w3id.org/euph/8128
subclass of: Restriction
  on property: is unit of
  some values from: irradiance
IAO_0000115: The physical quantity irradiance, expressed in the derived unit watt per square metre.
IAO_0000117: Michael Rubinigg
IAO_0000118: Watt pro Quadratmeter @de
IAO_0000118: watt per square metre
id: EUPH:623

Axiom
annotated source: watt per square metre
annotated property: IAO_0000115
annotated target: The physical quantity irradiance, expressed in the derived unit watt per square metre.
source: https://www.bipm.org/en/publications/si-brochure

organonitrogen heterocyclic compound
type: Class
subclass of: organonitrogen compound
IAO_0000115: An organonitrogen heterocyclic compound is an organonitrogen compound that has been defined as follows: Any organonitrogen compound containing a cyclic component with nitrogen and at least one other element as ring member atoms.
IAO_0000117: Michael Rubinigg
IAO_0000118: organonitrogen heterocyclic compound
id: EUPH:6231

Axiom
annotated source: organonitrogen heterocyclic compound
annotated property: IAO_0000115
annotated target: An organonitrogen heterocyclic compound is an organonitrogen compound that has been defined as follows: Any organonitrogen compound containing a cyclic component with nitrogen and at least one other element as ring member atoms.
source: https://www.ebi.ac.uk/chebi/init.do

candela per square metre
type: Class
subclass of: https://w3id.org/euph/8127
subclass of: Restriction
  on property: is unit of
  some values from: luminance
IAO_0000115: The physical quantity luminance, expressed in the derived unit candela per square metre.
IAO_0000117: Michael Rubinigg
IAO_0000118: Candela pro Quadratmeter @de
IAO_0000118: candela per square metre
id: EUPH:624

Axiom
annotated source: candela per square metre
annotated property: IAO_0000115
annotated target: The physical quantity luminance, expressed in the derived unit candela per square metre.
source: https://www.bipm.org/en/publications/si-brochure

relational quality in geology
type: Class
subclass of: quality in geology
IAO_0000115: A relational quality in geology is a quality entity in the geology domain that is specifically dependent on two or more non-identical entities.
IAO_0000117: Michael Rubinigg
IAO_0000118: relational quality in geology
id: EUPH:6243

Axiom
annotated source: relational quality in geology
annotated property: IAO_0000115
annotated target: A relational quality in geology is a quality entity in the geology domain that is specifically dependent on two or more non-identical entities.
source: relational quality in beekeeping

international union of pure and applied chemistry (IUPAC) identifier
type: Class
subclass of: chemical identifier
IAO_0000115: An international union of pure and applied chemistry (IUPAC) identifier is a chemical identifier issued by the International Union of Pure and Applied Chemistry (IUPAC), the world authority on digital standards in chemistry, chemical nomenclature and terminology.
IAO_0000117: Michael Rubinigg
IAO_0000118: IUPAC identifier
IAO_0000118: International Union of Pure and Applied Chemistry identifier
id: EUPH:6247

Axiom
annotated source: international union of pure and applied chemistry (IUPAC) identifier
annotated property: IAO_0000115
annotated target: An international union of pure and applied chemistry (IUPAC) identifier is a chemical identifier issued by the International Union of Pure and Applied Chemistry (IUPAC), the world authority on digital standards in chemistry, chemical nomenclature and terminology.
source: https://iupac.org/who-we-are/

animal health act 20012588 of Austria
type: Class
subclass of: Austrian national law
IAO_0000115: The animal health act 20012588 of Austria is an Austrian national law which serves to combat, eradicate and prevent the spread of notifiable animal diseases, including zoonoses, as well as to monitor, maintain and improve animal health. It applies to honey bees.
IAO_0000117: Michael Rubinigg
IAO_0000118: Austrian animal health act
IAO_0000118: Bundesgesetz zur Durchführung des europäischen Tiergesundheitsrechts, zur Abwehr und Bekämpfung von Tierseuchen sowie zur Überwachung, Erhaltung und Verbesserung der Tiergesundheit @de
IAO_0000118: TGG 2024 @de
IAO_0000118: Tiergesundheitsgesetz 2024 @de
id: EUPH:6250

Axiom
annotated source: animal health act 20012588 of Austria
annotated property: IAO_0000115
annotated target: The animal health act 20012588 of Austria is an Austrian national law which serves to combat, eradicate and prevent the spread of notifiable animal diseases, including zoonoses, as well as to monitor, maintain and improve animal health. It applies to honey bees.
source: https://www.ris.bka.gv.at/GeltendeFassung.wxe

Austrian law
type: Class
subclass of: https://w3id.org/euph/8122
IAO_0000115: An Austrian law is a national law enacted by a legal body in the Republic of Austria.
IAO_0000117: Michael Rubinigg
IAO_0000118: Austrian law
IAO_0000118: Österreichisches Recht @de
id: EUPH:6251

beekeeping act 20000846 of Styria
type: Class
subclass of: Austrian regional law
IAO_0000115: The beekeeping act 20000846 of Styria is an Austrian regional law which regulates beekeeping, including migratory beekeeping, breeding, and the breed to be kept, in the Austrian region of Styria
IAO_0000117: Michael Rubinigg
IAO_0000118: BZG @de
IAO_0000118: Steiermärkisches Bienenzuchtgesetz @de
IAO_0000118: Styrian beekeeping act
id: EUPH:6252

Axiom
annotated source: beekeeping act 20000846 of Styria
annotated property: IAO_0000115
annotated target: The beekeeping act 20000846 of Styria is an Austrian regional law which regulates beekeeping, including migratory beekeeping, breeding, and the breed to be kept, in the Austrian region of Styria
source: https://www.ris.bka.gv.at/GeltendeFassung.wxe

henry
type: Class
subclass of: https://w3id.org/euph/8126
subclass of: Restriction
  on property: is unit of
  some values from: inductance
IAO_0000115: The physical quantity inductance, expressed by the derived unit with special name henry
IAO_0000117: Michael Rubinigg
IAO_0000118: Henry @de
IAO_0000118: henry
id: EUPH:628

Axiom
annotated source: henry
annotated property: IAO_0000115
annotated target: The physical quantity inductance, expressed by the derived unit with special name henry
source: https://www.bipm.org/en/publications/si-brochure

lumen
type: Class
subclass of: https://w3id.org/euph/8126
subclass of: Restriction
  on property: is unit of
  some values from: luminous flux
IAO_0000115: The physical quantity luminous flux, expressed by the derived unit with special name lumen
IAO_0000117: Michael Rubinigg
IAO_0000118: Lumen @de
IAO_0000118: lumen
id: EUPH:629

Axiom
annotated source: lumen
annotated property: IAO_0000115
annotated target: The physical quantity luminous flux, expressed by the derived unit with special name lumen
source: https://www.bipm.org/en/publications/si-brochure

honey flow
type: Class
subclass of: https://w3id.org/euph/924
IAO_0000115: A time of year, perhaps more than once, when abundant nectar is available for collection and the field bees are sufficiently populous to store and ripen nectar for future use by bees or surplus for human harvest.
IAO_0000117: Michael Rubinigg
IAO_0000118: Tracht @de
IAO_0000118: dracht @nl
IAO_0000118: flusso di miele @it
IAO_0000118: honey flow
IAO_0000118: miellée @fr
id: EUPH:63

Axiom
annotated source: honey flow
annotated property: IAO_0000115
annotated target: A time of year, perhaps more than once, when abundant nectar is available for collection and the field bees are sufficiently populous to store and ripen nectar for future use by bees or surplus for human harvest.
has db xref: ISBN:1-878075-65-4

gray
type: Class
subclass of: https://w3id.org/euph/8126
subclass of: Restriction
  on property: is unit of
  some values from: absorbed dose
IAO_0000115: The physical quantity absorbed dose, kerma, expressed by the derived unit with special name gray
IAO_0000117: Michael Rubinigg
IAO_0000118: Gray @de
IAO_0000118: gray
id: EUPH:630

Axiom
annotated source: gray
annotated property: IAO_0000115
annotated target: The physical quantity absorbed dose, kerma, expressed by the derived unit with special name gray
source: https://www.bipm.org/en/publications/si-brochure

IUPAC nomenclature
type: Class
subclass of: international union of pure and applied chemistry (IUPAC) identifier
IAO_0000115: IUPAC nomenclature is the nomenclature for chemical terms proposed by the International Union of Pure and Applied Chemistry (IUPAC), the universally-recognized authority on chemical nomenclature and terminology.
IAO_0000117: Michael Rubinigg
IAO_0000118: IUPAC nomenclature
id: EUPH:6303

Axiom
annotated source: IUPAC nomenclature
annotated property: IAO_0000115
annotated target: IUPAC nomenclature is the nomenclature for chemical terms proposed by the International Union of Pure and Applied Chemistry (IUPAC), the universally-recognized authority on chemical nomenclature and terminology.
has db xref: ISBN:978-0-85404-182-4
source: https://iupac.org/what-we-do/nomenclature/

per metre
type: Class
subclass of: https://w3id.org/euph/8127
subclass of: Restriction
  on property: is unit of
  some values from: wavenumber
IAO_0000115: wavenumber expressed per metre.
IAO_0000117: Michael Rubinigg
IAO_0000118: per metre
IAO_0000118: pro Meter @de
id: EUPH:631

hive product quality
type: Class
subclass of: https://w3id.org/euph/976
subclass of: Restriction
  on property: functionally related to
  some values from: honey
IAO_0000115: A hive product quality is a quality in the beekeeping domain issued by a legislative body or an association that determines whether and how hive products may be marketed.
IAO_0000117: Michael Rubinigg
IAO_0000118: Qualitätsparameter von Bienenprodukten @de
IAO_0000118: hive product quality entity
id: EUPH:6314

Axiom
annotated source: hive product quality
annotated property: IAO_0000115
annotated target: A hive product quality is a quality in the beekeeping domain issued by a legislative body or an association that determines whether and how hive products may be marketed.
source: https://basic-formal-ontology.org/

identifier of beekeeping entities
type: Class
subclass of: https://w3id.org/euph/976
IAO_0000115: An identifier of beekeeping entities is an identifier that is specific for an entity in the beekeeping domain.
IAO_0000117: Michael Rubinigg
IAO_0000118: beekeeping ID
IAO_0000118: beekeeping identifier
id: EUPH:6318

kilogram per square metre
type: Class
subclass of: https://w3id.org/euph/8127
subclass of: Restriction
  on property: is unit of
  some values from: surface density
IAO_0000115: The physical quantity surface density, expressed in the derived unit kilogram per square metre.
IAO_0000117: Michael Rubinigg
IAO_0000118: Kilogramm pro Quadratmeter @de
IAO_0000118: kilogram per square metre
id: EUPH:632

Axiom
annotated source: kilogram per square metre
annotated property: IAO_0000115
annotated target: The physical quantity surface density, expressed in the derived unit kilogram per square metre.
source: https://www.bipm.org/en/publications/si-brochure

ampere per square metre
type: Class
subclass of: https://w3id.org/euph/8127
subclass of: Restriction
  on property: is unit of
  some values from: current density
IAO_0000115: The physical quantity current density, expressed in teh derived unit ampere per square metre.
IAO_0000117: Michael Rubinigg
IAO_0000118: Ampere pro Quadratmeter @de
IAO_0000118: ampere per square metre
id: EUPH:633

Axiom
annotated source: ampere per square metre
annotated property: IAO_0000115
annotated target: The physical quantity current density, expressed in teh derived unit ampere per square metre.
source: https://www.bipm.org/en/publications/si-brochure

ampere per metre
type: Class
subclass of: https://w3id.org/euph/8127
subclass of: Restriction
  on property: is unit of
  some values from: magnetic field strength
IAO_0000115: The physical quantity magnetic field strength, epresssed in the derived unit ampere per metre
IAO_0000117: Michael Rubinigg
IAO_0000118: Ampere pro Meter @de
IAO_0000118: ampere per metre
id: EUPH:634

Axiom
annotated source: ampere per metre
annotated property: IAO_0000115
annotated target: The physical quantity magnetic field strength, epresssed in the derived unit ampere per metre
source: https://www.bipm.org/en/publications/si-brochure

pascal second
type: Class
subclass of: https://w3id.org/euph/8128
subclass of: Restriction
  on property: is unit of
  some values from: dynamic viscosity
IAO_0000115: The physical quantity dynamic viscosity, expressed in the derived unit pascal second
IAO_0000117: Michael Rubinigg
IAO_0000118: Pascalsekunde @de
IAO_0000118: pascal second
id: EUPH:635

Axiom
annotated source: pascal second
annotated property: IAO_0000115
annotated target: The physical quantity dynamic viscosity, expressed in the derived unit pascal second
source: https://www.bipm.org/en/publications/si-brochure

newton metre
type: Class
subclass of: https://w3id.org/euph/8128
subclass of: Restriction
  on property: is unit of
  some values from: moment of force
IAO_0000115: The physical quantity moment of force, expressed in the derived unit newton metre.
IAO_0000117: Michael Rubinigg
IAO_0000118: Newton Meter @de
IAO_0000118: newton metre
id: EUPH:636

Axiom
annotated source: newton metre
annotated property: IAO_0000115
annotated target: The physical quantity moment of force, expressed in the derived unit newton metre.
source: https://www.bipm.org/en/publications/si-brochure

newton per metre
type: Class
subclass of: https://w3id.org/euph/8128
subclass of: Restriction
  on property: is unit of
  some values from: surface tension
IAO_0000115: The physical quantity surface tension, expressed in the derived unit newton per metre
IAO_0000117: Michael Rubinigg
IAO_0000118: Newton pro Meter @de
IAO_0000118: newton per metre
id: EUPH:637

Axiom
annotated source: newton per metre
annotated property: IAO_0000115
annotated target: The physical quantity surface tension, expressed in the derived unit newton per metre
source: https://www.bipm.org/en/publications/si-brochure

radian per second
type: Class
subclass of: https://w3id.org/euph/8128
subclass of: Restriction
  on property: is unit of
  some values from: angular velocity
IAO_0000115: The physical quantity angular velocity or angular frequency, expressed in the derived unit radian per second.
IAO_0000117: Michael Rubinigg
IAO_0000118: Radiant pro Sekunde @de
IAO_0000118: radian per second
id: EUPH:638

Axiom
annotated source: radian per second
annotated property: IAO_0000115
annotated target: The physical quantity angular velocity or angular frequency, expressed in the derived unit radian per second.
source: https://www.bipm.org/en/publications/si-brochure

radian per second squared
type: Class
subclass of: https://w3id.org/euph/8128
subclass of: Restriction
  on property: is unit of
  some values from: angular acceleration
IAO_0000115: The physical quantity angular acceleration, expressed in the derived unit radian per second squared.
IAO_0000117: Michael Rubinigg
IAO_0000118: Radiant pro Sekunde zum Quadrat @de
IAO_0000118: radian per second squared
id: EUPH:639

Axiom
annotated source: radian per second squared
annotated property: IAO_0000115
annotated target: The physical quantity angular acceleration, expressed in the derived unit radian per second squared.
source: https://www.bipm.org/en/publications/si-brochure

nucleus colony
type: Class
subclass of: honey bee colony
IAO_0000115: A colony of bees made by colony division; used to make colonies, as support (resource) hives and in queen rearing (maating nuc).
IAO_0000117: Michael Rubinigg
IAO_0000118: Ableger @de
IAO_0000118: aflegger @nl
IAO_0000118: aflægger @da
IAO_0000118: avlegger @no
IAO_0000118: avläggare @sv
IAO_0000118: colónia diminuta @pt
IAO_0000118: colónia núcleo @pt
IAO_0000118: essaim sur cadre @fr
IAO_0000118: kernvolkje @nl
IAO_0000118: nuc
IAO_0000118: nucleo @it
IAO_0000118: nucleu @ro
IAO_0000118: nucleus colony
IAO_0000118: nuclé @fr
IAO_0000118: nucléus @fr
IAO_0000118: núcleo @es
id: EUPH:64

Axiom
annotated source: nucleus colony
annotated property: IAO_0000115
annotated target: A colony of bees made by colony division; used to make colonies, as support (resource) hives and in queen rearing (maating nuc).
has db xref: ISBN:1-878075-65-4

joule per kelvin
type: Class
subclass of: heat capacity
subclass of: https://w3id.org/euph/8128
subclass of: Restriction
  on property: is unit of
  some values from: heat capacity
IAO_0000115: The physical quantity heat capacity or entropy, expressed in the derived unit joule per kelvin.
IAO_0000117: Michael Rubinigg
IAO_0000118: Joule pro Kelvin @de
IAO_0000118: joule per kelvin
id: EUPH:640

Axiom
annotated source: joule per kelvin
annotated property: IAO_0000115
annotated target: The physical quantity heat capacity or entropy, expressed in the derived unit joule per kelvin.
source: https://www.bipm.org/en/publications/si-brochure

joule per kilogram pro kelvin
type: Class
subclass of: https://w3id.org/euph/8128
subclass of: Restriction
  on property: is unit of
  some values from: specific heat capacity
IAO_0000115: The physical quantity specific heat capacity or specific entropy, expressed in the derived unit joule per kilogram kelvin.
IAO_0000117: Michael Rubinigg
IAO_0000118: Joule pro Kilogramm pro Kelwin @de
IAO_0000118: joule per kilogram pro kelvin
id: EUPH:641

Axiom
annotated source: joule per kilogram pro kelvin
annotated property: IAO_0000115
annotated target: The physical quantity specific heat capacity or specific entropy, expressed in the derived unit joule per kilogram kelvin.
source: https://www.bipm.org/en/publications/si-brochure

joule per kilogram
type: Class
subclass of: https://w3id.org/euph/8128
subclass of: Restriction
  on property: is unit of
  some values from: specific energy
IAO_0000115: The physical quantity specific energy, expressed in the derived unit joule per kilogram.
IAO_0000117: Michael Rubinigg
IAO_0000118: Joule pro Kilogramm @de
IAO_0000118: joule per kilogram
id: EUPH:642

Axiom
annotated source: joule per kilogram
annotated property: IAO_0000115
annotated target: The physical quantity specific energy, expressed in the derived unit joule per kilogram.
source: https://www.bipm.org/en/publications/si-brochure

chestnut honey
type: Class
subclass of: unifloral honey
subclass of: https://w3id.org/euph/75
subclass of: Restriction
  on property: derives from part of
  some values from: https://www.gbif.org/species/2073990
subclass of: Restriction
  on property: derives from part of
  some values from: https://www.gbif.org/species/5333294
subclass of: Restriction
  on property: derives from part of
  some values from: https://www.gbif.org/species/7878868
IAO_0000115: Chestnut honey is a unifloral honey as well as honeydew honey deriving mainly from nectar produced by Castanea sativa and honeydew produced by ectoparasites of Castanea sativa.
IAO_0000117: Michael Rubinigg
IAO_0000118: Kastanienhonig @de
IAO_0000118: chestnut honey
id: EUPH:6422

watt per metre per kelvin
type: Class
subclass of: https://w3id.org/euph/8128
subclass of: Restriction
  on property: is unit of
  some values from: thermal conductivity
IAO_0000115: The physical quantity thermal conductivity, expressed in the derived unit watt per metre kelvin
IAO_0000117: Michael Rubinigg
IAO_0000118: Watt pro Meter pro Kelwin @de
IAO_0000118: watt per metre per kelvin
id: EUPH:643

Axiom
annotated source: watt per metre per kelvin
annotated property: IAO_0000115
annotated target: The physical quantity thermal conductivity, expressed in the derived unit watt per metre kelvin
source: https://www.bipm.org/en/publications/si-brochure

joule per cubic metre
type: Class
subclass of: https://w3id.org/euph/8128
subclass of: Restriction
  on property: is unit of
  some values from: energy density
IAO_0000115: The physical quantity energy density, expressed in the derived unit joule per cubic metre.
IAO_0000117: Michael Rubinigg
IAO_0000118: Joule pro Kubikmeter @de
IAO_0000118: joule per cubic metre
id: EUPH:644

Axiom
annotated source: joule per cubic metre
annotated property: IAO_0000115
annotated target: The physical quantity energy density, expressed in the derived unit joule per cubic metre.
source: https://www.bipm.org/en/publications/si-brochure

Austrian regional law
type: Class
subclass of: Austrian law
IAO_0000115: An Austrian regional law is an Austrian law enacted by the parliament of one of the Austrian federal states in accordance with the procedure laid down in the constitution of the federal state.
IAO_0000117: Michael Rubinigg
IAO_0000118: Austrian regional law
IAO_0000118: Österreichisches Landesrecht @de
id: EUPH:6440

volt per metre
type: Class
subclass of: https://w3id.org/euph/8128
subclass of: Restriction
  on property: is unit of
  some values from: electric field strength
IAO_0000115: The physical quantity electric field strength, expressed in the derived unit volt per metre
IAO_0000117: Michael Rubinigg
IAO_0000118: Volt pro Meter @de
IAO_0000118: volt per metre
id: EUPH:645

Axiom
annotated source: volt per metre
annotated property: IAO_0000115
annotated target: The physical quantity electric field strength, expressed in the derived unit volt per metre
source: https://www.bipm.org/en/publications/si-brochure

coulomb per cubic metre
type: Class
subclass of: https://w3id.org/euph/8128
subclass of: Restriction
  on property: is unit of
  some values from: electric charge density
IAO_0000115: The physical quantity electric charge density, expressed in the derived unit coulomb per cubic metre
IAO_0000117: Michael Rubinigg
IAO_0000118: Coulomb pro Kubikmeter @de
IAO_0000118: coulomb per cubic metre
id: EUPH:646

Axiom
annotated source: coulomb per cubic metre
annotated property: IAO_0000115
annotated target: The physical quantity electric charge density, expressed in the derived unit coulomb per cubic metre
source: https://www.bipm.org/en/publications/si-brochure

coulomb per square metre
type: Class
subclass of: https://w3id.org/euph/8128
subclass of: Restriction
  on property: is unit of
  some values from: surface charge density
subclass of: Restriction
  on property: is unit of
  some values from: electric flux density
IAO_0000115: The physical quantity surface charge density, expressed in the derived unit coulomb per square metre
IAO_0000117: Michael Rubinigg
IAO_0000118: Coulomb pro Quadratemeter @de
IAO_0000118: coulomb per square metre
id: EUPH:647

Axiom
annotated source: coulomb per square metre
annotated property: IAO_0000115
annotated target: The physical quantity surface charge density, expressed in the derived unit coulomb per square metre
source: https://www.bipm.org/en/publications/si-brochure

farad per metre
type: Class
subclass of: https://w3id.org/euph/8128
subclass of: Restriction
  on property: is unit of
  some values from: permittivity
IAO_0000115: The physical quantity permittivity, expressed in the derived unit farad per metre.
IAO_0000117: Michael Rubinigg
IAO_0000118: Farad pro Meter @de
IAO_0000118: farad per metre
id: EUPH:648

Axiom
annotated source: farad per metre
annotated property: IAO_0000115
annotated target: The physical quantity permittivity, expressed in the derived unit farad per metre.
source: https://www.bipm.org/en/publications/si-brochure

insect ryanodine receptor
type: Class
subclass of: ryanodine receptor
subclass of: Restriction
  on property: located in
  some values from: nervous system
subclass of: Restriction
  on property: located in
  some values from: muscle tissue
IAO_0000115: An insect ryanodine receptor is a ryanodine receptor which occurs in insects. It is located in muscle tissue and the nervous system.
IAO_0000117: Michael Rubinigg
IAO_0000118: insect ryanodine receptor
id: EUPH:6480

Axiom
annotated source: insect ryanodine receptor
annotated property: IAO_0000115
annotated target: An insect ryanodine receptor is a ryanodine receptor which occurs in insects. It is located in muscle tissue and the nervous system.
has db xref: 10.1007/s10158-008-0076-4

generically dependent continuant in information science
type: Class
subclass of: continuant in information science
IAO_0000115: A generically dependent continuant in information science is an continuant in information science that generically depends on one or more other entities.
IAO_0000117: Michael Rubinigg
IAO_0000118: generically dependent continuant in information science
id: EUPH:6484

Axiom
annotated source: generically dependent continuant in information science
annotated property: IAO_0000115
annotated target: A generically dependent continuant in information science is an continuant in information science that generically depends on one or more other entities.
source: http://purl.obolibrary.org/obo/BFO_0000031

henry per metre
type: Class
subclass of: https://w3id.org/euph/8128
subclass of: Restriction
  on property: is unit of
  some values from: permeability
IAO_0000115: The physical quantity permeability, expressed in the derived unit henry per metre
IAO_0000117: Michael Rubinigg
IAO_0000118: Henry pro Meter @de
IAO_0000118: henry per metre
id: EUPH:649

Axiom
annotated source: henry per metre
annotated property: IAO_0000115
annotated target: The physical quantity permeability, expressed in the derived unit henry per metre
source: https://www.bipm.org/en/publications/si-brochure

nuc box
type: Class
subclass of: https://w3id.org/euph/8
subclass of: Restriction
  on property: location of
  some values from: nucleus colony
IAO_0000115: A nuc box is a container provided by a beekeeper within which a nucleus colony can build its nest.
IAO_0000117: Michael Rubinigg
IAO_0000118: Ablegerkasten @de
IAO_0000118: afleggerkast @nl
IAO_0000118: arnia a sei favi @it
IAO_0000118: arnietta per nucleo @it
IAO_0000118: avleggerkube @no
IAO_0000118: avläggarkupa @sv
IAO_0000118: colmeia núcleo @pt
IAO_0000118: colmenita núcleo @es
IAO_0000118: formeringsstade @da
IAO_0000118: kweekkast @nl
IAO_0000118: liten parekube @no
IAO_0000118: miniatyrkube @no
IAO_0000118: nuc box
IAO_0000118: nucleu @ro
IAO_0000118: nucleus box
IAO_0000118: nucleus hive
IAO_0000118: núcleo @pt
IAO_0000118: ruchette @fr
IAO_0000118: ruchette à nucléus @fr
IAO_0000118: småstade @da
id: EUPH:65

joule per mole
type: Class
subclass of: https://w3id.org/euph/8128
subclass of: Restriction
  on property: is unit of
  some values from: molar energy
IAO_0000115: The physical quantity molar energy, expressed in the derived unit joule per mole
IAO_0000117: Michael Rubinigg
IAO_0000118: Joule pro Mol @de
IAO_0000118: joule per mole
id: EUPH:650

Axiom
annotated source: joule per mole
annotated property: IAO_0000115
annotated target: The physical quantity molar energy, expressed in the derived unit joule per mole
source: https://www.bipm.org/en/publications/si-brochure

joule per mole per kelvin
type: Class
subclass of: https://w3id.org/euph/8128
subclass of: Restriction
  on property: is unit of
  some values from: molar entropy
IAO_0000115: The physical quantity molar entropy or molar heat capacity, expressed in the derived unit joule per mole kelvin
IAO_0000117: Michael Rubinigg
IAO_0000118: Joule pro Mol pro Kelvin @de
IAO_0000118: joule per mole per kelvin
id: EUPH:651

Axiom
annotated source: joule per mole per kelvin
annotated property: IAO_0000115
annotated target: The physical quantity molar entropy or molar heat capacity, expressed in the derived unit joule per mole kelvin
source: https://www.bipm.org/en/publications/si-brochure

coulomb per kilogram
type: Class
subclass of: https://w3id.org/euph/8128
subclass of: Restriction
  on property: is unit of
  some values from: exposure (x- and gamma-rays)
IAO_0000115: The physical quantity exposure (x- and γ-rays), expressed in the derived unit coulomb per kilogram
IAO_0000117: Michael Rubinigg
IAO_0000118: Coulomb pro Kilogramm @de
IAO_0000118: coulomb per kilogram
id: EUPH:652

Axiom
annotated source: coulomb per kilogram
annotated property: IAO_0000115
annotated target: The physical quantity exposure (x- and γ-rays), expressed in the derived unit coulomb per kilogram
source: https://www.bipm.org/en/publications/si-brochure

gray per second
type: Class
subclass of: https://w3id.org/euph/8128
subclass of: Restriction
  on property: is unit of
  some values from: absorbed dose rate
IAO_0000115: The physical quantity absorbed dose rate, expressed in the derived unit gray per second
IAO_0000117: Michael Rubinigg
IAO_0000118: Gray pro Sekunde @de
IAO_0000118: gray per second
id: EUPH:653

Axiom
annotated source: gray per second
annotated property: IAO_0000115
annotated target: The physical quantity absorbed dose rate, expressed in the derived unit gray per second
source: https://www.bipm.org/en/publications/si-brochure

robinia honey
type: Class
subclass of: unifloral honey
subclass of: Restriction
  on property: derives from part of
  some values from: https://www.gbif.org/species/5352251
IAO_0000115: Robinia honey is a unifloral honey deriving mainly from nectar produced by Robinia pseudoacacia.
IAO_0000117: Michael Rubinigg
IAO_0000118: Akazienhonig @de
IAO_0000118: acacia honey
IAO_0000118: miele d'acacia @it
IAO_0000118: robinia honey
id: EUPH:6534

watt per steradian
type: Class
subclass of: https://w3id.org/euph/8128
subclass of: Restriction
  on property: is unit of
  some values from: radiant intensity
IAO_0000115: The physical quantity radiant intensity, expressed in the derived unit watt per steradian.
IAO_0000117: Michael Rubinigg
IAO_0000118: Watt pro Steradiant @de
IAO_0000118: watt per steradian
id: EUPH:654

Axiom
annotated source: watt per steradian
annotated property: IAO_0000115
annotated target: The physical quantity radiant intensity, expressed in the derived unit watt per steradian.
source: https://www.bipm.org/en/publications/si-brochure

watt per square metre per steradian
type: Class
subclass of: https://w3id.org/euph/8128
subclass of: Restriction
  on property: is unit of
  some values from: radiance
IAO_0000115: The physical quantity radiance, expressed in the derived unit watt per square metre steradian
IAO_0000117: Michael Rubinigg
IAO_0000118: Watt pro Quadratmeter pro Steridian @de
IAO_0000118: watt per square metre per steradian
id: EUPH:655

Axiom
annotated source: watt per square metre per steradian
annotated property: IAO_0000115
annotated target: The physical quantity radiance, expressed in the derived unit watt per square metre steradian
source: https://www.bipm.org/en/publications/si-brochure

katal per cubic metre
type: Class
subclass of: https://w3id.org/euph/8128
subclass of: Restriction
  on property: is unit of
  some values from: catalytic activity concentration
IAO_0000115: The physical quantity catalytic activity concentration, expressed in the derived unit katal per cubic metre.
IAO_0000117: Michael Rubinigg
IAO_0000118: Katal pro Kubikmeter @de
IAO_0000118: katal per cubic metre
id: EUPH:656

Axiom
annotated source: katal per cubic metre
annotated property: IAO_0000115
annotated target: The physical quantity catalytic activity concentration, expressed in the derived unit katal per cubic metre.
source: https://www.bipm.org/en/publications/si-brochure

astronomical unit
type: Class
subclass of: https://w3id.org/euph/8129
subclass of: Restriction
  on property: is unit of
  some values from: length
IAO_0000115: The physical quantity length, expressed by the accepted non-SI unit astronomical unit
IAO_0000117: Michael Rubinigg
IAO_0000118: Astronomische Einheit @de
IAO_0000118: astronomical unit
id: EUPH:657

Axiom
annotated source: astronomical unit
annotated property: IAO_0000115
annotated target: The physical quantity length, expressed by the accepted non-SI unit astronomical unit
source: https://www.bipm.org/en/publications/si-brochure

neper
type: Class
subclass of: https://w3id.org/euph/8129
subclass of: Restriction
  on property: is unit of
  some values from: logarithmic ratio quantities
IAO_0000115: The physical quantity logarithmic ratio quantities, expressed by the accepted non-SI unit neper
IAO_0000117: Michael Rubinigg
IAO_0000118: Neper @de
IAO_0000118: neper
id: EUPH:659

Axiom
annotated source: neper
annotated property: IAO_0000115
annotated target: The physical quantity logarithmic ratio quantities, expressed by the accepted non-SI unit neper
source: https://www.bipm.org/en/publications/si-brochure

parasite
type: Class
subclass of: https://w3id.org/euph/97
IAO_0000115: A parasite is an organism that lives in or on another organism, referred to as host, and that takes its nourishment from that other organism.
IAO_0000117: Michael Rubinigg
IAO_0000118: Parasit @de
IAO_0000118: Schmarotzer @de
IAO_0000118: parasiet @nl
IAO_0000118: parasit @da
IAO_0000118: parasita @pt
IAO_0000118: parasite
IAO_0000118: parassita @it
IAO_0000118: parazit @ro
IAO_0000118: parásito @es
IAO_0000118: snylter @no
id: EUPH:66

bel
type: Class
subclass of: https://w3id.org/euph/8129
subclass of: Restriction
  on property: is unit of
  some values from: logarithmic ratio quantities
IAO_0000115: The physical quantity logarithmic ratio quantities, expressed by the accepted non-SI unit bel
IAO_0000117: Michael Rubinigg
IAO_0000118: Bel @de
IAO_0000118: bel
id: EUPH:660

Axiom
annotated source: bel
annotated property: IAO_0000115
annotated target: The physical quantity logarithmic ratio quantities, expressed by the accepted non-SI unit bel
source: https://www.bipm.org/en/publications/si-brochure

honeydew producer
type: Class
subclass of: extrinsic role in beekeeping
subclass of: Restriction
  on property: role of
  some values from: https://www.gbif.org/species/809
subclass of: Restriction
  on property: produces
  some values from: honeydew
IAO_0000115: A honeydew producer is an insect parasite belonging to the taxonomic order Hemiptera that secretes a sugar-rich sticky liquid, referred to as honeydew in beekeeping, as it feeds on plant phloem sap.
IAO_0000117: Michael Rubinigg
IAO_0000118: Honigtauerzeuger @de
IAO_0000118: honeydew producer
id: EUPH:6600

duration
type: Class
subclass of: time
IAO_0000115: non-negative quantity of time equal to the difference between the final and initial instants [...] of a time interval [...]
IAO_0000117: Michael Rubinigg
IAO_0000118: duration
id: EUPH:6615

Axiom
annotated source: duration
annotated property: IAO_0000115
annotated target: non-negative quantity of time equal to the difference between the final and initial instants [...] of a time interval [...]
source: https://www.iso.org/standard/70907.html

entity in information science
type: Class
subclass of: technology
IAO_0000115: An entity in information scienceis an information resource in the technology domain that contains all classes relevant to pollinators and pollination studied in information science, i.e. the [...] sciences concerned with gathering and manipulating and storing and retrieving and classifying recorded information.
IAO_0000117: Michael Rubinigg
IAO_0000118: Entität in der Informationswissenschaft @de
IAO_0000118: entiteit in de informatiekunde @nl
IAO_0000118: entity in information science
IAO_0000118: entità nella scienza dell'informazione @it
IAO_0000118: entité en sciences de l'information @fr
id: EUPH:6633

Axiom
annotated source: entity in information science
annotated property: IAO_0000115
annotated target: An entity in information scienceis an information resource in the technology domain that contains all classes relevant to pollinators and pollination studied in information science, i.e. the [...] sciences concerned with gathering and manipulating and storing and retrieving and classifying recorded information.
source: http://purl.obolibrary.org/obo/BFO_0000001

specifically dependent continuant in information science
type: Class
subclass of: continuant in information science
IAO_0000115: specifically dependent continuant in information science is an continuant in information science that specifically and continuously depends on an independent information resource (any material or immaterial entity) that is not a spatial region.
IAO_0000117: Michael Rubinigg
IAO_0000118: specifically dependent continuant in information science
id: EUPH:6634

Axiom
annotated source: specifically dependent continuant in information science
annotated property: IAO_0000115
annotated target: specifically dependent continuant in information science is an continuant in information science that specifically and continuously depends on an independent information resource (any material or immaterial entity) that is not a spatial region.
source: http://purl.obolibrary.org/obo/BFO_0000020

aggressive
type: Class
subclass of: phenotype of defensive behaviour
IAO_0000115: Aggressive is the most negative phenotype of the behavioral trait defensive behavior, usually receiving the score 1.
IAO_0000117: Michael Rubinigg
IAO_0000118: aggressive
IAO_0000118: agresiva @es
IAO_0000118: agresivne @sl
IAO_0000118: agresivne, bodu @hr
IAO_0000118: agressief @nl
IAO_0000118: agressif @fr
IAO_0000118: agressiva @pt
IAO_0000118: agresyvios @lt
IAO_0000118: agresywne @pl
IAO_0000118: agresívne @sk
IAO_0000118: saldırgan @tr
IAO_0000118: stechlustig @de
IAO_0000118: επιθετική @el
IAO_0000118: агресивне, убадају @sr
IAO_0000118: агресивни @mk
IAO_0000118: אגרסיבי @he
IAO_0000118: 有攻击性 @zh
id: EUPH:665

Axiom
annotated source: aggressive
annotated property: IAO_0000115
annotated target: Aggressive is the most negative phenotype of the behavioral trait defensive behavior, usually receiving the score 1.
has db xref: 10.1080/00218839.2023.2295180
has db xref: ISBN:978-3-9817984-0-1

specifically dependent continuant in pharmacology
type: Class
subclass of: continuant in pharmacology
IAO_0000115: A specifically dependent continuant in pharmacology is a continuant entity in the pharmacology domain that does not exist on its own, but requires a specific single entity in any other domain to exist.
IAO_0000117: Michael Rubinigg
IAO_0000118: specifically dependent continuant in pharmacology
id: EUPH:6658

Axiom
annotated source: specifically dependent continuant in pharmacology
annotated property: IAO_0000115
annotated target: A specifically dependent continuant in pharmacology is a continuant entity in the pharmacology domain that does not exist on its own, but requires a specific single entity in any other domain to exist.
source: http://purl.obolibrary.org/obo/BFO_0000020

clustering outside entrance
type: Class
subclass of: clustering behavior
IAO_0000115: Clustering outside the hive entrance is a clustering behavior exhibited by honey bee colonies in hot weather and which serves to regulate the temperature of the beehive.
IAO_0000117: Michael Rubinigg
IAO_0000118: (a face) barbă la urdiniș @ro
IAO_0000118: Bart machen @de
IAO_0000118: at pose sig @da
IAO_0000118: att klasa sig @sv
IAO_0000118: baard vormen @nl
IAO_0000118: clustering outside entrance
IAO_0000118: faire la barbe @fr
IAO_0000118: fare la barba @it
IAO_0000118: fazer a barba @pt
IAO_0000118: fazer cacho de entrada @pt
IAO_0000118: hacer la barba @es
IAO_0000118: å klase sig @no
id: EUPH:671

strong swarming tendency
type: Class
subclass of: phenotype of swarming behaviour
IAO_0000115: Strong swarming tendency is usually the less desirable phenotype of the behavioral trait swarming behaviour, usually receiving the score 1.
IAO_0000117: Michael Rubinigg
IAO_0000118: forte tendance à l’essaimage @fr
IAO_0000118: forte tendência de enxameação @pt
IAO_0000118: fuerte tendencia @es
IAO_0000118: güçlü oğul eğilimi @tr
IAO_0000118: jak nagon za rojenje @hr
IAO_0000118: levata @it
IAO_0000118: močan rojilni nagon @sl
IAO_0000118: silna tendencja do rójki @pl
IAO_0000118: silný sklon k rojeniu @sk
IAO_0000118: starker Schwarmtrieb @de
IAO_0000118: sterk svermetrang @no
IAO_0000118: sterke zwermneiging @nl
IAO_0000118: strong swarming tendency
IAO_0000118: tendinta de roire excesiva @ro
IAO_0000118: ypatingai spietlios @lt
IAO_0000118: μεγάλη τάση για σμηνουργία @el
IAO_0000118: силен нагон за роење @mk
IAO_0000118: јак нагон за ројењем @sr
IAO_0000118: נטיעה חזקה להתנחלות @he
IAO_0000118: 强烈的分蜂性 @zh
id: EUPH:673

Axiom
annotated source: strong swarming tendency
annotated property: IAO_0000115
annotated target: Strong swarming tendency is usually the less desirable phenotype of the behavioral trait swarming behaviour, usually receiving the score 1.
has db xref: 10.1080/00218839.2023.2295180
has db xref: ISBN:978-3-9817984-0-1

calm and static
type: Class
subclass of: phenotype of calmness
IAO_0000115: Calm and static is the most positive phenotype of the behavioral trait calmness, usually receiving the score 4.
IAO_0000117: Michael Rubinigg
IAO_0000118: abelhas calmas e estáticas @pt
IAO_0000118: calm and static
IAO_0000118: calme @it
IAO_0000118: calmes et statiques @fr
IAO_0000118: estática, en calma @es
IAO_0000118: kalm en statisch @nl
IAO_0000118: mirne, ne kreću se @hr
IAO_0000118: na satu so mirne in se ne premikajo @sl
IAO_0000118: pomalé pohyby @sk
IAO_0000118: raman in aceeasi stare @ro
IAO_0000118: rolige på tavlene @no
IAO_0000118: ruhig und ortstreu @de
IAO_0000118: sakin ve durağan @tr
IAO_0000118: spokojne na plastrach @pl
IAO_0000118: statiche @it
IAO_0000118: tupi ant korio, ramiai vaikšto @lt
IAO_0000118: ήρεμες και στατικές @el
IAO_0000118: мирне и статичне на раму @sr
IAO_0000118: мирни, не се движат @mk
IAO_0000118: רגועים ולא זזים @he
IAO_0000118: 镇静，静止 @zh
id: EUPH:675

Axiom
annotated source: calm and static
annotated property: IAO_0000115
annotated target: Calm and static is the most positive phenotype of the behavioral trait calmness, usually receiving the score 4.
has db xref: 10.1080/00218839.2023.2295180
has db xref: ISBN:978-3-9817984-0-1

date and time expression
type: Class
subclass of: https://w3id.org/euph/864
IAO_0000115: expression indicating a time [...], time interval [...] or recurring time interval [...] EXAMPLE: ‘2018-08-01’ is a date and time expression that indicates the first day of August of 2018 in the Gregorian calendar (3.1.1.19).
IAO_0000117: Michael Rubinigg
IAO_0000118: date and time expression
id: EUPH:676

Axiom
annotated source: date and time expression
annotated property: IAO_0000115
annotated target: expression indicating a time [...], time interval [...] or recurring time interval [...] EXAMPLE: ‘2018-08-01’ is a date and time expression that indicates the first day of August of 2018 in the Gregorian calendar (3.1.1.19).
source: https://www.iso.org/standard/70907.html

Austrian national law
type: Class
subclass of: Austrian law
IAO_0000115: An Austrian national law is an Austrian law enacted by the Austrian parliament in accordance with the procedure laid down in the Austrian Federal Constitution.
IAO_0000117: Michael Rubinigg
IAO_0000118: Austrian national law
IAO_0000118: Österreichisches Bundesrecht @de
id: EUPH:6788

bald brood
type: Class
subclass of: symptom on brood
IAO_0000115: Single cells or patches of honey bee brood with uncapped cells that expose the heads of live, apparently normal pupae. This condition usually occurs when lesser wax moth larvae perforate the outer cell walls and the wax cappings; worker bees then chew away the remainder of the cell caps, thereby exposing the developing pupae.
IAO_0000117: Michael Rubinigg
IAO_0000118: Röhrchenbrut @de
IAO_0000118: Röhrenbrut @de
IAO_0000118: bald brood
IAO_0000118: bald-headed brood
IAO_0000118: barhodet yngel @no
IAO_0000118: barhuvat yngel @sv
IAO_0000118: broed met verhoogde celranden @nl
IAO_0000118: buisbroed @nl
IAO_0000118: couvain chauve @fr
IAO_0000118: couvain tubuleux @fr
IAO_0000118: covata pelata @it
IAO_0000118: covata tubolare @it
IAO_0000118: cria tubulosa @pt
IAO_0000118: criação calva @pt
IAO_0000118: cría tubulosa @es
IAO_0000118: pollo tubuloso @es
IAO_0000118: puiet tubular @ro
IAO_0000118: røryngel @da
id: EUPH:68

Axiom
annotated source: bald brood
annotated property: IAO_0000115
annotated target: Single cells or patches of honey bee brood with uncapped cells that expose the heads of live, apparently normal pupae. This condition usually occurs when lesser wax moth larvae perforate the outer cell walls and the wax cappings; worker bees then chew away the remainder of the cell caps, thereby exposing the developing pupae.
has db xref: ISBN:0-936028-10-6

other pesticide
type: Class
subclass of: pesticide
IAO_0000115: A substance that is a pesticide, but is not part of any of its subclasses.
IAO_0000117: Michael Rubinigg
IAO_0000118: anderes Pestizid @de
IAO_0000118: other pesticide
id: EUPH:685

fungicide
type: Class
subclass of: pesticide
subclass of: Restriction
  on property: results in ending of
  some values from: fungal parasite
IAO_0000115: A substance used to destroy fungal pests.
IAO_0000117: Michael Rubinigg
IAO_0000118: Fungizid @de
IAO_0000118: fongicide @fr
IAO_0000118: fungicid @da
IAO_0000118: fungicida @es
IAO_0000118: fungicide
IAO_0000118: pilztötendes Mittel @de
IAO_0000118: soppdrepende middel @no
IAO_0000118: svampdödande medel @sv
IAO_0000118: svampemiddel @da
id: EUPH:686

Axiom
annotated source: fungicide
annotated property: IAO_0000115
annotated target: A substance used to destroy fungal pests.
source: https://www.ebi.ac.uk/chebi/init.do

contributor
type: Class
subclass of: https://w3id.org/euph/757
IAO_0000115: A creator that has made a minor contribution to a content.
IAO_0000117: Michael Rubinigg
IAO_0000118: contributor
id: EUPH:687

collecting
type: Class
subclass of: bee behavior
IAO_0000115: Collecting is a behaviour of bees that serves to obtain food for the brood or for the adults (for immediate consumption or for storage as a reserve) or to obtain nesting material (e.g. plant tissue, clay, small stones) or material for disinfecting the nest (e.g. propolis).
IAO_0000117: Michael Rubinigg
IAO_0000118: a culege @ro
IAO_0000118: at bære ind @da
IAO_0000118: at samle @da
IAO_0000118: att insamla @sv
IAO_0000118: colectar @pt
IAO_0000118: coletar @pt
IAO_0000118: collecting
IAO_0000118: cosechar @es
IAO_0000118: einbringen @de
IAO_0000118: eintragen @de
IAO_0000118: forragear @pt
IAO_0000118: halen @nl
IAO_0000118: raccogliere @it
IAO_0000118: ramasser @fr
IAO_0000118: recolher @pt
IAO_0000118: récolter @fr
IAO_0000118: sammeln @de
IAO_0000118: to collect
IAO_0000118: to gather
IAO_0000118: verzamelen @nl
IAO_0000118: å sample @no
id: EUPH:688

bee behavior
type: Class
subclass of: taxon-typical behavior
IAO_0000115: Bee behavior is a taxon-typical behavior of individuals or social groups of bees.
IAO_0000117: Michael Rubinigg
IAO_0000118: Verhalten der Biene @de
IAO_0000118: bee behavior
id: EUPH:689

(1S)-cis-(alphaS)-cypermethrin
type: Class
subclass of: diastereoisomeric mixture
subclass of: Restriction
  on property: part of
  some values from: beta-cypermethrin
IAO_0000115: (1S)-cis-(alphaS)-cypermethrin is part of the diastereoisomeric mixture referred to as beta-cypermethrin. The chemical substance (1S)-cis-(alphaS)-cypermethrin is described by the following attributes or identifiers: PIN: trans-[(S)-cyano-(3-phenoxyphenyl)methyl] (1S,3S)-3-(2,2-dichloroethenyl)-2,2-dimethylcyclopropane-1-carboxylate Molecular formula: C22H19Cl2NO3 InChI: InChI=1S/C22H19Cl2NO3/c1-22(2)17(12-19(23)24)20(22)21(26)28-18(13-25)14-7-6-10-16(11-14)27-15-8-4-3-5-9-15/h3-12,17-18,20H,1-2H3/t17-,18-,20-/m1/s1 SMILES: CC1(C@ @hc
IAO_0000115: 72204
IAO_0000115: -43
IAO_0000115: -4
IAO_0000115: 276
IAO_0000115: -457
IAO_0000115: -7
IAO_0000117: Michael Rubinigg
IAO_0000118: (1S)-cis-(alphaS)-cypermethrin
id: EUPH:6897
denoted by: 276-457-7
denoted by: 72204-43-4
denoted by: C22H19Cl2NO3
denoted by: CC1(C@ @hc
denoted by: I01_01_15
denoted by: InChI=1S/C22H19Cl2NO3/c1-22(2)17(12-19(23)24)20(22)21(26)28-18(13-25)14-7-6-10-16(11-14)27-15-8-4-3-5-9-15/h3-12,17-18,20H,1-2H3/t17-,18-,20-/m1/s1
denoted by: trans-[(S)-cyano-(3-phenoxyphenyl)methyl] (1S,3S)-3-(2,2-dichloroethenyl)-2,2-dimethylcyclopropane-1-carboxylate

Axiom
annotated source: (1S)-cis-(alphaS)-cypermethrin
annotated property: IAO_0000115
annotated target: (1S)-cis-(alphaS)-cypermethrin is part of the diastereoisomeric mixture referred to as beta-cypermethrin. The chemical substance (1S)-cis-(alphaS)-cypermethrin is described by the following attributes or identifiers: PIN: trans-[(S)-cyano-(3-phenoxyphenyl)methyl] (1S,3S)-3-(2,2-dichloroethenyl)-2,2-dimethylcyclopropane-1-carboxylate Molecular formula: C22H19Cl2NO3 InChI: InChI=1S/C22H19Cl2NO3/c1-22(2)17(12-19(23)24)20(22)21(26)28-18(13-25)14-7-6-10-16(11-14)27-15-8-4-3-5-9-15/h3-12,17-18,20H,1-2H3/t17-,18-,20-/m1/s1 SMILES: CC1(C@ @hc
annotated target: 72204
annotated target: -43
annotated target: -4
annotated target: 276
annotated target: -457
annotated target: -7
source: https://eur-lex.europa.eu/eli/reg/2017/269/oj
source: https://pubchem.ncbi.nlm.nih.gov/compound/189554

Axiom
annotated source: (1S)-cis-(alphaS)-cypermethrin
annotated property: denoted by
annotated target: 276-457-7
has db xref: https://w3id.org/euph/8101

Axiom
annotated source: (1S)-cis-(alphaS)-cypermethrin
annotated property: denoted by
annotated target: 72204-43-4
has db xref: CAS registry number

Axiom
annotated source: (1S)-cis-(alphaS)-cypermethrin
annotated property: denoted by
annotated target: C22H19Cl2NO3
has db xref: molecular formula

Axiom
annotated source: (1S)-cis-(alphaS)-cypermethrin
annotated property: denoted by
annotated target: CC1(C@ @hc
has db xref: simplified molecular input line entry system (SMILES)

Axiom
annotated source: (1S)-cis-(alphaS)-cypermethrin
annotated property: denoted by
annotated target: I01_01_15
has db xref: harmonised classification of substances code

Axiom
annotated source: (1S)-cis-(alphaS)-cypermethrin
annotated property: denoted by
annotated target: InChI=1S/C22H19Cl2NO3/c1-22(2)17(12-19(23)24)20(22)21(26)28-18(13-25)14-7-6-10-16(11-14)27-15-8-4-3-5-9-15/h3-12,17-18,20H,1-2H3/t17-,18-,20-/m1/s1
has db xref: International Chemical Identifier (InChI)

Axiom
annotated source: (1S)-cis-(alphaS)-cypermethrin
annotated property: denoted by
annotated target: trans-[(S)-cyano-(3-phenoxyphenyl)methyl] (1S,3S)-3-(2,2-dichloroethenyl)-2,2-dimethylcyclopropane-1-carboxylate
has db xref: preferred IUPAC name (PIN)

queen cup
type: Class
subclass of: queen cell
IAO_0000115: Empty cup-like beeswax structure where the queen may lay a fertile egg to start rearing another queen.
IAO_0000117: Michael Rubinigg
IAO_0000118: Weiselbecher @de
IAO_0000118: Weiselnäpfchen @de
IAO_0000118: abbozzo @it
IAO_0000118: acorn cup
IAO_0000118: botcă începută @ro
IAO_0000118: célula real embrionária @pt
IAO_0000118: dopje @nl
IAO_0000118: embrião de célula real @pt
IAO_0000118: embryon de cellule @fr
IAO_0000118: esbozo de celda real @es
IAO_0000118: inizio di cella reale @it
IAO_0000118: napje @nl
IAO_0000118: naturlig cellekopp @da
IAO_0000118: potiraș @ro
IAO_0000118: principio de celda real @es
IAO_0000118: queen-cell cup
IAO_0000118: swärmcell @sv
id: EUPH:69

Axiom
annotated source: queen cup
annotated property: IAO_0000115
annotated target: Empty cup-like beeswax structure where the queen may lay a fertile egg to start rearing another queen.
has db xref: ISBN:1-878075-65-4

moderate swarming tendency
type: Class
subclass of: phenotype of swarming behaviour
IAO_0000115: Moderate swarming tendency is usually the second less desirable phenotype of the behavioral trait swarming behaviour, usually receiving the score 2.
IAO_0000117: Michael Rubinigg
IAO_0000118: matige zwermneiging @nl
IAO_0000118: moderada tendência de enxameação @pt
IAO_0000118: moderat svermetrang @no
IAO_0000118: moderate swarming tendency
IAO_0000118: moderater Schwarmtrieb @de
IAO_0000118: oderata @it
IAO_0000118: orta oğul eğilimi @tr
IAO_0000118: stredný sklon k rojeniu @sk
IAO_0000118: tendance modérée à l’essaimage @fr
IAO_0000118: tendencia moderada @es
IAO_0000118: tendinta de roire moderata @ro
IAO_0000118: umiarkowana tendencja @pl
IAO_0000118: umjeren nagon za rojenje @hr
IAO_0000118: vidutinis spietlumas @lt
IAO_0000118: zmeren rojilni nagon @sl
IAO_0000118: μεσαία τάση για σμηνουργία @el
IAO_0000118: умерен нагон за ројењем @sr
IAO_0000118: умерен нагон на роење @mk
IAO_0000118: נטיעה בינונית להתנחלות @he
IAO_0000118: 中度的分蜂性 @zh
id: EUPH:697

Axiom
annotated source: moderate swarming tendency
annotated property: IAO_0000115
annotated target: Moderate swarming tendency is usually the second less desirable phenotype of the behavioral trait swarming behaviour, usually receiving the score 2.
has db xref: 10.1080/00218839.2023.2295180
has db xref: ISBN:978-3-9817984-0-1

colony of the Western honey bee
type: Class
subclass of: honey bee colony
IAO_0000115: A group of honey bees of the species Apis mellifera living together in the same nest.
IAO_0000117: Michael Rubinigg
IAO_0000118: Bienenvolk @de
IAO_0000118: Volk der Westlichen Honigbiene @de
IAO_0000118: colony of the Western Honey Bee
IAO_0000118: honey bee colony
id: EUPH:699

frame
type: Class
subclass of: https://w3id.org/euph/8163
subclass of: Restriction
  on property: part of
  some values from: https://w3id.org/euph/8
IAO_0000115: A frame is an enclosed structure intended to hold drawn comb. Frames are often rectangular structures. They are distinct from top bars which are not enclosed.
IAO_0000117: Michael Rubinigg
IAO_0000118: Rahmen @de
IAO_0000118: Rähmchen @de
IAO_0000118: bastidor @es
IAO_0000118: cadre @fr
IAO_0000118: cuadro @es
IAO_0000118: frame
IAO_0000118: quadro @pt
IAO_0000118: raam @nl
IAO_0000118: raampje @nl
IAO_0000118: ram @sv
IAO_0000118: ramme @da
IAO_0000118: ramă @ro
IAO_0000118: tavleramme @da
IAO_0000118: telaino @it
id: EUPH:7

scattered brood
type: Class
subclass of: symptom on brood
IAO_0000115: Departures from the compact and solid brood pattern generally associated with efficient brood production and populous colonies are frequently encountered in honey bees. Such a condition is referred to as scattered brood, shot brood, pepper brood,or spotty brood. [...] Scattered brood can result from non-pathogenic or pathogenic conditions or from a combination of these.
IAO_0000117: Michael Rubinigg
IAO_0000118: couvain en mosaïque @fr
IAO_0000118: covata a mosaico @it
IAO_0000118: lückenhaftes Brutnest @de
IAO_0000118: onregelmatig verspreide verzegelde broedcellen @nl
IAO_0000118: scattered brood pattern
id: EUPH:71

Axiom
annotated source: scattered brood
annotated property: IAO_0000115
annotated target: Departures from the compact and solid brood pattern generally associated with efficient brood production and populous colonies are frequently encountered in honey bees. Such a condition is referred to as scattered brood, shot brood, pepper brood,or spotty brood. [...] Scattered brood can result from non-pathogenic or pathogenic conditions or from a combination of these.
has db xref: ISBN:0-936028-10-6

number of unspecified items
type: Class
subclass of: number of items
IAO_0000115: Number of items that are not specified.
IAO_0000117: Michael Rubinigg
IAO_0000118: Anzahl nicht spezifizierter Stücke @de
IAO_0000118: number of unspecified items
id: EUPH:712

million heads
type: Class
subclass of: https://w3id.org/euph/998
subclass of: Restriction
  on property: quality of
  some values from: heads
IAO_0000115: The quantity amount, expressed in million heads.
IAO_0000117: Michael Rubinigg
IAO_0000118: Millionen Köpfe @de
IAO_0000118: WIR Euro
id: EUPH:713

number of specified items
type: Class
subclass of: number of items
IAO_0000115: Number of items that are specified.
IAO_0000117: Michael Rubinigg
IAO_0000118: Anzahl der angegebenen Stücke @de
IAO_0000118: number of specified items
id: EUPH:715

(1S)-trans-(alphaS)-cypermethrin
type: Class
subclass of: diastereoisomeric mixture
subclass of: Restriction
  on property: part of
  some values from: beta-cypermethrin
IAO_0000115: (1S)-trans-(alphaS)-cypermethrin is part of the diastereoisomeric mixture referred to as beta-cypermethrin. The chemical substance (1S)-trans-(alphaS)-cypermethrin is described by the following attributes or identifiers: PIN: cis-[(S)-cyano-(3-phenoxyphenyl)methyl] (1S,3R)-3-(2,2-dichloroethenyl)-2,2-dimethylcyclopropane-1-carboxylate Molecular formula: C22H19Cl2NO3 InChI: InChI=1S/C22H19Cl2NO3/c1-22(2)17(12-19(23)24)20(22)21(26)28-18(13-25)14-7-6-10-16(11-14)27-15-8-4-3-5-9-15/h3-12,17-18,20H,1-2H3/t17-,18+,20+/m0/s1 SMILES: CC1(C @hc
IAO_0000115: 83860
IAO_0000115: -31
IAO_0000115: -5
IAO_0000115: 281
IAO_0000115: -086
IAO_0000115: -9
IAO_0000117: Michael Rubinigg
IAO_0000118: (1S)-trans-(alphaS)-cypermethrin
id: EUPH:7182
denoted by: 281-086-9
denoted by: 83860-31-5
denoted by: C22H19Cl2NO3
denoted by: CC1(C @hc
denoted by: I01_01_15
denoted by: InChI=1S/C22H19Cl2NO3/c1-22(2)17(12-19(23)24)20(22)21(26)28-18(13-25)14-7-6-10-16(11-14)27-15-8-4-3-5-9-15/h3-12,17-18,20H,1-2H3/t17-,18+,20+/m0/s1
denoted by: cis-[(S)-cyano-(3-phenoxyphenyl)methyl] (1S,3R)-3-(2,2-dichloroethenyl)-2,2-dimethylcyclopropane-1-carboxylate

Axiom
annotated source: (1S)-trans-(alphaS)-cypermethrin
annotated property: IAO_0000115
annotated target: (1S)-trans-(alphaS)-cypermethrin is part of the diastereoisomeric mixture referred to as beta-cypermethrin. The chemical substance (1S)-trans-(alphaS)-cypermethrin is described by the following attributes or identifiers: PIN: cis-[(S)-cyano-(3-phenoxyphenyl)methyl] (1S,3R)-3-(2,2-dichloroethenyl)-2,2-dimethylcyclopropane-1-carboxylate Molecular formula: C22H19Cl2NO3 InChI: InChI=1S/C22H19Cl2NO3/c1-22(2)17(12-19(23)24)20(22)21(26)28-18(13-25)14-7-6-10-16(11-14)27-15-8-4-3-5-9-15/h3-12,17-18,20H,1-2H3/t17-,18+,20+/m0/s1 SMILES: CC1(C @hc
annotated target: 83860
annotated target: -31
annotated target: -5
annotated target: 281
annotated target: -086
annotated target: -9
source: https://eur-lex.europa.eu/eli/reg/2017/269/oj
source: https://pubchem.ncbi.nlm.nih.gov/compound/16722142

Axiom
annotated source: (1S)-trans-(alphaS)-cypermethrin
annotated property: denoted by
annotated target: 281-086-9
has db xref: https://w3id.org/euph/8101

Axiom
annotated source: (1S)-trans-(alphaS)-cypermethrin
annotated property: denoted by
annotated target: 83860-31-5
has db xref: CAS registry number

Axiom
annotated source: (1S)-trans-(alphaS)-cypermethrin
annotated property: denoted by
annotated target: C22H19Cl2NO3
has db xref: molecular formula

Axiom
annotated source: (1S)-trans-(alphaS)-cypermethrin
annotated property: denoted by
annotated target: CC1(C @hc
has db xref: simplified molecular input line entry system (SMILES)

Axiom
annotated source: (1S)-trans-(alphaS)-cypermethrin
annotated property: denoted by
annotated target: I01_01_15
has db xref: harmonised classification of substances code

Axiom
annotated source: (1S)-trans-(alphaS)-cypermethrin
annotated property: denoted by
annotated target: InChI=1S/C22H19Cl2NO3/c1-22(2)17(12-19(23)24)20(22)21(26)28-18(13-25)14-7-6-10-16(11-14)27-15-8-4-3-5-9-15/h3-12,17-18,20H,1-2H3/t17-,18+,20+/m0/s1
has db xref: International Chemical Identifier (InChI)

Axiom
annotated source: (1S)-trans-(alphaS)-cypermethrin
annotated property: denoted by
annotated target: cis-[(S)-cyano-(3-phenoxyphenyl)methyl] (1S,3R)-3-(2,2-dichloroethenyl)-2,2-dimethylcyclopropane-1-carboxylate
has db xref: preferred IUPAC name (PIN)

nectar
type: Class
subclass of: honey bee forage
subclass of: Restriction
  on property: involved in
  some values from: https://w3id.org/euph/8230
subclass of: Restriction
  on property: produced by
  some values from: nectary
subclass of: Restriction
  on property: has part
  some values from: alpha-amylase
IAO_0000115: Nectar is a honey bee forage that has been defined as follows: A sweet secretion of flowers (from nectaries) of various plants; some secrete enough to provide excess for conversion to honey.
IAO_0000117: Michael Rubinigg
IAO_0000118: Nektar @de
IAO_0000118: nectar
IAO_0000118: nektar @da
IAO_0000118: nettare @it
IAO_0000118: néctar @es
id: EUPH:72

Axiom
annotated source: nectar
annotated property: IAO_0000115
annotated target: Nectar is a honey bee forage that has been defined as follows: A sweet secretion of flowers (from nectaries) of various plants; some secrete enough to provide excess for conversion to honey.
has db xref: ISBN:1-878075-65-4

queen management
type: Class
subclass of: colony management
IAO_0000115: Queen managementis a colony management process specifically carried out on queens.
IAO_0000117: Michael Rubinigg
IAO_0000118: Königinnenmanagement @de
IAO_0000118: queen management
id: EUPH:720

slight swarming tendency
type: Class
subclass of: phenotype of swarming behaviour
IAO_0000115: Slight swarming tendency is usually the second most desirable phenotype of the behavioral trait swarming behaviour, usually receiving the score 3.
IAO_0000117: Michael Rubinigg
IAO_0000118: az oğul eğilimi @tr
IAO_0000118: carsa @it
IAO_0000118: komaj zaznaven rojilni nagon @sl
IAO_0000118: lichte zwermneiging @nl
IAO_0000118: ligeira tendência de enxameação @pt
IAO_0000118: légère tendance à l’essaimage @fr
IAO_0000118: mali nagon za rojenje @hr
IAO_0000118: mažas spietlumas @lt
IAO_0000118: nevýrazný sklon k rojeniu @sk
IAO_0000118: nieznaczna tendencja @pl
IAO_0000118: nur schwacher Schwarmtrieb @de
IAO_0000118: only slight swarming tendency
IAO_0000118: suave tendencia @es
IAO_0000118: svak svermetrang @no
IAO_0000118: usoara tendinta de roire @ro
IAO_0000118: πολύ μικρή τάση για σμηνουργία @el
IAO_0000118: веома мали нагон за ројењем @sr
IAO_0000118: само мал нагон за роење @mk
IAO_0000118: נטיעה קטנה להתנחלות @he
IAO_0000118: 轻微的分蜂性 @zh
id: EUPH:725

Axiom
annotated source: slight swarming tendency
annotated property: IAO_0000115
annotated target: Slight swarming tendency is usually the second most desirable phenotype of the behavioral trait swarming behaviour, usually receiving the score 3.
has db xref: 10.1080/00218839.2023.2295180
has db xref: ISBN:978-3-9817984-0-1

vertical position
type: Class
subclass of: data item in geography
IAO_0000115: A measure of the distance in vertical direction of a location in reference to another location.
IAO_0000117: Michael Rubinigg
IAO_0000118: vertical position
IAO_0000118: vertikale Position @de
id: EUPH:7271

orthometric height
type: Class
subclass of: vertical position
IAO_0000115: The orthometric height is the vertical distance H along the plumb line from a point of interest to a reference surface known as the geoid, the vertical datum that approximates mean sea level. Orthometric height is one of the scientific formalizations of a laypersons' "height above sea level", along with other types of heights in Geodesy.
IAO_0000117: Michael Rubinigg
IAO_0000118: orthometric height
IAO_0000118: orthometrische Höhe @de
id: EUPH:7272

Axiom
annotated source: orthometric height
annotated property: IAO_0000115
annotated target: The orthometric height is the vertical distance H along the plumb line from a point of interest to a reference surface known as the geoid, the vertical datum that approximates mean sea level. Orthometric height is one of the scientific formalizations of a laypersons' "height above sea level", along with other types of heights in Geodesy.
source: https://en.wikipedia.org/w/index.php

height above mean sea level
type: Class
subclass of: orthometric height
IAO_0000115: Height above mean sea level is a measure of the vertical distance (height, elevation or altitude) of a location in reference to a historic mean sea level taken as a vertical datum. In geodesy, it is formalized as orthometric heights.
IAO_0000117: Michael Rubinigg
IAO_0000118: Höhe über dem Meeresspiegel @de
IAO_0000118: height above mean sea level
id: EUPH:7273

Axiom
annotated source: height above mean sea level
annotated property: IAO_0000115
annotated target: Height above mean sea level is a measure of the vertical distance (height, elevation or altitude) of a location in reference to a historic mean sea level taken as a vertical datum. In geodesy, it is formalized as orthometric heights.
source: https://en.wikipedia.org/w/index.php

LAU code
type: Class
subclass of: identifier of geographical enities
subclass of: Restriction
  on property: quality of
  some values from: https://w3id.org/euph/7482
IAO_0000115: To meet the demand for statistics at a local level, Eurostat maintains a system of local administrative units (LAUs) compatible with NUTS. These LAUs are the building blocks of the NUTS, and comprise the municipalities and communes of the European Union. [...] The LAUs are: administrative for reasons such as the availability of data and policy implementation capacity a subdivision of the NUTS 3 regions covering the whole economic territory of the Member States appropriate for the implementation of local level typologies included in Tercet, namely the coastal area and DEGURBA classification. Since there are frequent changes to the LAUs, Eurostat publishes an updated list towards the end of each year. The NUTS regulation makes provision for EU Member States to send the lists of their LAUs to Eurostat. If available, Eurostat receives additionally basic administrative data by means of the annual LAU lists, namely total population and total area for each LAU.
IAO_0000117: Michael Rubinigg
IAO_0000118: LAU code
id: EUPH:7274

Axiom
annotated source: LAU code
annotated property: IAO_0000115
annotated target: To meet the demand for statistics at a local level, Eurostat maintains a system of local administrative units (LAUs) compatible with NUTS. These LAUs are the building blocks of the NUTS, and comprise the municipalities and communes of the European Union. [...] The LAUs are: administrative for reasons such as the availability of data and policy implementation capacity a subdivision of the NUTS 3 regions covering the whole economic territory of the Member States appropriate for the implementation of local level typologies included in Tercet, namely the coastal area and DEGURBA classification. Since there are frequent changes to the LAUs, Eurostat publishes an updated list towards the end of each year. The NUTS regulation makes provision for EU Member States to send the lists of their LAUs to Eurostat. If available, Eurostat receives additionally basic administrative data by means of the annual LAU lists, namely total population and total area for each LAU.
source: https://ec.europa.eu/eurostat/web/nuts/local-administrative-units

relative humidity
type: Class
subclass of: physical quantity
IAO_0000115: Relative humidity (RH) (expressed as a percent) also measures water vapor, but RELATIVE to the temperature of the air. In other words, it is a measure of the actual amount of water vapor in the air compared to the total amount of vapor that can exist in the air at its current temperature.
IAO_0000117: Michael Rubinigg
IAO_0000118: RH
IAO_0000118: Relative Feuchte @de
IAO_0000118: relative humidity
id: EUPH:7275

Axiom
annotated source: relative humidity
annotated property: IAO_0000115
annotated target: Relative humidity (RH) (expressed as a percent) also measures water vapor, but RELATIVE to the temperature of the air. In other words, it is a measure of the actual amount of water vapor in the air compared to the total amount of vapor that can exist in the air at its current temperature.
source: https://www.weather.gov/lmk/humidity

atmospheric pressure
type: Class
subclass of: pressure
IAO_0000115: Atmospheric pressure, also known as air pressure or barometric pressure (after the barometer), is the pressure within the atmosphere of Earth.
IAO_0000117: Michael Rubinigg
IAO_0000118: Luftdruck @de
IAO_0000118: atmospheric pressure
id: EUPH:7276

Axiom
annotated source: atmospheric pressure
annotated property: IAO_0000115
annotated target: Atmospheric pressure, also known as air pressure or barometric pressure (after the barometer), is the pressure within the atmosphere of Earth.
source: https://en.wikipedia.org/w/index.php

median lethal dose (LD50)
type: Class
subclass of: https://w3id.org/euph/8107
IAO_0000115: LD50 (median lethal dose) contact, is a statistically derived single dose of a substance that can cause death in 50 per cent of animals when administered by contact. The LD50 value is given in mg of test substance per [...][animal]. For pesticides, the test substance may be either an active ingredient (a.i.) or a formulated product containing one or more than one active ingredient.
IAO_0000117: Michael Rubinigg
IAO_0000118: DL50 @fr
IAO_0000118: LD50 @de
IAO_0000118: dose létale 50% @fr
IAO_0000118: median lethal dose
IAO_0000118: mediane letale Dosis @de
id: EUPH:7278

Axiom
annotated source: median lethal dose (LD50)
annotated property: IAO_0000115
annotated target: LD50 (median lethal dose) contact, is a statistically derived single dose of a substance that can cause death in 50 per cent of animals when administered by contact. The LD50 value is given in mg of test substance per [...][animal]. For pesticides, the test substance may be either an active ingredient (a.i.) or a formulated product containing one or more than one active ingredient.
source: https://www.oecd-ilibrary.org/environment/test-no-214-honeybees-acute-contact-toxicity-test_9789264070189-en

acute contact toxicity (LD50 contact)
type: Class
subclass of: median lethal dose (LD50)
IAO_0000115: Acute contact toxicity is the adverse effects (mortality) occurring within a maximum period of 96 h after a topical application of a single dose of a substance on 50% of the individuals exposed. Measured as Lethal Dose 50 (LD50), which is the dose that kills 50% of the exposied individuals after a single dose.
IAO_0000117: Michael Rubinigg
IAO_0000118: acute contact toxicity
IAO_0000118: akute Kontakttoxizität @de
IAO_0000118: toxicidad aguda por contacto @es
IAO_0000118: toxicité aiguë par contact @fr
id: EUPH:7279

Axiom
annotated source: acute contact toxicity (LD50 contact)
annotated property: IAO_0000115
annotated target: Acute contact toxicity is the adverse effects (mortality) occurring within a maximum period of 96 h after a topical application of a single dose of a substance on 50% of the individuals exposed. Measured as Lethal Dose 50 (LD50), which is the dose that kills 50% of the exposied individuals after a single dose.
source: https://www.oecd-ilibrary.org/environment/test-no-214-honeybees-acute-contact-toxicity-test_9789264070189-en

dose
type: Class
subclass of: https://w3id.org/euph/8107
IAO_0000115: Dose is the amount of test substance applied. Dose is expressed as mass (mg) of test substance per test animal (mg/bee).
IAO_0000117: Michael Rubinigg
IAO_0000118: dose
IAO_0000118: dosis @es
id: EUPH:7280

Axiom
annotated source: dose
annotated property: IAO_0000115
annotated target: Dose is the amount of test substance applied. Dose is expressed as mass (mg) of test substance per test animal (mg/bee).
source: https://www.oecd-ilibrary.org/environment/test-no-214-honeybees-acute-contact-toxicity-test_9789264070189-en

mortality
type: Class
subclass of: https://w3id.org/euph/8107
IAO_0000115: An animal is recorded as dead when it is completely immobile.
IAO_0000117: Michael Rubinigg
IAO_0000118: Mortalität @de
IAO_0000118: mortality
IAO_0000118: mortalité @fr
id: EUPH:7281

Axiom
annotated source: mortality
annotated property: IAO_0000115
annotated target: An animal is recorded as dead when it is completely immobile.
source: https://www.oecd-ilibrary.org/environment/test-no-214-honeybees-acute-contact-toxicity-test_9789264070189-en

median lethal concentration (LC50)
type: Class
subclass of: https://w3id.org/euph/8107
IAO_0000115: LC50 (median Lethal Concentration) is a statistically calculated concentration of a substance that can cause death in 50 % of the test organisms at the end of the test period. It is expressed in e.g. mg or μg active ingredient or formulated product per kg food.
IAO_0000117: Michael Rubinigg
IAO_0000118: CL50 @fr
IAO_0000118: LC50 @de
IAO_0000118: concentration létale médiane @fr
IAO_0000118: median lethal concentration
IAO_0000118: mediane letale Konzentration @de
id: EUPH:7283

Axiom
annotated source: median lethal concentration (LC50)
annotated property: IAO_0000115
annotated target: LC50 (median Lethal Concentration) is a statistically calculated concentration of a substance that can cause death in 50 % of the test organisms at the end of the test period. It is expressed in e.g. mg or μg active ingredient or formulated product per kg food.
source: https://www.oecd-ilibrary.org/environment/test-no-245-honey-bee-apis-mellifera-l-chronic-oral-toxicity-test-10-day-feeding_9789264284081-en

median lethal dietary dose LDD50
type: Class
subclass of: https://w3id.org/euph/8107
IAO_0000115: LDD50 (median Lethal Dietary Dose) is a statistically calculated dietary dose of a substance that can cause death in 50 % of the test organisms at the end of the test period. It is expressed in e.g. μg or ng active ingredient or formulated product per bee per day.
IAO_0000117: Michael Rubinigg
IAO_0000118: LDD50
IAO_0000118: dose alimentaire létale médiane @fr
IAO_0000118: median lethal dietary dose
IAO_0000118: mediane letale Dosis über die Nahrung @de
id: EUPH:7284

Axiom
annotated source: median lethal dietary dose LDD50
annotated property: IAO_0000115
annotated target: LDD50 (median Lethal Dietary Dose) is a statistically calculated dietary dose of a substance that can cause death in 50 % of the test organisms at the end of the test period. It is expressed in e.g. μg or ng active ingredient or formulated product per bee per day.
source: https://www.oecd-ilibrary.org/environment/test-no-245-honey-bee-apis-mellifera-l-chronic-oral-toxicity-test-10-day-feeding_9789264284081-en

no observed effect concentration NOEC
type: Class
subclass of: https://w3id.org/euph/8107
IAO_0000115: NOEC (No Observed Effect Concentration) the highest tested concentration next below the LOEC (lowest effect concentration). In case that the LOEC cannot be determined, the NOEC will be considered to be greater than or equal to the highest concentration tested. If, in a limit test, the effect at the tested concentration is not significantly different statistically from the control the NOEC is considered to be greater than or equal to the tested concentration. It is expressed in e.g. mg or μg active ingredient or formulated product per kg food.
IAO_0000117: Michael Rubinigg
IAO_0000118: CSEO @fr
IAO_0000118: Konzentration ohne beobachtete Wirkung @de
IAO_0000118: NOEC
IAO_0000118: concentration sans effet observé @fr
IAO_0000118: no observed effect concentration
id: EUPH:7285

Axiom
annotated source: no observed effect concentration NOEC
annotated property: IAO_0000115
annotated target: NOEC (No Observed Effect Concentration) the highest tested concentration next below the LOEC (lowest effect concentration). In case that the LOEC cannot be determined, the NOEC will be considered to be greater than or equal to the highest concentration tested. If, in a limit test, the effect at the tested concentration is not significantly different statistically from the control the NOEC is considered to be greater than or equal to the tested concentration. It is expressed in e.g. mg or μg active ingredient or formulated product per kg food.
source: https://www.oecd-ilibrary.org/environment/test-no-245-honey-bee-apis-mellifera-l-chronic-oral-toxicity-test-10-day-feeding_9789264284081-en

no observed effect dietary dose NOEDD
type: Class
subclass of: https://w3id.org/euph/8107
IAO_0000115: NOEDD (No Observed Effect Dietary Dose) the highest tested dose per bee per day, administered by chronic feeding exposure, next below the LOEDD (lowest effect dietary dose). In case that the LOEDD cannot be determined, the NOEDD will be considered to be greater than or equal to the highest dose tested. If, in a limit test, the effect at the tested dose is not significantly different statistically from the control the NOEDD is considered to be greater than or equal to the tested dose. It is expressed in e.g. μg or ng active ingredient or formulated product per bee per day.
IAO_0000117: Michael Rubinigg
IAO_0000118: DASEO @fr
IAO_0000118: NOEDD
IAO_0000118: dose alimentaire sans effet observé @fr
IAO_0000118: no observed effect dietary dose
id: EUPH:7286

Axiom
annotated source: no observed effect dietary dose NOEDD
annotated property: IAO_0000115
annotated target: NOEDD (No Observed Effect Dietary Dose) the highest tested dose per bee per day, administered by chronic feeding exposure, next below the LOEDD (lowest effect dietary dose). In case that the LOEDD cannot be determined, the NOEDD will be considered to be greater than or equal to the highest dose tested. If, in a limit test, the effect at the tested dose is not significantly different statistically from the control the NOEDD is considered to be greater than or equal to the tested dose. It is expressed in e.g. μg or ng active ingredient or formulated product per bee per day.
source: https://www.oecd-ilibrary.org/environment/test-no-245-honey-bee-apis-mellifera-l-chronic-oral-toxicity-test-10-day-feeding_9789264284081-en

lowest observed effect concentration/dietary dose LOEC/LOEDD
type: Class
subclass of: https://w3id.org/euph/8107
IAO_0000115: LOEC/LOEDD (Lowest Observed Effect Concentration/Dietary Dose) is the lowest concentration out of the tested concentrations at which a significant difference statistically from the control group is observed.
IAO_0000117: Michael Rubinigg
IAO_0000118: CMEO/DAMEO @fr
IAO_0000118: LOEC/LOEDD
IAO_0000118: concentration/dose alimentaire minimale avec effet observé @fr
IAO_0000118: lowest observed effect concentration/dietary dose
id: EUPH:7287

Axiom
annotated source: lowest observed effect concentration/dietary dose LOEC/LOEDD
annotated property: IAO_0000115
annotated target: LOEC/LOEDD (Lowest Observed Effect Concentration/Dietary Dose) is the lowest concentration out of the tested concentrations at which a significant difference statistically from the control group is observed.
source: https://www.oecd-ilibrary.org/environment/test-no-245-honey-bee-apis-mellifera-l-chronic-oral-toxicity-test-10-day-feeding_9789264284081-en

lethal concentration for x % effect LCx
type: Class
subclass of: https://w3id.org/euph/8107
IAO_0000115: LCx (Lethal Concentration for x % effect) is defined as the concentration that causes an x % of an effect within a given exposure period when compared with a control.
IAO_0000117: Michael Rubinigg
IAO_0000118: CLx @fr
IAO_0000118: LCx
IAO_0000118: Lethal Concentration for x % effect
IAO_0000118: concentration létale avec x % d’effet @fr
id: EUPH:7288

Axiom
annotated source: lethal concentration for x % effect LCx
annotated property: IAO_0000115
annotated target: LCx (Lethal Concentration for x % effect) is defined as the concentration that causes an x % of an effect within a given exposure period when compared with a control.
source: https://www.oecd-ilibrary.org/environment/test-no-245-honey-bee-apis-mellifera-l-chronic-oral-toxicity-test-10-day-feeding_9789264284081-en

FAOSTAT Abbreviation
type: Class
subclass of: FAOSTAT
IAO_0000115: Abbreviations used by FAOSTAT, summarised in the "Abbreviations" list on the web page "Definitions and standards used in FAOSTAT" of the FAOSTAT website.
IAO_0000117: Michael Rubinigg
IAO_0000118: Abbreviation used by FAOSTAT
IAO_0000118: Von FAOSTAT verwendete Abkürzung @de
id: EUPH:7289

Axiom
annotated source: FAOSTAT Abbreviation
annotated property: IAO_0000115
annotated target: Abbreviations used by FAOSTAT, summarised in the "Abbreviations" list on the web page "Definitions and standards used in FAOSTAT" of the FAOSTAT website.
source: https://www.fao.org/faostat/en/#definitions

FAOSTAT Abbreviation Description
type: Class
subclass of: FAOSTAT Abbreviation
IAO_0000115: Description of the abbreviations used by FAOSTAT, summarised in the "Abbreviations" list on the web page "Definitions and standards used in FAOSTAT" of the FAOSTAT website.
IAO_0000117: Michael Rubinigg
IAO_0000118: Beschreibung einer, von FAOSTAT verwendeten Abkürzung @de
IAO_0000118: Description of an abbreviation used by FAOSTAT
id: EUPH:7290

Axiom
annotated source: FAOSTAT Abbreviation Description
annotated property: IAO_0000115
annotated target: Description of the abbreviations used by FAOSTAT, summarised in the "Abbreviations" list on the web page "Definitions and standards used in FAOSTAT" of the FAOSTAT website.
source: https://www.fao.org/faostat/en/#definitions

FAOSTAT Area Label
type: Class
subclass of: FAOSTAT
IAO_0000115: Name of a country or a group of countries for which FAOSTAT aggregates data, summarised in the "Country Group" list on the web page "Definitions and standards used in FAOSTAT" of the FAOSTAT website.
IAO_0000117: Michael Rubinigg
IAO_0000118: Name eines, von FAOSTAT verwendeten Landes oder einer Ländergruppe @de
IAO_0000118: Name of a FAOSTAT country or country group
id: EUPH:7291

Axiom
annotated source: FAOSTAT Area Label
annotated property: IAO_0000115
annotated target: Name of a country or a group of countries for which FAOSTAT aggregates data, summarised in the "Country Group" list on the web page "Definitions and standards used in FAOSTAT" of the FAOSTAT website.
source: https://www.fao.org/faostat/en/#definitions

M49 standard
type: Class
subclass of: code set of geographical entities
subclass of: Restriction
  on property: member of
  some values from: https://w3id.org/euph/7822
IAO_0000115: Standard country or area codes for statistical use (M49) prepared by the Statistics Division of the United Nations Secretariat primarily for use in its publications and databases.
IAO_0000117: Michael Rubinigg
IAO_0000118: M49 Standard @de
id: EUPH:7292

Axiom
annotated source: M49 standard
annotated property: IAO_0000115
annotated target: Standard country or area codes for statistical use (M49) prepared by the Statistics Division of the United Nations Secretariat primarily for use in its publications and databases.
source: https://unstats.un.org/unsd/methodology/m49/

ISO 3166
type: Class
subclass of: https://w3id.org/euph/7727
IAO_0000115: The international standard for country codes and codes for their subdivisions issued by the International Organization for Standardization (ISO).
IAO_0000117: Michael Rubinigg
IAO_0000118: ISO 3166 Ländercodes @de
IAO_0000118: ISO 3166 country codes
id: EUPH:7293

Axiom
annotated source: ISO 3166
annotated property: IAO_0000115
annotated target: The international standard for country codes and codes for their subdivisions issued by the International Organization for Standardization (ISO).
source: https://www.iso.org/iso-3166-country-codes.html

alpha-2 country code
type: Class
subclass of: ISO 3166 country code
subclass of: Restriction
  on property: member of
  some values from: ISO 3166
IAO_0000115: A two-letter code that represents a country name, recommended as the general purpose code.
IAO_0000117: Michael Rubinigg
IAO_0000118: Alpha-2 Ländercode @de
IAO_0000118: alpha-2 country code
id: EUPH:7294

Axiom
annotated source: alpha-2 country code
annotated property: IAO_0000115
annotated target: A two-letter code that represents a country name, recommended as the general purpose code.
source: https://www.iso.org/standard/72482.html

alpha-3 country code
type: Class
subclass of: ISO 3166 country code
subclass of: Restriction
  on property: member of
  some values from: ISO 3166
IAO_0000115: A three-letter code that represents a country name, which is usually more closely related to the country name.
IAO_0000117: Michael Rubinigg
IAO_0000118: Alpha-3 Ländercode @de
IAO_0000118: alpha-3 country code
id: EUPH:7295

Axiom
annotated source: alpha-3 country code
annotated property: IAO_0000115
annotated target: A three-letter code that represents a country name, which is usually more closely related to the country name.
source: https://www.iso.org/standard/72482.html

start year
type: Class
subclass of: zero-dimensional temporal region in information science
IAO_0000115: dwc:year in which a dwc:Event starts.
IAO_0000117: Michael Rubinigg
IAO_0000118: Jahr, in dem ein Ereignis beginnt @de
IAO_0000118: year in which an event starts
id: EUPH:7296

end year
type: Class
subclass of: zero-dimensional temporal region in information science
IAO_0000115: dwc:year in which a dwc:Event ends.
IAO_0000117: Michael Rubinigg
IAO_0000118: Jahr, in dem ein Ereignis endet @de
IAO_0000118: year in which an event ends
id: EUPH:7297

FAOSTAT domain code
type: Class
subclass of: FAOSTAT domain
IAO_0000115: Code of the domain for which FAOSTAT provides data, as summarised in the "Element", "Item" or "Item Group" list on the web page "Definitions and standards used in FAOSTAT" of the FAOSTAT website.
IAO_0000117: Michael Rubinigg
IAO_0000118: FAOSTAT Bereichscode @de
IAO_0000118: FAOSTAT domain code
id: EUPH:7298

Axiom
annotated source: FAOSTAT domain code
annotated property: IAO_0000115
annotated target: Code of the domain for which FAOSTAT provides data, as summarised in the "Element", "Item" or "Item Group" list on the web page "Definitions and standards used in FAOSTAT" of the FAOSTAT website.
source: https://www.fao.org/faostat/en/#definitions

FAOSTAT domain description
type: Class
subclass of: FAOSTAT domain
IAO_0000115: Description of the domain for which FAOSTAT provides data, summarised in the "Element", "Item" or "Item Group" list on the web page "Definitions and standards used in FAOSTAT" of the FAOSTAT website.
IAO_0000117: Michael Rubinigg
IAO_0000118: Beschreibung des FAOSTAT Bereichs @de
IAO_0000118: FAOSTAT Domain Description
id: EUPH:7299

Axiom
annotated source: FAOSTAT domain description
annotated property: IAO_0000115
annotated target: Description of the domain for which FAOSTAT provides data, summarised in the "Element", "Item" or "Item Group" list on the web page "Definitions and standards used in FAOSTAT" of the FAOSTAT website.
source: https://www.fao.org/faostat/en/#definitions

honeydew
type: Class
subclass of: honey bee forage
subclass of: Restriction
  on property: involved in
  some values from: honeydew flow
subclass of: Restriction
  on property: has part
  some values from: alpha-amylase
IAO_0000115: Honeydew is a honey bee forage that has been defined as follows: A sweet fluid excreted by plant-sucking insects like aphids, Bees occasionally collect and ripen it into a type of honey marketed as pine or forest honey.
IAO_0000117: Michael Rubinigg
IAO_0000118: Honigtau @de
IAO_0000118: honeydew
IAO_0000118: honingdauw @nl
IAO_0000118: honningdug @da
IAO_0000118: honningdugg @no
IAO_0000118: honungsdagg @sv
IAO_0000118: mană @ro
IAO_0000118: melado @pt
IAO_0000118: melata @it
IAO_0000118: mielato @es
IAO_0000118: miellat @fr
id: EUPH:73

Axiom
annotated source: honeydew
annotated property: IAO_0000115
annotated target: Honeydew is a honey bee forage that has been defined as follows: A sweet fluid excreted by plant-sucking insects like aphids, Bees occasionally collect and ripen it into a type of honey marketed as pine or forest honey.
has db xref: ISBN:1-878075-65-4

comb honey
type: Class
subclass of: honey
subclass of: Restriction
  on property: derives from
  some values from: https://w3id.org/euph/802
IAO_0000115: Comb honey is a honey that is stored by bees in the cells of freshly built broodless combs or thin comb foundation sheets made solely of beeswax and sold in sealed whole combs or sections of such combs.
IAO_0000117: Michael Rubinigg
IAO_0000118: Scheibenhonig @de
IAO_0000118: Wabenhonig @de
IAO_0000118: comb honey
IAO_0000118: għasel tax-xehda @mt
IAO_0000118: honung i vaxkakor @sv
IAO_0000118: kakhonung @sv
IAO_0000118: kennohunaja @fi
IAO_0000118: korinis medus @lt
IAO_0000118: kärjemesi @et
IAO_0000118: lépes méz @hu
IAO_0000118: med u saću @hr
IAO_0000118: med v satju @sl
IAO_0000118: mel em favos @pt
IAO_0000118: miel en panal @es
IAO_0000118: miel en rayons @fr
IAO_0000118: miele di favo @it
IAO_0000118: miele in favo @it
IAO_0000118: miere cu fagure @ro
IAO_0000118: miere în fagure @ro
IAO_0000118: plaster miodu @pl
IAO_0000118: plástečkový med @cs
IAO_0000118: plástikový med @sk
IAO_0000118: raathonig @nl
IAO_0000118: raathoning @nl
IAO_0000118: tavlehonning @da
IAO_0000118: šūnu medus @lv
IAO_0000118: μέλι κηρήθρας @el
IAO_0000118: мед във восъчна пита @bg
id: EUPH:730

Axiom
annotated source: comb honey
annotated property: IAO_0000115
annotated target: Comb honey is a honey that is stored by bees in the cells of freshly built broodless combs or thin comb foundation sheets made solely of beeswax and sold in sealed whole combs or sections of such combs.
source: https://eur-lex.europa.eu/eli/dir/2001/110/2014-06-23

FAOSTAT element code
type: Class
subclass of: FAOSTAT element
IAO_0000115: Code of the element for which FAOSTAT provides data, summarised in the "Element" list on the web page "Definitions and standards used in FAOSTAT" of the FAOSTAT website.
IAO_0000117: Michael Rubinigg
IAO_0000118: FAOSTAT Element Code @de
IAO_0000118: FAOSTAT element code
id: EUPH:7300

Axiom
annotated source: FAOSTAT element code
annotated property: IAO_0000115
annotated target: Code of the element for which FAOSTAT provides data, summarised in the "Element" list on the web page "Definitions and standards used in FAOSTAT" of the FAOSTAT website.
source: https://www.fao.org/faostat/en/#definitions

FAOSTAT element description
type: Class
subclass of: FAOSTAT element
IAO_0000115: Description of the element for which FAOSTAT provides data, summarised in the "Element" list on the web page "Definitions and standards used in FAOSTAT" of the FAOSTAT website.
IAO_0000117: Michael Rubinigg
IAO_0000118: Beschreibung des FAOSTAT-Elements @de
IAO_0000118: FAOSTAT element description
id: EUPH:7301

Axiom
annotated source: FAOSTAT element description
annotated property: IAO_0000115
annotated target: Description of the element for which FAOSTAT provides data, summarised in the "Element" list on the web page "Definitions and standards used in FAOSTAT" of the FAOSTAT website.
source: https://www.fao.org/faostat/en/#definitions

FAOSTAT Unit
type: Class
subclass of: FAOSTAT
IAO_0000115: Unit in which FAOSTAT provides data, summarised in the "Units" list on the web page "Definitions and standards used in FAOSTAT" of the FAOSTAT website.
IAO_0000117: Michael Rubinigg
IAO_0000118: FAOSTAT Einheit @de
IAO_0000118: FAOSTAT Unit
id: EUPH:7302

Axiom
annotated source: FAOSTAT Unit
annotated property: IAO_0000115
annotated target: Unit in which FAOSTAT provides data, summarised in the "Units" list on the web page "Definitions and standards used in FAOSTAT" of the FAOSTAT website.
source: https://www.fao.org/faostat/en/#definitions

FAOSTAT Unit Description
type: Class
subclass of: FAOSTAT Unit
IAO_0000115: Description of the unit in which FAOSTAT provides data, summarised in the "Units" list on the web page "Definitions and standards used in FAOSTAT" of the FAOSTAT website.
IAO_0000117: Michael Rubinigg
IAO_0000118: Beschreibung der FAOSTAT Einheit @de
IAO_0000118: FAOSTAT unit description
id: EUPH:7303

Axiom
annotated source: FAOSTAT Unit Description
annotated property: IAO_0000115
annotated target: Description of the unit in which FAOSTAT provides data, summarised in the "Units" list on the web page "Definitions and standards used in FAOSTAT" of the FAOSTAT website.
source: https://www.fao.org/faostat/en/#definitions

FAOSTAT Flag
type: Class
subclass of: FAOSTAT
IAO_0000115: Flag used to add standardised comments to data provided by FAOSTAT, summarised in the "Flags" list on the web page "Definitions and standards used in FAOSTAT" of the FAOSTAT website.
IAO_0000117: Michael Rubinigg
IAO_0000118: FAOSTAT Flag @de
IAO_0000118: FAOSTAT flag
id: EUPH:7304

Axiom
annotated source: FAOSTAT Flag
annotated property: IAO_0000115
annotated target: Flag used to add standardised comments to data provided by FAOSTAT, summarised in the "Flags" list on the web page "Definitions and standards used in FAOSTAT" of the FAOSTAT website.
source: https://www.fao.org/faostat/en/#definitions

FAOSTAT Flag Description
type: Class
subclass of: FAOSTAT Flag
IAO_0000115: Description of the flag used to add standardised comments to data provided by FAOSTAT data, summarised in the "Flags" list on the web page "Definitions and standards used in FAOSTAT" of the FAOSTAT website.
IAO_0000117: Michael Rubinigg
IAO_0000118: Beschreibung des FAOSTAT Flags @de
IAO_0000118: FAOSTAT flag description
id: EUPH:7305

Axiom
annotated source: FAOSTAT Flag Description
annotated property: IAO_0000115
annotated target: Description of the flag used to add standardised comments to data provided by FAOSTAT data, summarised in the "Flags" list on the web page "Definitions and standards used in FAOSTAT" of the FAOSTAT website.
source: https://www.fao.org/faostat/en/#definitions

FAOSTAT item code
type: Class
subclass of: FAOSTAT item
IAO_0000115: Code of the item for which FAOSTAT provides data, summarised in the "Item" list on the web page "Definitions and standards used in FAOSTAT" of the FAOSTAT website.
IAO_0000117: Michael Rubinigg
IAO_0000118: FAOSTAT Gegenstands-Code @de
IAO_0000118: FAOSTAT item code
id: EUPH:7306

Axiom
annotated source: FAOSTAT item code
annotated property: IAO_0000115
annotated target: Code of the item for which FAOSTAT provides data, summarised in the "Item" list on the web page "Definitions and standards used in FAOSTAT" of the FAOSTAT website.
source: https://www.fao.org/faostat/en/#definitions

FAOSTAT item description
type: Class
subclass of: FAOSTAT item
IAO_0000115: Name of the item for which FAOSTAT provides data, summarised in the "Item" list on the web page "Definitions and standards used in FAOSTAT" of the FAOSTAT website.
IAO_0000117: Michael Rubinigg
IAO_0000118: Bezeichnung des FAOSTAT Gegenstandes @de
IAO_0000118: FAOSTAT item label
id: EUPH:7308

Axiom
annotated source: FAOSTAT item description
annotated property: IAO_0000115
annotated target: Name of the item for which FAOSTAT provides data, summarised in the "Item" list on the web page "Definitions and standards used in FAOSTAT" of the FAOSTAT website.
source: https://www.fao.org/faostat/en/#definitions

entity in economics
type: Class
subclass of: social sciences
IAO_0000115: An entity in economics is an entity in the social sciences domain that contains all classes related to aspects of pollinators and pollination studied in economics, i.e. the [...] branch that deals with the production and distribution and consumption of goods and services and their management.
IAO_0000117: Michael Rubinigg
IAO_0000118: Wirtschaft @de
IAO_0000118: economia @it
IAO_0000118: economie @nl
IAO_0000118: economy
IAO_0000118: Ökonomie @de
IAO_0000118: économie @fr
id: EUPH:7309

Axiom
annotated source: entity in economics
annotated property: IAO_0000115
annotated target: An entity in economics is an entity in the social sciences domain that contains all classes related to aspects of pollinators and pollination studied in economics, i.e. the [...] branch that deals with the production and distribution and consumption of goods and services and their management.
source: http://purl.obolibrary.org/obo/BFO_0000001
source: https://ncit.nci.nih.gov/ncitbrowser/pages/home.jsf

code set of economical entities
type: Class
subclass of: information content entity in economics
IAO_0000115: A code set of economical entities is an information content entity in the economics domain [...] that is a collection of other information content entities that has been created to identify or annotate things in a specified domain, and where the intention of its creators is that the collection has a one-to-one correspondence with those things.
IAO_0000117: Michael Rubinigg
IAO_0000118: Code-Set für wirtschaftliche Einheiten @de
IAO_0000118: code set of economical entities
id: EUPH:7310

Axiom
annotated source: code set of economical entities
annotated property: IAO_0000115
annotated target: A code set of economical entities is an information content entity in the economics domain [...] that is a collection of other information content entities that has been created to identify or annotate things in a specified domain, and where the intention of its creators is that the collection has a one-to-one correspondence with those things.
source: code set

central product classification (CPC)
type: Class
subclass of: code set of economical entities
IAO_0000115: The Central Product Classification (CPC) consists of a coherent and consistent classification structure for products (goods and services) based on a set of internationally agreed concepts, definitions, principles and classification rules. It serves as an international standard for assembling and tabulating all kinds of data requiring product detail, including statistics on industrial production, domestic and foreign commodity trade, international trade in services, balance of payments, consumption and price statistics and other data used within the national accounts. It provides a comprehensive framework within which data on products can be collected and presented in a format that allows for economic analysis supporting decision-taking and policy- making.
IAO_0000117: Michael Rubinigg
IAO_0000118: Central Product Classification
id: EUPH:7311

Axiom
annotated source: central product classification (CPC)
annotated property: IAO_0000115
annotated target: The Central Product Classification (CPC) consists of a coherent and consistent classification structure for products (goods and services) based on a set of internationally agreed concepts, definitions, principles and classification rules. It serves as an international standard for assembling and tabulating all kinds of data requiring product detail, including statistics on industrial production, domestic and foreign commodity trade, international trade in services, balance of payments, consumption and price statistics and other data used within the national accounts. It provides a comprehensive framework within which data on products can be collected and presented in a format that allows for economic analysis supporting decision-taking and policy- making.
source: https://unstats.un.org/unsd/classifications/Econ/CPC.cshtml

CPC code
type: Class
subclass of: identifier of economical entities
subclass of: Restriction
  on property: quality of
  some values from: central product classification (CPC)
IAO_0000115: Code of a product in the Central Product Classification (CPC)
IAO_0000117: Michael Rubinigg
IAO_0000118: CPC Code
id: EUPH:7312

Axiom
annotated source: CPC code
annotated property: IAO_0000115
annotated target: Code of a product in the Central Product Classification (CPC)
source: https://unstats.un.org/unsd/classifications/Econ/CPC.cshtml

harmonized commodity description and coding system (HS)
type: Class
subclass of: code set of economical entities
IAO_0000115: The Harmonized Commodity Description and Coding System generally referred to as "Harmonized System" or simply "HS" is a multipurpose international product nomenclature developed by the World Customs Organization (WCO). It comprises more than 5,000 commodity groups; each identified by a six digit code, arranged in a legal and logical structure and is supported by well-defined rules to achieve uniform classification. The system is used by more than 200 countries and economies as a basis for their Customs tariffs and for the collection of international trade statistics. Over 98 % of the merchandise in international trade is classified in terms of the HS.
IAO_0000117: Michael Rubinigg
IAO_0000118: HS @de
IAO_0000118: Harmonisiertes System @de
IAO_0000118: Harmonisiertes System zur Bezeichnung und Codierung der Waren @de
IAO_0000118: Harmonized Commodity Description and Coding System
IAO_0000118: Harmonized System
IAO_0000118: SH @fr
IAO_0000118: Système harmonisé @fr
IAO_0000118: Système harmonisé de désignation et de codification des marchandises @fr
id: EUPH:7313

Axiom
annotated source: harmonized commodity description and coding system (HS)
annotated property: IAO_0000115
annotated target: The Harmonized Commodity Description and Coding System generally referred to as "Harmonized System" or simply "HS" is a multipurpose international product nomenclature developed by the World Customs Organization (WCO). It comprises more than 5,000 commodity groups; each identified by a six digit code, arranged in a legal and logical structure and is supported by well-defined rules to achieve uniform classification. The system is used by more than 200 countries and economies as a basis for their Customs tariffs and for the collection of international trade statistics. Over 98 % of the merchandise in international trade is classified in terms of the HS.
source: https://www.wcoomd.org/en/topics/nomenclature/overview/what-is-the-harmonized-system.aspx

HS nomenclature 2007
type: Class
subclass of: harmonized commodity description and coding system (HS)
IAO_0000115: The 2007 edition of the WCO Harmonized System Nomenclature entered into force on 1 January 2007.
IAO_0000117: Michael Rubinigg
IAO_0000118: HS Nomenclature 2007
id: EUPH:7314

Axiom
annotated source: HS nomenclature 2007
annotated property: IAO_0000115
annotated target: The 2007 edition of the WCO Harmonized System Nomenclature entered into force on 1 January 2007.
source: https://www.wcoomd.org/en/topics/nomenclature/instrument-and-tools/hs_nomenclature_previous_editions/hs_nomenclature_table_2007.aspx

HS nomenclature 2012
type: Class
subclass of: harmonized commodity description and coding system (HS)
IAO_0000115: The 2012 edition of the WCO Harmonized System Nomenclature entered into force on 1 January 2012.
IAO_0000117: Michael Rubinigg
IAO_0000118: HS Nomenclature 2012
id: EUPH:7315

Axiom
annotated source: HS nomenclature 2012
annotated property: IAO_0000115
annotated target: The 2012 edition of the WCO Harmonized System Nomenclature entered into force on 1 January 2012.
source: https://www.wcoomd.org/en/topics/nomenclature/instrument-and-tools/hs_nomenclature_previous_editions/hs_nomenclature_table_2012.aspx

FAOSTAT Year Code
type: Class
subclass of: FAOSTAT
IAO_0000115: Any period lasting one year for which FAOSTAT provides data, summarised in the "Definitions and standards - Crops and livestock products" list on the web page "Crops and livestock products" of the FAOSTAT website.
IAO_0000117: Michael Rubinigg
IAO_0000118: Jahr (FAOSTAT) @de
IAO_0000118: year (FAOSTAT)
id: EUPH:7316

Axiom
annotated source: FAOSTAT Year Code
annotated property: IAO_0000115
annotated target: Any period lasting one year for which FAOSTAT provides data, summarised in the "Definitions and standards - Crops and livestock products" list on the web page "Crops and livestock products" of the FAOSTAT website.
source: https://www.fao.org/faostat/en/#data/TCL

FAOSTAT Year Description
type: Class
subclass of: FAOSTAT
IAO_0000115: Description of a period lasting one year for which FAOSTAT provides data, summarised in the "Definitions and standards - Crops and livestock products" list on the web page "Crops and livestock products" of the FAOSTAT website.
IAO_0000117: Michael Rubinigg
IAO_0000118: FAOSTAT Jahr Beschreibung @de
IAO_0000118: FAOSTAT Year Description
id: EUPH:7317

Axiom
annotated source: FAOSTAT Year Description
annotated property: IAO_0000115
annotated target: Description of a period lasting one year for which FAOSTAT provides data, summarised in the "Definitions and standards - Crops and livestock products" list on the web page "Crops and livestock products" of the FAOSTAT website.
source: https://www.fao.org/faostat/en/#data/TCL

honey yield
type: Class
subclass of: beekeeping quantity
subclass of: Restriction
  on property: quality of
  some values from: honey bee colony
IAO_0000115: Honey yield is the amount of honey that was harvested from a certain number of beehives in a certain time interval at one or more locations .
IAO_0000117: Michael Rubinigg
IAO_0000118: Honigertrag @de
IAO_0000118: honey yield
IAO_0000118: honingopbrengst @nl
IAO_0000118: honningudbytte @da
IAO_0000118: honningutbytte @no
IAO_0000118: honungsskörd @sv
IAO_0000118: hopnungsavkastning @sv
IAO_0000118: producţie de miere @ro
IAO_0000118: produzione di miele @it
IAO_0000118: produção de mel @pt
IAO_0000118: raccolto di miele @it
IAO_0000118: recoltă de miere @ro
IAO_0000118: rendement en miel @fr
IAO_0000118: rendimento em mel @pt
IAO_0000118: rendimiento en miel @es
IAO_0000118: safra de mel @pt
id: EUPH:7320

date
type: Class
subclass of: time
IAO_0000115: time [...] on the calendar [...] time scale [...] Common forms of date include calendar date [...], ordinal date [...] or week date [...].
IAO_0000117: Gregor Sušanj
IAO_0000118: Datum @de
IAO_0000118: data @it
IAO_0000118: date
IAO_0000118: datum @nl
id: EUPH:7321

Axiom
annotated source: date
annotated property: IAO_0000115
annotated target: time [...] on the calendar [...] time scale [...] Common forms of date include calendar date [...], ordinal date [...] or week date [...].
source: https://www.iso.org/standard/70907.html

string
type: Class
subclass of: https://w3id.org/euph/8076
IAO_0000115: In computer programming, a string is traditionally a sequence of characters, either as a literal constant or as some kind of variable. The latter may allow its elements to be mutated and the length changed, or it may be fixed (after creation). A string is generally considered as a data type and is often implemented as an array data structure of bytes (or words) that stores a sequence of elements, typically characters, using some character encoding. String may also denote more general arrays or other sequence (or list) data types and structures.
IAO_0000117: Gregor Sušanj
IAO_0000118: String @de
IAO_0000118: Zeichenkette @de
IAO_0000118: chaîne de caractères @fr
IAO_0000118: string @nl
IAO_0000118: stringa @it
IAO_0000118: tekenreeks @nl
id: EUPH:7322

Axiom
annotated source: string
annotated property: IAO_0000115
annotated target: In computer programming, a string is traditionally a sequence of characters, either as a literal constant or as some kind of variable. The latter may allow its elements to be mutated and the length changed, or it may be fixed (after creation). A string is generally considered as a data type and is often implemented as an array data structure of bytes (or words) that stores a sequence of elements, typically characters, using some character encoding. String may also denote more general arrays or other sequence (or list) data types and structures.
source: https://en.wikipedia.org/w/index.php

mated queen
type: Class
subclass of: adult queen bee
IAO_0000115: A mated queen is an adult queen bee, which has been mated by one or more drones.
IAO_0000117: Michael Rubinigg
IAO_0000118: begattete Königin @de
IAO_0000118: mated queen
id: EUPH:7326

unmated queen
type: Class
subclass of: adult queen bee
IAO_0000115: An unmated queen is an adult queen bee, which has not (yet) been mated.
IAO_0000117: Michael Rubinigg
IAO_0000118: unbegattete Königin @de
IAO_0000118: unmated queen
id: EUPH:7327

time of day
type: Class
subclass of: time
IAO_0000115: time [...] occurring within a calendar day [...] Generally, time of day relates to the duration [...] elapsed after the beginning of the day. However, this correlation breaks when changes occur in the time scale [...] that applies to the time of day, such as time shifts [...] and leap seconds [...]. This definition corresponds closely with the definition of “clock time” given in IEC 60050-113:2011, 113-01-18, except that the concepts of duration and time scale are not used in this definition.
IAO_0000117: Michael Rubinigg
IAO_0000118: Uhrzeit @de
IAO_0000118: heure @fr
IAO_0000118: ora @it
IAO_0000118: time of day
id: EUPH:7328

Axiom
annotated source: time of day
annotated property: IAO_0000115
annotated target: time [...] occurring within a calendar day [...] Generally, time of day relates to the duration [...] elapsed after the beginning of the day. However, this correlation breaks when changes occur in the time scale [...] that applies to the time of day, such as time shifts [...] and leap seconds [...]. This definition corresponds closely with the definition of “clock time” given in IEC 60050-113:2011, 113-01-18, except that the concepts of duration and time scale are not used in this definition.
source: https://www.iso.org/standard/70907.html

managed honey bee colony
type: Class
subclass of: honey bee colony
subclass of: Restriction
  on property: target participant in
  some values from: hive management
IAO_0000115: A honey bee colony that is intentionally kept by humans in a beehive.
IAO_0000117: Michael Rubinigg
IAO_0000118: colonia gestita @it
IAO_0000118: colonie gérée @fr
IAO_0000118: gehaltenes Bienenvolk @de
IAO_0000118: gemanaged kolonie @nl
IAO_0000118: managed colony
id: EUPH:7329

personal data
type: Class
subclass of: identifier (ID)
IAO_0000115: Personal data is any information relating to an identified or identifiable natural person (‘data subject’); an identifiable natural person is one who can be identified, directly or indirectly, in particular by reference to an identifier such as a name, an identification number, location data, an online identifier or to one or more factors specific to the physical, physiological, genetic, mental, economic, cultural or social identity of that natural person;
IAO_0000117: Noa Simon Delso
IAO_0000118: dati personali @it
IAO_0000118: données à caractère personnel @fr
IAO_0000118: osebni podatki @sl
IAO_0000118: personal data
IAO_0000118: personenbezogene Daten @da
IAO_0000118: persoonsgegevens @nl
id: EUPH:7330

Axiom
annotated source: personal data
annotated property: IAO_0000115
annotated target: Personal data is any information relating to an identified or identifiable natural person (‘data subject’); an identifiable natural person is one who can be identified, directly or indirectly, in particular by reference to an identifier such as a name, an identification number, location data, an online identifier or to one or more factors specific to the physical, physiological, genetic, mental, economic, cultural or social identity of that natural person;
source: https://eur-lex.europa.eu/legal-content/EN/TXT/HTML/

email address
type: Class
subclass of: personal data
IAO_0000115: An email address identifies an email box to which messages are delivered.
IAO_0000117: Noa Simon Delso
IAO_0000118: E-Mail Adresse @de
IAO_0000118: adresse électronique @fr
IAO_0000118: correo electrónico @es
IAO_0000118: courriel adresse @fr
IAO_0000118: e-pošta @sl
IAO_0000118: elektronska pošta @sl
IAO_0000118: email address
IAO_0000118: indirizzo e-mail @it
id: EUPH:7331

Axiom
annotated source: email address
annotated property: IAO_0000115
annotated target: An email address identifies an email box to which messages are delivered.
source: https://en.wikipedia.org/w/index.php

home address
type: Class
subclass of: address
IAO_0000115: The address of a person.
IAO_0000117: Noa Simon Delso
IAO_0000118: Pri­vat­ad­res­se @de
IAO_0000118: Wohnsitzadresse @de
IAO_0000118: adresse de domicile @fr
IAO_0000118: home address
IAO_0000118: indirizzo di casa @it
IAO_0000118: thuisadres @nl
id: EUPH:7332

identity document number
type: Class
subclass of: personal data
IAO_0000115: The number on a document used for the unique identification of a person's identity.
IAO_0000117: Noa Simon Delso
IAO_0000118: ID number
IAO_0000118: Personaldukument-Nummer @de
IAO_0000118: identity document number
IAO_0000118: numero del documento di identità @it
IAO_0000118: numèro du pièce d'identité @fr
id: EUPH:7333

internet protocol (IP) address
type: Class
subclass of: personal data
IAO_0000115: An Internet Protocol address (IP address) is a numerical label such as 192.0.2.1 that is assigned to a device connected to a computer network that uses the Internet Protocol for communication.
IAO_0000117: Noa Simon Delso
IAO_0000118: IP address
IAO_0000118: IP-Adresse @de
IAO_0000118: IP-adres @nl
IAO_0000118: adresse IP @fr
IAO_0000118: indirizzo IP @it
IAO_0000118: internet protocol address
id: EUPH:7334

Axiom
annotated source: internet protocol (IP) address
annotated property: IAO_0000115
annotated target: An Internet Protocol address (IP address) is a numerical label such as 192.0.2.1 that is assigned to a device connected to a computer network that uses the Internet Protocol for communication.
source: https://en.wikipedia.org/w/index.php

telephone number
type: Class
subclass of: personal data
IAO_0000115: A telephone number is a sequence of digits assigned to a landline telephone subscriber station connected to a telephone line or to a wireless electronic telephony device, such as a radio telephone or a mobile telephone, or to other devices for data transmission via the public switched telephone network (PSTN), or other public and private networks.
IAO_0000117: Noa Simon Delso
IAO_0000118: Telefonnummer @de
IAO_0000118: numero di telefono @it
IAO_0000118: numéro de téléphone @fr
IAO_0000118: telefoonnummer @nl
IAO_0000118: telephone number
id: EUPH:7335

Axiom
annotated source: telephone number
annotated property: IAO_0000115
annotated target: A telephone number is a sequence of digits assigned to a landline telephone subscriber station connected to a telephone line or to a wireless electronic telephony device, such as a radio telephone or a mobile telephone, or to other devices for data transmission via the public switched telephone network (PSTN), or other public and private networks.
source: https://en.wikipedia.org/w/index.php

personal name
type: Class
subclass of: personal data
IAO_0000115: A personal name, full name or prosoponym (from Ancient Greek prósōpon – person, and onoma –name)[...] is the set of names by which an individual person or animal is known, and that can be recited as a word-group, with the understanding that, taken together, they all relate to that one individual.
IAO_0000117: Noa Simon Delso
IAO_0000118: Anthroponym @de
IAO_0000118: Personenname @de
IAO_0000118: Realname @de
IAO_0000118: antroponimo @it
IAO_0000118: full name
IAO_0000118: nom personnel @fr
IAO_0000118: nome proprio attribuito a una persona @it
IAO_0000118: personal name
IAO_0000118: prosoponym
id: EUPH:7336

Axiom
annotated source: personal name
annotated property: IAO_0000115
annotated target: A personal name, full name or prosoponym (from Ancient Greek prósōpon – person, and onoma –name)[...] is the set of names by which an individual person or animal is known, and that can be recited as a word-group, with the understanding that, taken together, they all relate to that one individual.
source: https://en.wikipedia.org/w/index.php

surname
type: Class
subclass of: personal name
IAO_0000115: A surname, family name, or last name is the mostly hereditary portion of one's personal name that indicates one's family.[...] It is typically combined with a given name to form the full name of a person, although several given names and surnames are possible in the full name.
IAO_0000117: Noa Simon Delso
IAO_0000118: Familienname @de
IAO_0000118: Nachname @de
IAO_0000118: cognome @it
IAO_0000118: family name
IAO_0000118: last name
IAO_0000118: nom de famille @fr
IAO_0000118: surname
IAO_0000118: toenaam @nl
id: EUPH:7337

Axiom
annotated source: surname
annotated property: IAO_0000115
annotated target: A surname, family name, or last name is the mostly hereditary portion of one's personal name that indicates one's family.[...] It is typically combined with a given name to form the full name of a person, although several given names and surnames are possible in the full name.
source: https://en.wikipedia.org/w/index.php

robbing
type: Class
subclass of: https://w3id.org/euph/760
IAO_0000115: Robbing is a behaviour exhibited by honey bees, whereby worker bees invade the nests of other honey bee colonies that are too weak to defend themselves in order to steal their supplies.
IAO_0000117: Michael Rubinigg
IAO_0000118: a fura @ro
IAO_0000118: a prăda @ro
IAO_0000118: at røve @da
IAO_0000118: att röva @sv
IAO_0000118: pilhar @pt
IAO_0000118: pillar @es
IAO_0000118: piller @fr
IAO_0000118: rauben @de
IAO_0000118: robar @es
IAO_0000118: robbing
IAO_0000118: roubar @pt
IAO_0000118: roven @nl
IAO_0000118: räubern @de
IAO_0000118: saccheggiare @it
IAO_0000118: to rob
IAO_0000118: å røve @no
id: EUPH:7338

data type
type: Class
subclass of: data item
subclass of: Restriction
  on property: quality of
  some values from: data element
IAO_0000115: In computer science and computer programming, a data type (or simply type) is a collection or grouping of data values, usually specified by a set of possible values, a set of allowed operations on these values, and/or a representation of these values as machine types.
IAO_0000117: Michael Rubinigg
IAO_0000118: Datentyp @de
IAO_0000118: data type
IAO_0000118: datatype @nl
IAO_0000118: gegevenstype @nl
IAO_0000118: tipo di dato @it
IAO_0000118: type de donnée @fr
id: EUPH:7340

Axiom
annotated source: data type
annotated property: IAO_0000115
annotated target: In computer science and computer programming, a data type (or simply type) is a collection or grouping of data values, usually specified by a set of possible values, a set of allowed operations on these values, and/or a representation of these values as machine types.
source: https://en.wikipedia.org/w/index.php

data structure
type: Class
subclass of: data format specification
IAO_0000115: In computer science, a data structure is a data organization and storage format that is usually chosen for efficient access to data.[...] More precisely, a data structure is a collection of data values, the relationships among them, and the functions or operations that can be applied to the data,[...] i.e., it is an algebraic structure about data.
IAO_0000117: Michael Rubinigg
IAO_0000118: Datenstruktur @de
IAO_0000118: data structure
IAO_0000118: datastructuur @nl
IAO_0000118: structure de données @fr
IAO_0000118: struttura dati @it
id: EUPH:7341

Axiom
annotated source: data structure
annotated property: IAO_0000115
annotated target: In computer science, a data structure is a data organization and storage format that is usually chosen for efficient access to data.[...] More precisely, a data structure is a collection of data values, the relationships among them, and the functions or operations that can be applied to the data,[...] i.e., it is an algebraic structure about data.
source: https://en.wikipedia.org/w/index.php

address
type: Class
subclass of: personal data
IAO_0000115: An address is a collection of information, presented in a mostly fixed format, used to give the location of a building, apartment, or other structure or a plot of land, generally using political boundaries and street names as references, along with other identifiers such as house or apartment numbers and organization name.
IAO_0000117: Michael Rubinigg
IAO_0000118: Adresse @de
IAO_0000118: address
IAO_0000118: adres @nl
IAO_0000118: adresse @fr
IAO_0000118: indirizzo @it
id: EUPH:7342

Axiom
annotated source: address
annotated property: IAO_0000115
annotated target: An address is a collection of information, presented in a mostly fixed format, used to give the location of a building, apartment, or other structure or a plot of land, generally using political boundaries and street names as references, along with other identifiers such as house or apartment numbers and organization name.
source: https://en.wikipedia.org/w/index.php

given name
type: Class
subclass of: personal name
IAO_0000115: A given name (also known as a forename or first name) is the part of a personal name that identifies a person, potentially with a middle name as well, and differentiates that person from the other members of a group (typically a family or clan) who have a common surname. The term given name refers to a name usually bestowed at or close to the time of birth, usually by the parents of the newborn.
IAO_0000117: Michael Rubinigg
IAO_0000118: Vorname @de
IAO_0000118: first name
IAO_0000118: forename
IAO_0000118: given name
IAO_0000118: nome @it
IAO_0000118: nome di battesimo @it
IAO_0000118: prenome @it
IAO_0000118: primo nome @it
IAO_0000118: prénom @fr
IAO_0000118: voornaam @nl
id: EUPH:7343

Axiom
annotated source: given name
annotated property: IAO_0000115
annotated target: A given name (also known as a forename or first name) is the part of a personal name that identifies a person, potentially with a middle name as well, and differentiates that person from the other members of a group (typically a family or clan) who have a common surname. The term given name refers to a name usually bestowed at or close to the time of birth, usually by the parents of the newborn.
source: https://en.wikipedia.org/w/index.php

start date
type: Class
subclass of: zero-dimensional temporal region in information science
IAO_0000115: Calendar date in which a dwc:Event starts.
IAO_0000117: Noa Simon Delso
IAO_0000118: start date
id: EUPH:7344

season
type: Class
subclass of: one-dimensional temporal region in information science
IAO_0000115: [...] any of the four arbitrary divisions of the year, characterized chiefly by differences in temperature, precipitation, amount of daylight, and plant growth [...]
IAO_0000117: Michael Rubinigg
IAO_0000118: Jahreszeit @de
IAO_0000118: jaargetijde @nl
IAO_0000118: saison @fr
IAO_0000118: season
IAO_0000118: seizoen @nl
IAO_0000118: stagione @it
id: EUPH:7346

Axiom
annotated source: season
annotated property: IAO_0000115
annotated target: [...] any of the four arbitrary divisions of the year, characterized chiefly by differences in temperature, precipitation, amount of daylight, and plant growth [...]
has db xref: ISBN:0-13-947169-3

Varroa infestation rate of adult bees
type: Class
subclass of: https://w3id.org/euph/914
IAO_0000115: The quantity infestation rate of adult honey bee colonies with Varroa mites (Varroa destructor), measured by dislodging Varroa mites from adult honey bees, expressed in number of Varroa mites per unit of honey bees.
IAO_0000117: Michael Rubinigg
IAO_0000118: Befallsrate der erwachsenen Bienen @de
IAO_0000118: infestation rate of adult bees
id: EUPH:7348

Axiom
annotated source: Varroa infestation rate of adult bees
annotated property: IAO_0000115
annotated target: The quantity infestation rate of adult honey bee colonies with Varroa mites (Varroa destructor), measured by dislodging Varroa mites from adult honey bees, expressed in number of Varroa mites per unit of honey bees.
has db xref: 10.3896/IBRA.1.52.1.09

crown board
type: Class
subclass of: https://w3id.org/euph/8163
subclass of: Restriction
  on property: part of
  some values from: https://w3id.org/euph/8
IAO_0000115: Board made of wood or other material, used as inner cover and positioned on top of a hive between the top supers and the roof (outer cover). It is used to close the hive and help the bees to maintain the hive temperature. Depending on the construction, it may also be used in conjunction with a bee escape to remove bees from supers or containa centre hole to be used with a feeder.
IAO_0000117: Michael Rubinigg
IAO_0000118: Deckbrettchen @de
IAO_0000118: Innendeckel @de
IAO_0000118: assicella coprifavo @it
IAO_0000118: coprifavo @it
IAO_0000118: crown board
IAO_0000118: cubrecuadros @es
IAO_0000118: dekkbrett @no
IAO_0000118: dekplank @nl
IAO_0000118: dækbræt @da
IAO_0000118: inner cover
IAO_0000118: planchette couvre-cadres @fr
IAO_0000118: planchita @es
IAO_0000118: podișor @ro
IAO_0000118: prancheta de cobertura @pt
IAO_0000118: scîndurele de podișor @ro
IAO_0000118: soffitta @it
IAO_0000118: tampa interior @pt
IAO_0000118: tapa interior @es
IAO_0000118: täckbräda @sv
id: EUPH:7349

unix time
type: Class
subclass of: date and time data type
IAO_0000115: Unix time is a date and time representation widely used in computing. It measures time by the number of non-leap seconds that have elapsed since 00:00:00 UTC on 1 January 1970, the Unix epoch. [...] Unix time is sometimes referred to as Epoch time. This can be misleading since Unix time is not the only time system based on an epoch and the Unix epoch is not the only epoch used by other time systems.
IAO_0000117: Michael Rubinigg
IAO_0000118: Unix Epoch @nl
IAO_0000118: Unix time
IAO_0000118: Unixzeit @de
IAO_0000118: epoch time
IAO_0000118: heure Posix @fr
IAO_0000118: heure Unix @fr
IAO_0000118: tempo Unix @it
id: EUPH:7350

Axiom
annotated source: unix time
annotated property: IAO_0000115
annotated target: Unix time is a date and time representation widely used in computing. It measures time by the number of non-leap seconds that have elapsed since 00:00:00 UTC on 1 January 1970, the Unix epoch. [...] Unix time is sometimes referred to as Epoch time. This can be misleading since Unix time is not the only time system based on an epoch and the Unix epoch is not the only epoch used by other time systems.
source: https://en.wikipedia.org/w/index.php

date and time data type
type: Class
subclass of: https://w3id.org/euph/8076
IAO_0000115: Date and time data types for representing temporal values.
IAO_0000117: Michael Rubinigg
IAO_0000118: date and time data types
id: EUPH:7351

coordinated Universal Time (UTC) offset
type: Class
subclass of: coordinated universal time (UTC )
IAO_0000115: The UTC offset is the difference in hours and minutes between Coordinated Universal Time (UTC) and local solar time, at a particular place. This difference is expressed with respect to UTC and is generally shown in the format ±[hh]:[mm], ±[hh][mm], or ±[hh].
IAO_0000117: Michael Rubinigg
IAO_0000118: UTC offset
IAO_0000118: Zeitverschiebung @de
IAO_0000118: coordinated Universal Time offset
IAO_0000118: differenza di fuso orario @it
IAO_0000118: tijdverschuiving @nl
id: EUPH:7352

Axiom
annotated source: coordinated Universal Time (UTC) offset
annotated property: IAO_0000115
annotated target: The UTC offset is the difference in hours and minutes between Coordinated Universal Time (UTC) and local solar time, at a particular place. This difference is expressed with respect to UTC and is generally shown in the format ±[hh]:[mm], ±[hh][mm], or ±[hh].
source: https://en.wikipedia.org/w/index.php

entity meteorology
type: Class
subclass of: physical sciences
IAO_0000115: An entity in meteorology is an entity in the physical sciences domain that contains all classes related to aspects of pollinators and pollination studied in meteorology, i.e. the branch of science that deals with atmospheric phenomena and processes.
IAO_0000117: Michael Rubinigg
IAO_0000118: Meteorologie @de
IAO_0000118: meteorologia @it
IAO_0000118: meteorologie @nl
IAO_0000118: meteorology
IAO_0000118: météorologie @fr
id: EUPH:7354

Axiom
annotated source: entity meteorology
annotated property: IAO_0000115
annotated target: An entity in meteorology is an entity in the physical sciences domain that contains all classes related to aspects of pollinators and pollination studied in meteorology, i.e. the branch of science that deals with atmospheric phenomena and processes.
source: http://purl.obolibrary.org/obo/BFO_0000001

precipitation intensity
type: Class
subclass of: meteorological quantity
subclass of: Restriction
  on property: quality of
  some values from: precipitation
IAO_0000115: The rate of precipitation, usually expressed in millimeters or inches per hour.
IAO_0000117: Michael Rubinigg
IAO_0000118: Niederschlagsintensität @de
IAO_0000118: intensità delle precipitazioni @it
IAO_0000118: intensité des précipitations @fr
IAO_0000118: neerslagintensiteit @nl
IAO_0000118: precipitation intensity
IAO_0000118: rainfall intensity
id: EUPH:7356

Axiom
annotated source: precipitation intensity
annotated property: IAO_0000115
annotated target: The rate of precipitation, usually expressed in millimeters or inches per hour.
source: https://glossary.ametsoc.org/wiki/

wind speed
type: Class
subclass of: speed
subclass of: Restriction
  on property: characteristic of
  some values from: wind
IAO_0000115: The rate at which air is moving horizontally past a given point. It may be a 2-minute average speed (reported as wind speed) or an instantaneous speed (reported as a peak wind speed, wind gust, or squall).
IAO_0000117: Michael Rubinigg
IAO_0000118: Windgeschwindigkeit @de
IAO_0000118: velocità del vento @it
IAO_0000118: vitesse du vent @fr
IAO_0000118: wind speed
IAO_0000118: windsnelheid @nl
id: EUPH:7358

Axiom
annotated source: wind speed
annotated property: IAO_0000115
annotated target: The rate at which air is moving horizontally past a given point. It may be a 2-minute average speed (reported as wind speed) or an instantaneous speed (reported as a peak wind speed, wind gust, or squall).
source: https://forecast.weather.gov/glossary.php

wind direction
type: Class
subclass of: physical quantity
IAO_0000115: The true direction from which the wind is blowing at a given location (i.e., wind blowing from the north to the south is a north wind). It is normally measured in tens of degrees from 10 degrees clockwise through 360 degrees. North is 360 degrees. A wind direction of 0 degrees is only used when wind is calm.
IAO_0000117: Michael Rubinigg
IAO_0000118: Windrichtung @de
IAO_0000118: direction du vent @fr
IAO_0000118: direzione del vento @it
IAO_0000118: wind direction
IAO_0000118: windrichting @nl
id: EUPH:7359

Axiom
annotated source: wind direction
annotated property: IAO_0000115
annotated target: The true direction from which the wind is blowing at a given location (i.e., wind blowing from the north to the south is a north wind). It is normally measured in tens of degrees from 10 degrees clockwise through 360 degrees. North is 360 degrees. A wind direction of 0 degrees is only used when wind is calm.
source: https://forecast.weather.gov/glossary.php

time scale component
type: Class
subclass of: date and time expression
IAO_0000115: representation of a time scale unit [...] within a date and time expression [...] or representation [...] EXAMPLE 1: calendar year [...], calendar month [...], calendar day [...], clock hour [...], clock minute [..], clock second [...] are time scale components of a complete representation [...]. EXAMPLE 2: The calendar year time scale component is considered of a higher order than the calendar month time scale component, which is in turn of a higher order than the calendar day time scale component. Note 1 to entry: A time scale component is considered of a higher order of another, if the time scale unit it represents has a strictly larger time interval [...] than that of another; the latter time scale component is therefore considered to be of a lower order. Note 2 to entry: Common usage of this term often omits the leading phrase “time scale”, such as representing a “time scale component calendar year” by just “calendar year component”. This usage is deemed accepted in this document.
IAO_0000117: Michael Rubinigg
IAO_0000118: time scale component
id: EUPH:736

Axiom
annotated source: time scale component
annotated property: IAO_0000115
annotated target: representation of a time scale unit [...] within a date and time expression [...] or representation [...] EXAMPLE 1: calendar year [...], calendar month [...], calendar day [...], clock hour [...], clock minute [..], clock second [...] are time scale components of a complete representation [...]. EXAMPLE 2: The calendar year time scale component is considered of a higher order than the calendar month time scale component, which is in turn of a higher order than the calendar day time scale component. Note 1 to entry: A time scale component is considered of a higher order of another, if the time scale unit it represents has a strictly larger time interval [...] than that of another; the latter time scale component is therefore considered to be of a lower order. Note 2 to entry: Common usage of this term often omits the leading phrase “time scale”, such as representing a “time scale component calendar year” by just “calendar year component”. This usage is deemed accepted in this document.
source: https://www.iso.org/standard/70907.html

solar irradiance
type: Class
subclass of: physical quantity
IAO_0000115: Solar irradiance is the power per unit area (surface power density) received from the Sun in the form of electromagnetic radiation in the wavelength range of the measuring instrument. Solar irradiance is measured in watts per square metre (W/m2) in SI units.
IAO_0000117: Michael Rubinigg
IAO_0000118: irradiation solaire @fr
IAO_0000118: solar irradiance
IAO_0000118: solare Einstrahlung @de
id: EUPH:7361

Axiom
annotated source: solar irradiance
annotated property: IAO_0000115
annotated target: Solar irradiance is the power per unit area (surface power density) received from the Sun in the form of electromagnetic radiation in the wavelength range of the measuring instrument. Solar irradiance is measured in watts per square metre (W/m2) in SI units.
source: https://en.wikipedia.org/w/index.php

rate of solar radiation
type: Class
subclass of: physical quantity
IAO_0000115: The langley (Ly) is a unit of heat transmission, especially used to express the rate of solar radiation (or insolation) received by the earth.
IAO_0000117: Michael Rubinigg
IAO_0000118: rate of solar radiation
IAO_0000118: solare Bestrahlungsstärke @de
id: EUPH:7362

Axiom
annotated source: rate of solar radiation
annotated property: IAO_0000115
annotated target: The langley (Ly) is a unit of heat transmission, especially used to express the rate of solar radiation (or insolation) received by the earth.
source: https://en.wikipedia.org/w/index.php

colour model
type: Class
subclass of: information content entity in engineering
IAO_0000115: In color science, a color model is an abstract mathematical model describing the way colors can be represented as tuples of numbers, typically as three or four values or color components.
IAO_0000117: Michael Rubinigg
IAO_0000118: Farbsystem @de
IAO_0000118: colour model
IAO_0000118: kleursysteem @nl
IAO_0000118: modello di colore @it
IAO_0000118: modèle colorimétrique @fr
id: EUPH:7363

Axiom
annotated source: colour model
annotated property: IAO_0000115
annotated target: In color science, a color model is an abstract mathematical model describing the way colors can be represented as tuples of numbers, typically as three or four values or color components.
source: https://en.wikipedia.org/w/index.php

RGB colour model
type: Class
subclass of: colour model
IAO_0000115: The RGB color model is an additive color model in which the red, green and blue primary colors of light are added together in various ways to reproduce a broad array of colors. The name of the model comes from the initials of the three additive primary colors, red, green, and blue.
IAO_0000117: Michael Rubinigg
IAO_0000118: RGB @it
IAO_0000118: RGB Farbmodell @de
IAO_0000118: RGB colour model
IAO_0000118: RGB-kleursysteem @nl
IAO_0000118: modello di colore RGB @it
IAO_0000118: modèle colorimétrique RVB @fr
IAO_0000118: rouge-vert-bleu @fr
id: EUPH:7364

Axiom
annotated source: RGB colour model
annotated property: IAO_0000115
annotated target: The RGB color model is an additive color model in which the red, green and blue primary colors of light are added together in various ways to reproduce a broad array of colors. The name of the model comes from the initials of the three additive primary colors, red, green, and blue.
source: https://en.wikipedia.org/w/index.php

RGB numeric representation
type: Class
subclass of: engineering quantity
subclass of: Restriction
  on property: quality of
  some values from: RGB colour model
IAO_0000115: A colour in the RGB colour model expressed with numbers.
IAO_0000117: Michael Rubinigg
IAO_0000118: numeric representation of RGB colour model
id: EUPH:7365

RGB digital 8-bit per channel notation
type: Class
subclass of: RGB numeric representation
IAO_0000115: The numerical representation of an RGB colour code, expressed as RGB triplets with decimal or hexadecimal numbers. The first, second and third triplets indicate how much red, green or blue is contained in the colour. With decimal numbers, the colour code is written between round brackets, the triplets are unsigned integers that are separated by a comma and can have values from 0 to 255. For hexadecimal numbers, the code is written as a single block beginning with #, followed by hexadecimal numbers that can take values from 00 to FF.
IAO_0000117: Michael Rubinigg
IAO_0000118: RGB digital 8-bit per channel notation
id: EUPH:7366

spatial region in geography
type: Class
subclass of: immaterial entity in geography
subclass of: Restriction
  on property: member of
  some values from: https://w3id.org/euph/7507
IAO_0000115: A spatial region in geography is an immaterial entity in the geography domain that is a spatial projection of a portion of spacetime, but whose location is not determined relative to some material entity.
IAO_0000117: Michael Rubinigg
IAO_0000118: Standort @de
IAO_0000118: locatie @nl
IAO_0000118: location
IAO_0000118: luogo @it
IAO_0000118: position @fr
id: EUPH:7367

Axiom
annotated source: spatial region in geography
annotated property: IAO_0000115
annotated target: A spatial region in geography is an immaterial entity in the geography domain that is a spatial projection of a portion of spacetime, but whose location is not determined relative to some material entity.
has db xref: 10.1371/journal.pone.0029715
source: http://purl.obolibrary.org/obo/BFO_0000006

user
type: Class
subclass of: personal data
IAO_0000115: A user is a person who utilizes a computer or network service. A user often has a user account and is identified to the system by a username (or user name).
IAO_0000117: Michael Rubinigg
IAO_0000118: Benutzer @de
IAO_0000118: user
IAO_0000118: utente @it
IAO_0000118: utilisateur @fr
id: EUPH:7368

Axiom
annotated source: user
annotated property: IAO_0000115
annotated target: A user is a person who utilizes a computer or network service. A user often has a user account and is identified to the system by a username (or user name).
source: https://en.wikipedia.org/w/index.php

entity in engineering
type: Class
subclass of: technology
IAO_0000115: An entity in engineering is an entity in the technology domain that contains all classes related to aspects of pollinators and pollination studied in engineering, i.e. the discipline concerned with the application of scientific knowledge to solve practical issues in commerce or industry.
IAO_0000117: Michael Rubinigg
IAO_0000118: Entität in den Ingenieurwissenschaften @de
IAO_0000118: entiteit in het ingenieurswezen @nl
IAO_0000118: entity in engineering
IAO_0000118: entità nell'ingegneria @it
IAO_0000118: entité en ingénierie @fr
id: EUPH:7369

Axiom
annotated source: entity in engineering
annotated property: IAO_0000115
annotated target: An entity in engineering is an entity in the technology domain that contains all classes related to aspects of pollinators and pollination studied in engineering, i.e. the discipline concerned with the application of scientific knowledge to solve practical issues in commerce or industry.
source: http://purl.obolibrary.org/obo/BFO_0000001
source: https://ncit.nci.nih.gov/ncitbrowser/pages/home.jsf

solar beeswax extractor
type: Class
subclass of: beeswax extractor
subclass of: Restriction
  on property: has function
  some values from: solar powered drive
subclass of: Restriction
  on property: involved in
  some values from: beeswax harvesting
IAO_0000115: A solar beewax extractor is a beeswax exctractor that is powered by sunlight.
IAO_0000117: Michael Rubinigg
IAO_0000118: Sonnenwachsschmelzer @de
IAO_0000118: cerificador solar @es
IAO_0000118: cérificateur solaire @fr
IAO_0000118: extractor solar de cera @pt
IAO_0000118: sceratrice solare @it
IAO_0000118: solar wax extractor
IAO_0000118: solvaxsmältare @sv
IAO_0000118: solvokssmelter @da
IAO_0000118: topitor solar @ro
IAO_0000118: zonnewassmelter @nl
id: EUPH:737

appliance
type: Class
subclass of: object in engineering
IAO_0000115: An appliance is a constructed tool that can extend an individual's ability to modify features of the surrounding environment or help them accomplish a particular task.
IAO_0000117: Michael Rubinigg
IAO_0000118: Gerät @de
IAO_0000118: apparaat @nl
IAO_0000118: apparecchio @it
IAO_0000118: appareil @fr
IAO_0000118: appliance
id: EUPH:7370

Axiom
annotated source: appliance
annotated property: IAO_0000115
annotated target: An appliance is a constructed tool that can extend an individual's ability to modify features of the surrounding environment or help them accomplish a particular task.
source: https://simple.wikipedia.org/w/index.php

entity in geology
type: Class
subclass of: physical sciences
IAO_0000115: An entity in geology is an entity in the physical sciences domain that contains all classes related to aspects of pollinators and pollination studied in geology, i.e. the rocks of which the earth is composed, and the processes by which they change over time.
IAO_0000117: Michael Rubinigg
IAO_0000118: Geologie @de
IAO_0000118: geologia @it
IAO_0000118: geologie @nl
IAO_0000118: geology
IAO_0000118: géologie @fr
id: EUPH:7372

Axiom
annotated source: entity in geology
annotated property: IAO_0000115
annotated target: An entity in geology is an entity in the physical sciences domain that contains all classes related to aspects of pollinators and pollination studied in geology, i.e. the rocks of which the earth is composed, and the processes by which they change over time.
source: http://purl.obolibrary.org/obo/BFO_0000001

bee-friendliness (BF) index
type: Class
subclass of: biological quantity
subclass of: Restriction
  on property: quality of
  some values from: habitat
IAO_0000115: Bee-friendliness (BF) index, developed by the B-GOOD project, corresponds to the contribution of each plant species in terms of bee-friendliness within a particular BIOEUNIS habitat. The BF index was calculated as the multiplication of the BF Value by occurrence and by average cover, i.e. BF Index = BF Value x Occurrence x Average cover. The higher the BF index, the greater the contribution of a plant species in terms of bee-friendliness within the habitat.
IAO_0000117: Michael Rubinigg
IAO_0000118: BF index
IAO_0000118: bee-friendliness index
id: EUPH:7376

Axiom
annotated source: bee-friendliness (BF) index
annotated property: IAO_0000115
annotated target: Bee-friendliness (BF) index, developed by the B-GOOD project, corresponds to the contribution of each plant species in terms of bee-friendliness within a particular BIOEUNIS habitat. The BF index was calculated as the multiplication of the BF Value by occurrence and by average cover, i.e. BF Index = BF Value x Occurrence x Average cover. The higher the BF index, the greater the contribution of a plant species in terms of bee-friendliness within the habitat.
source: https://beehealthdata.org/datasets/cdf42e4c-7e8c-44cc-a72c-dd080a16494f

BIOEUNIS habitat code
type: Class
subclass of: code set of biological entities
subclass of: Restriction
  on property: functionally related to
  some values from: habitat
IAO_0000115: Terrestrial Level 2 habitat code of the spatially explicit habitat classification and typology system applied by the B-GOOD Project by merging the European Nature Information System (EUNIS) and the Biogeographical regions in Europe.
IAO_0000117: Michael Rubinigg
IAO_0000118: BIOEUNIS habitat code
id: EUPH:7377

Axiom
annotated source: BIOEUNIS habitat code
annotated property: IAO_0000115
annotated target: Terrestrial Level 2 habitat code of the spatially explicit habitat classification and typology system applied by the B-GOOD Project by merging the European Nature Information System (EUNIS) and the Biogeographical regions in Europe.
source: https://b-good-project.eu/

species
type: Class
subclass of: https://w3id.org/euph/7684
subclass of: Restriction
  on property: member of
  some values from: subgenus
IAO_0000115: A species [...] is a population of organisms in which any two individuals of the appropriate sexes or mating types can produce fertile offspring, typically by sexual reproduction. It is the basic unit of classification and a taxonomic rank of an organism, as well as a unit of biodiversity. Other ways of defining species include their karyotype, DNA sequence, morphology, behaviour, or ecological niche. In addition, paleontologists use the concept of the chronospecies since fossil reproduction cannot be examined.
IAO_0000117: Michael Rubinigg
IAO_0000118: Art @de
IAO_0000118: art @da
IAO_0000118: especie @es
IAO_0000118: espèce @fr
IAO_0000118: espécie @pt
IAO_0000118: soort @nl
IAO_0000118: sort @sv
IAO_0000118: specie @it
IAO_0000118: species
id: EUPH:7378

Axiom
annotated source: species
annotated property: IAO_0000115
annotated target: A species [...] is a population of organisms in which any two individuals of the appropriate sexes or mating types can produce fertile offspring, typically by sexual reproduction. It is the basic unit of classification and a taxonomic rank of an organism, as well as a unit of biodiversity. Other ways of defining species include their karyotype, DNA sequence, morphology, behaviour, or ecological niche. In addition, paleontologists use the concept of the chronospecies since fossil reproduction cannot be examined.
source: https://en.wikipedia.org/w/index.php

subspecies of Apis mellifera
type: Class
subclass of: https://www.gbif.org/species/1341976
IAO_0000115: A subspecies of the species Western honey bee (Apis mellifera L).
IAO_0000117: Michael Rubinigg
IAO_0000118: Unterart von Apis mellifera @de
IAO_0000118: ondersoort van Apis mellifera @nl
IAO_0000118: sous-espèces d'Apis mellifera @fr
IAO_0000118: subspecies of Apis mellifera
id: EUPH:7379

EUNIS habitat classification
type: Class
subclass of: code set of biological entities
subclass of: Restriction
  on property: generically depends on
  some values from: habitat
subclass of: Restriction
  on property: member of
  some values from: https://w3id.org/euph/7834
IAO_0000115: European Nature Information System (EUNIS) habitat classification is a comprehensive pan-European system for habitat identification. The classification is hierarchical and covers all types of habitats from natural to artificial, from terrestrial to freshwater and marine. The habitat types are identified by specific codes, names and descriptions and come with cross-walks to other habitat typologies.
IAO_0000117: Michael Rubinigg
IAO_0000118: EUNIS habitat classification
id: EUPH:7380

Axiom
annotated source: EUNIS habitat classification
annotated property: IAO_0000115
annotated target: European Nature Information System (EUNIS) habitat classification is a comprehensive pan-European system for habitat identification. The classification is hierarchical and covers all types of habitats from natural to artificial, from terrestrial to freshwater and marine. The habitat types are identified by specific codes, names and descriptions and come with cross-walks to other habitat typologies.
has db xref: 10.1111/avsc.12519

EUNIS habitat code
type: Class
subclass of: identifier of biological entities
subclass of: Restriction
  on property: quality of
  some values from: habitat
IAO_0000115: Code issued by the EUNIS habitat classification.
IAO_0000117: Michael Rubinigg
IAO_0000118: EUNIS habitat code
id: EUPH:7381

EUNIS level 1 habitat code
type: Class
subclass of: EUNIS habitat code
IAO_0000115: Highest rank of the EUNIS habitat classification hierarchy.
IAO_0000117: Michael Rubinigg
IAO_0000118: EUNIS level 1 habitat code
id: EUPH:7382

Axiom
annotated source: EUNIS level 1 habitat code
annotated property: IAO_0000115
annotated target: Highest rank of the EUNIS habitat classification hierarchy.
has db xref: 10.1111/avsc.12519

EUNIS level 2 habitat code
type: Class
subclass of: EUNIS habitat code
IAO_0000115: Second highest rank of the EUNIS habitat classification hierarchy.
IAO_0000117: Michael Rubinigg
IAO_0000118: EUNIS level 2 habitat code
id: EUPH:7383

Axiom
annotated source: EUNIS level 2 habitat code
annotated property: IAO_0000115
annotated target: Second highest rank of the EUNIS habitat classification hierarchy.
has db xref: 10.1111/avsc.12519

EUNIS level 3 habitat code
type: Class
subclass of: EUNIS habitat code
IAO_0000115: Third highest rank of the EUNIS habitat classification hierarchy.
IAO_0000117: Michael Rubinigg
IAO_0000118: EUNIS level 3 habitat code
id: EUPH:7384

Axiom
annotated source: EUNIS level 3 habitat code
annotated property: IAO_0000115
annotated target: Third highest rank of the EUNIS habitat classification hierarchy.
has db xref: 10.1111/avsc.12519

genus
type: Class
subclass of: https://w3id.org/euph/7684
subclass of: Restriction
  on property: member of
  some values from: subtribe
subclass of: Restriction
  on property: member of
  some values from: https://w3id.org/euph/7639
IAO_0000115: The full scientific name of the genus in which the dwc:Taxon is classified.
IAO_0000117: Michael Rubinigg
IAO_0000118: Gattung @de
IAO_0000118: gen @ro
IAO_0000118: genere @it
IAO_0000118: genre @fr
IAO_0000118: genus @da
IAO_0000118: geslacht @nl
IAO_0000118: género @es
IAO_0000118: slekt @no
IAO_0000118: släkte @sv
IAO_0000118: slægt @da
id: EUPH:7385

Axiom
annotated source: genus
annotated property: IAO_0000115
annotated target: The full scientific name of the genus in which the dwc:Taxon is classified.
has db xref: 10.1371/journal.pone.0029715

family
type: Class
subclass of: https://w3id.org/euph/7684
subclass of: Restriction
  on property: member of
  some values from: superfamily
subclass of: Restriction
  on property: member of
  some values from: https://w3id.org/euph/7639
IAO_0000115: The full scientific name of the family in which the dwc:Taxon is classified.
IAO_0000117: Michael Rubinigg
IAO_0000118: Familie @de
IAO_0000118: famiglia @it
IAO_0000118: familie @nl
IAO_0000118: famille @fr
IAO_0000118: family
id: EUPH:7386

Axiom
annotated source: family
annotated property: IAO_0000115
annotated target: The full scientific name of the family in which the dwc:Taxon is classified.
has db xref: 10.1371/journal.pone.0029715

calendar week
type: Class
subclass of: time scale unit
subclass of: Restriction
  on property: member of
  some values from: https://w3id.org/euph/838
IAO_0000115: time scale unit [...] of seven calendar days [...] which begins on Monday and ends on Sunday, according to the week calendar [...]
IAO_0000117: Michael Rubinigg
IAO_0000118: Kalenderwoche @de
IAO_0000118: calendar week
id: EUPH:7387

Axiom
annotated source: calendar week
annotated property: IAO_0000115
annotated target: time scale unit [...] of seven calendar days [...] which begins on Monday and ends on Sunday, according to the week calendar [...]
source: https://www.iso.org/standard/70907.html

time axis
type: Class
subclass of: ISO 8601 basic concepts
IAO_0000115: mathematical representation of the succession in time according to the space-time model of instantaneous events along a unique axis Note 1 to entry: According to the theory of special relativity, the time axis depends on the choice of a spatial reference frame. Note 2 to entry: In IEC 60050-113:2011, 113-01-03, time according to the space-time model is defined to be the one-dimensional subspace of space-time, locally orthogonal to space. [SOURCE:IEC 60050-113:2011, 113-01-07, modified — The words “according to the space-time” have been added; the phrase “special theory of relativity” has been changed to “theory of special relativity” for clarity; Note 2 to entry has been added.]
IAO_0000117: Michael Rubinigg
IAO_0000118: time axis
id: EUPH:7388

Axiom
annotated source: time axis
annotated property: IAO_0000115
annotated target: mathematical representation of the succession in time according to the space-time model of instantaneous events along a unique axis Note 1 to entry: According to the theory of special relativity, the time axis depends on the choice of a spatial reference frame. Note 2 to entry: In IEC 60050-113:2011, 113-01-03, time according to the space-time model is defined to be the one-dimensional subspace of space-time, locally orthogonal to space. [SOURCE:IEC 60050-113:2011, 113-01-07, modified — The words “according to the space-time” have been added; the phrase “special theory of relativity” has been changed to “theory of special relativity” for clarity; Note 2 to entry has been added.]
source: https://www.iso.org/standard/70907.html

instant
type: Class
subclass of: time axis
IAO_0000115: point on the time axis [...] Note 1 to entry: An instantaneous event occurs at a specific instant. [SOURCE:IEC 60050-113:2011, 113-01-08]
IAO_0000117: Michael Rubinigg
IAO_0000118: instant
id: EUPH:7389

Axiom
annotated source: instant
annotated property: IAO_0000115
annotated target: point on the time axis [...] Note 1 to entry: An instantaneous event occurs at a specific instant. [SOURCE:IEC 60050-113:2011, 113-01-08]
source: https://www.iso.org/standard/70907.html

time scale
type: Class
subclass of: ISO 8601 basic concepts
IAO_0000115: system of ordered marks which can be attributed to instants [...] on the time axis [...], one instant being chosen as the origin Note 1 to entry: A time scale may amongst others be chosen as: — continuous, e.g. international atomic time (TAI) (see IEC 60050-713:1998, 713-05-18); — continuous with discontinuities, e.g. UTC [...] due to leap seconds [...], standard time [...] due to summer time and winter time; — successive steps, e.g. calendars [...], where the time axis [...] is split up into a succession of consecutive time intervals [...] and the same mark is attributed to all instants of each time interval; — discrete, e.g. in digital techniques. [SOURCE:IEC 60050-113:2011, 113-01-11, modified — The words “amongst others” in Note 1 to entry have been added; NOTEs 2 and 3 have been deleted.]
IAO_0000117: Michael Rubinigg
IAO_0000118: Zeitskala @de
IAO_0000118: time scale
id: EUPH:7390

Axiom
annotated source: time scale
annotated property: IAO_0000115
annotated target: system of ordered marks which can be attributed to instants [...] on the time axis [...], one instant being chosen as the origin Note 1 to entry: A time scale may amongst others be chosen as: — continuous, e.g. international atomic time (TAI) (see IEC 60050-713:1998, 713-05-18); — continuous with discontinuities, e.g. UTC [...] due to leap seconds [...], standard time [...] due to summer time and winter time; — successive steps, e.g. calendars [...], where the time axis [...] is split up into a succession of consecutive time intervals [...] and the same mark is attributed to all instants of each time interval; — discrete, e.g. in digital techniques. [SOURCE:IEC 60050-113:2011, 113-01-11, modified — The words “amongst others” in Note 1 to entry have been added; NOTEs 2 and 3 have been deleted.]
source: https://www.iso.org/standard/70907.html

time interval
type: Class
subclass of: time axis
IAO_0000115: part of the time axis [...] limited by two instants [...] and, unless otherwise stated, the limiting instants themselves [SOURCE:IEC 60050-113:2011, 113-01-10, modified — The words “and, unless otherwise stated, the limiting instants themselves” have been added; the NOTEs have been deleted.]
IAO_0000117: Michael Rubinigg
IAO_0000118: time interval
id: EUPH:7391

Axiom
annotated source: time interval
annotated property: IAO_0000115
annotated target: part of the time axis [...] limited by two instants [...] and, unless otherwise stated, the limiting instants themselves [SOURCE:IEC 60050-113:2011, 113-01-10, modified — The words “and, unless otherwise stated, the limiting instants themselves” have been added; the NOTEs have been deleted.]
source: https://www.iso.org/standard/70907.html

time scale unit
type: Class
subclass of: https://w3id.org/euph/970
subclass of: Restriction
  on property: member of
  some values from: ISO 8601 basic concepts
subclass of: Restriction
  on property: is unit of
  some values from: duration
IAO_0000115: unit of measurement of a duration [...] EXAMPLE 1:Calendar year, calendar month and calendar day are time scale units of the Gregorian calendar. EXAMPLE 2:Clock hour, clock minutes and clock seconds are time scale units of the 24-hour clock.
IAO_0000117: Michael Rubinigg
IAO_0000118: time scale unit
id: EUPH:7393

Axiom
annotated source: time scale unit
annotated property: IAO_0000115
annotated target: unit of measurement of a duration [...] EXAMPLE 1:Calendar year, calendar month and calendar day are time scale units of the Gregorian calendar. EXAMPLE 2:Clock hour, clock minutes and clock seconds are time scale units of the 24-hour clock.
source: https://www.iso.org/standard/70907.html

calendar
type: Class
subclass of: time scale
IAO_0000115: time scale [...] that uses the time scale unit [...] of calendar day [...] as its basic unit EXAMPLE:The Gregorian calendar [...] is a type of calendar. Note 1 to entry: calendar month [...] and calendar year [...] are time scale units often included in a calendar.
IAO_0000117: Michael Rubinigg
IAO_0000118: Kalender @de
IAO_0000118: calendar
id: EUPH:7394

Axiom
annotated source: calendar
annotated property: IAO_0000115
annotated target: time scale [...] that uses the time scale unit [...] of calendar day [...] as its basic unit EXAMPLE:The Gregorian calendar [...] is a type of calendar. Note 1 to entry: calendar month [...] and calendar year [...] are time scale units often included in a calendar.
source: https://www.iso.org/standard/70907.html

Gregorian calendar
type: Class
subclass of: calendar
IAO_0000115: calendar [...] in general use that defines a calendar year [...] that closely approximates the tropical year Note 1 to entry: In this document the term “Gregorian calendar” is used to refer to the time scale [...].
IAO_0000117: Michael Rubinigg
IAO_0000118: Gregorian calendar
id: EUPH:7395

Axiom
annotated source: Gregorian calendar
annotated property: IAO_0000115
annotated target: calendar [...] in general use that defines a calendar year [...] that closely approximates the tropical year Note 1 to entry: In this document the term “Gregorian calendar” is used to refer to the time scale [...].
source: https://www.iso.org/standard/70907.html

week calendar
type: Class
subclass of: calendar
IAO_0000115: calendar [...] based on an unbounded series of contiguous calendar weeks [...] that uses the time scale unit [...] of calendar week as its basic unit to represent a calendar year [...], according to the rule that the first calendar week of a calendar year is the week including the first Thursday of that year, and that the last one is the week immediately preceding the first calendar week of the next calendar year Note 1 to entry: This rule is based on the principle that a week belongs to the calendar year to which the majority of its calendar days [...] belong. Note 2 to entry: In the week calendar, calendar days of the first and last calendar week of a calendar year may belong to the previous and the next calendar year respectively in the Gregorian calendar [...].
IAO_0000117: Michael Rubinigg
IAO_0000118: week calendar
id: EUPH:7396

Axiom
annotated source: week calendar
annotated property: IAO_0000115
annotated target: calendar [...] based on an unbounded series of contiguous calendar weeks [...] that uses the time scale unit [...] of calendar week as its basic unit to represent a calendar year [...], according to the rule that the first calendar week of a calendar year is the week including the first Thursday of that year, and that the last one is the week immediately preceding the first calendar week of the next calendar year Note 1 to entry: This rule is based on the principle that a week belongs to the calendar year to which the majority of its calendar days [...] belong. Note 2 to entry: In the week calendar, calendar days of the first and last calendar week of a calendar year may belong to the previous and the next calendar year respectively in the Gregorian calendar [...].
source: https://www.iso.org/standard/70907.html

coordinated universal time (UTC )
type: Class
subclass of: time scale
IAO_0000115: time scale [...] with the same rate as International Atomic Time (TAI), but differing from TAI only by an integral number of seconds [...] Note 1 to entry: UTC is the time standard commonly used across the world from which local time is derived. Note 2 to entry: UTC is produced by the Bureau International des Poids et Mesures (BIPM), i.e. the International Bureau of Weights and Measures. Note 3 to entry: TAI is a continuous time scale produced by the BIPM based on the best realizations of the SI second. TAI is a realization of Terrestrial Time (TT) with the same rate as that of TT, as defined by the International Astronomical Union Resolution B1.9 (2000). [SOURCE:BIPM Recommendation CCTF 3 (2017), modified — The definition of TAI has been included as Note 3 to entry.]
IAO_0000117: Michael Rubinigg
IAO_0000118: Coordinated Universal Time (UTC)
IAO_0000118: UTC
id: EUPH:7397

Axiom
annotated source: coordinated universal time (UTC )
annotated property: IAO_0000115
annotated target: time scale [...] with the same rate as International Atomic Time (TAI), but differing from TAI only by an integral number of seconds [...] Note 1 to entry: UTC is the time standard commonly used across the world from which local time is derived. Note 2 to entry: UTC is produced by the Bureau International des Poids et Mesures (BIPM), i.e. the International Bureau of Weights and Measures. Note 3 to entry: TAI is a continuous time scale produced by the BIPM based on the best realizations of the SI second. TAI is a realization of Terrestrial Time (TT) with the same rate as that of TT, as defined by the International Astronomical Union Resolution B1.9 (2000). [SOURCE:BIPM Recommendation CCTF 3 (2017), modified — The definition of TAI has been included as Note 3 to entry.]
source: https://www.iso.org/standard/70907.html

leap second
type: Class
subclass of: ISO 8601 basic concepts
IAO_0000115: intentional time step of one second [...] to adjust UTC [...] to ensure appropriate agreement with UT1, a time scale [...] based on the rotation of the Earth Note 1 to entry: See also ITU-R TF.460-6. Note 2 to entry: An inserted second is called a positive leap second and an omitted second is called a negative leap second. A positive leap second is inserted after [23:59:59Z] and can be represented as [23:59:60Z]. A negative leap second is achieved by the omission of [23:59:59Z]. Insertion or omission takes place as determined by the International Earth Rotation and Reference Systems Service (IERS), normally on 30 June or 31 December, but if necessary on 31 March or 30 September.
IAO_0000117: Michael Rubinigg
IAO_0000118: Schaltsekunde @de
IAO_0000118: leap second
id: EUPH:7398

Axiom
annotated source: leap second
annotated property: IAO_0000115
annotated target: intentional time step of one second [...] to adjust UTC [...] to ensure appropriate agreement with UT1, a time scale [...] based on the rotation of the Earth Note 1 to entry: See also ITU-R TF.460-6. Note 2 to entry: An inserted second is called a positive leap second and an omitted second is called a negative leap second. A positive leap second is inserted after [23:59:59Z] and can be represented as [23:59:60Z]. A negative leap second is achieved by the omission of [23:59:59Z]. Insertion or omission takes place as determined by the International Earth Rotation and Reference Systems Service (IERS), normally on 30 June or 31 December, but if necessary on 31 March or 30 September.
source: https://www.iso.org/standard/70907.html

time shift
type: Class
subclass of: ISO 8601 basic concepts
IAO_0000115: constant duration [...] difference between times [...] of two time scales [...]
IAO_0000117: Michael Rubinigg
IAO_0000118: time shift
id: EUPH:7399

Axiom
annotated source: time shift
annotated property: IAO_0000115
annotated target: constant duration [...] difference between times [...] of two time scales [...]
source: https://www.iso.org/standard/70907.html

standard time
type: Class
subclass of: time scale
IAO_0000115: time scale [...] derived from UTC [...], by a time shift [...] established in a given location by the competent authority EXAMPLE 1:Some standard times do not vary within a year, such as US Eastern Standard Time (EST), US Eastern Daylight Time (EDT), Australia Western Standard Time (AWST), China Standard Time (CST), Hong Kong Standard Time (HKT), Korea Standard Time (KST) and Japanese Standard Time (JST). EXAMPLE 2:Some standard times vary within a year, such as US Eastern Time (ET) and Australian Central Standard Time (ACST). Note 1 to entry: The time shift of a standard time may vary in the course of a year, such as due to daylight savings. [SOURCE:IEC 60050-113:2011, 113-01-17, modified — The original NOTE has been deleted; EXAMPLE 1 and 2 and Note 1 to entry has been added.]
IAO_0000117: Michael Rubinigg
IAO_0000118: standard time
id: EUPH:7400

Axiom
annotated source: standard time
annotated property: IAO_0000115
annotated target: time scale [...] derived from UTC [...], by a time shift [...] established in a given location by the competent authority EXAMPLE 1:Some standard times do not vary within a year, such as US Eastern Standard Time (EST), US Eastern Daylight Time (EDT), Australia Western Standard Time (AWST), China Standard Time (CST), Hong Kong Standard Time (HKT), Korea Standard Time (KST) and Japanese Standard Time (JST). EXAMPLE 2:Some standard times vary within a year, such as US Eastern Time (ET) and Australian Central Standard Time (ACST). Note 1 to entry: The time shift of a standard time may vary in the course of a year, such as due to daylight savings. [SOURCE:IEC 60050-113:2011, 113-01-17, modified — The original NOTE has been deleted; EXAMPLE 1 and 2 and Note 1 to entry has been added.]
source: https://www.iso.org/standard/70907.html

clock
type: Class
subclass of: time scale
IAO_0000115: time scale [...] suited for intra-day time measurements EXAMPLE:The 24-hour clock [...] is a type of clock. Note 1 to entry: clock second [...], clock minute [...] and clock hour [...] are often time scale units [...] included in a clock.
IAO_0000117: Michael Rubinigg
IAO_0000118: clock
id: EUPH:7401

Axiom
annotated source: clock
annotated property: IAO_0000115
annotated target: time scale [...] suited for intra-day time measurements EXAMPLE:The 24-hour clock [...] is a type of clock. Note 1 to entry: clock second [...], clock minute [...] and clock hour [...] are often time scale units [...] included in a clock.
source: https://www.iso.org/standard/70907.html

clock hour
type: Class
subclass of: time scale unit
subclass of: Restriction
  on property: member of
  some values from: ISO 8601 basic concepts
IAO_0000115: time scale unit [...] whose duration [...] is one hour [...] Clock hour is in common parlance often referred to as hour, however in this document clock hour and hour have different definitions.
IAO_0000117: Michael Rubinigg
IAO_0000118: clock hour
id: EUPH:7402

Axiom
annotated source: clock hour
annotated property: IAO_0000115
annotated target: time scale unit [...] whose duration [...] is one hour [...] Clock hour is in common parlance often referred to as hour, however in this document clock hour and hour have different definitions.
source: https://www.iso.org/standard/70907.html

24-hour clock
type: Class
subclass of: clock
IAO_0000115: clock [...] that subdivides a calendar day [...] into 24 clock hours [...] Note 1 to entry: UTC [...] forms the basis of today’s 24-hour clocks [...].
IAO_0000117: Michael Rubinigg
IAO_0000118: 24-hour clock
id: EUPH:7403

Axiom
annotated source: 24-hour clock
annotated property: IAO_0000115
annotated target: clock [...] that subdivides a calendar day [...] into 24 clock hours [...] Note 1 to entry: UTC [...] forms the basis of today’s 24-hour clocks [...].
source: https://www.iso.org/standard/70907.html

clock minute
type: Class
subclass of: time scale unit
subclass of: Restriction
  on property: member of
  some values from: ISO 8601 basic concepts
IAO_0000115: time scale unit [...] whose duration [...] is one minute [...] Clock minute is in common parlance often referred to as minute, however in this document clock minute and minute have different definitions.
IAO_0000117: Michael Rubinigg
IAO_0000118: clock minute
id: EUPH:7404

Axiom
annotated source: clock minute
annotated property: IAO_0000115
annotated target: time scale unit [...] whose duration [...] is one minute [...] Clock minute is in common parlance often referred to as minute, however in this document clock minute and minute have different definitions.
source: https://www.iso.org/standard/70907.html

clock second
type: Class
subclass of: time scale unit
subclass of: Restriction
  on property: member of
  some values from: ISO 8601 basic concepts
IAO_0000115: time scale unit [...] whose duration [...] is one second [...]. Note 1 to entry: Clock second is in common parlance often referred to as second, however in this document clock second and second have different definitions.
IAO_0000117: Michael Rubinigg
IAO_0000118: clock second
id: EUPH:7405

Axiom
annotated source: clock second
annotated property: IAO_0000115
annotated target: time scale unit [...] whose duration [...] is one second [...]. Note 1 to entry: Clock second is in common parlance often referred to as second, however in this document clock second and second have different definitions.
source: https://www.iso.org/standard/70907.html

calendar week of year
type: Class
subclass of: time scale unit
IAO_0000115: ordinal number of a calendar week [...] within a calendar year [...] of the week calendar [...]
IAO_0000117: Michael Rubinigg
IAO_0000118: Kalenderwoche (KW) @de
IAO_0000118: calendar week of year
id: EUPH:7406

Axiom
annotated source: calendar week of year
annotated property: IAO_0000115
annotated target: ordinal number of a calendar week [...] within a calendar year [...] of the week calendar [...]
source: https://www.iso.org/standard/70907.html

calendar day of month
type: Class
subclass of: time scale unit
subclass of: Restriction
  on property: member of
  some values from: https://w3id.org/euph/7639
subclass of: Restriction
  on property: member of
  some values from: https://w3id.org/euph/838
IAO_0000115: ordinal number of a calendar day [...] within a calendar month [...]
IAO_0000117: Michael Rubinigg
IAO_0000118: calendar day of month
id: EUPH:7407

Axiom
annotated source: calendar day of month
annotated property: IAO_0000115
annotated target: ordinal number of a calendar day [...] within a calendar month [...]
has db xref: 10.1371/journal.pone.0029715
source: https://www.iso.org/standard/70907.html

calendar date
type: Class
subclass of: time scale unit
subclass of: Restriction
  on property: member of
  some values from: https://w3id.org/euph/838
IAO_0000115: particular calendar day [...] represented by its calendar year [...], its calendar month [...] and its calendar day of month [...]
IAO_0000117: Michael Rubinigg
IAO_0000118: calendar date
id: EUPH:7408

Axiom
annotated source: calendar date
annotated property: IAO_0000115
annotated target: particular calendar day [...] represented by its calendar year [...], its calendar month [...] and its calendar day of month [...]
source: https://www.iso.org/standard/70907.html

calendar day of year
type: Class
subclass of: time scale unit
subclass of: Restriction
  on property: member of
  some values from: https://w3id.org/euph/838
IAO_0000115: ordinal number of a calendar day [...] within a calendar year [...]
IAO_0000117: Michael Rubinigg
IAO_0000118: calendar day of year
id: EUPH:7409

Axiom
annotated source: calendar day of year
annotated property: IAO_0000115
annotated target: ordinal number of a calendar day [...] within a calendar year [...]
source: https://www.iso.org/standard/70907.html

date and time representation
type: Class
subclass of: date and time expression
IAO_0000115: representation of the format of one or more date and time expressions [...] EXAMPLE: [date] is a date and time representation that can be expanded as [year][month][day], which itself can be expanded into [YYYY][MM][DD]; ‘20180801’ is a date and time expression that conforms to this representation.
IAO_0000117: Michael Rubinigg
IAO_0000118: date and time representation
id: EUPH:741

Axiom
annotated source: date and time representation
annotated property: IAO_0000115
annotated target: representation of the format of one or more date and time expressions [...] EXAMPLE: [date] is a date and time representation that can be expanded as [year][month][day], which itself can be expanded into [YYYY][MM][DD]; ‘20180801’ is a date and time expression that conforms to this representation.
source: https://www.iso.org/standard/70907.html

ordinal date
type: Class
subclass of: time scale unit
subclass of: Restriction
  on property: member of
  some values from: https://w3id.org/euph/838
IAO_0000115: particular calendar day [...] represented by its calendar year [...] and its calendar day of year [...]
IAO_0000117: Michael Rubinigg
IAO_0000118: ordinal date
id: EUPH:7410

Axiom
annotated source: ordinal date
annotated property: IAO_0000115
annotated target: particular calendar day [...] represented by its calendar year [...] and its calendar day of year [...]
source: https://www.iso.org/standard/70907.html

calendar day of week
type: Class
subclass of: time scale unit
subclass of: Restriction
  on property: member of
  some values from: https://w3id.org/euph/838
IAO_0000115: day amongst the sequence of week calendar [...] days, namely, Monday, Tuesday, Wednesday, Thursday, Friday, Saturday or Sunday
IAO_0000117: Michael Rubinigg
IAO_0000118: calendar day of week
id: EUPH:7411

Axiom
annotated source: calendar day of week
annotated property: IAO_0000115
annotated target: day amongst the sequence of week calendar [...] days, namely, Monday, Tuesday, Wednesday, Thursday, Friday, Saturday or Sunday
source: https://www.iso.org/standard/70907.html

week date
type: Class
subclass of: time scale unit
subclass of: Restriction
  on property: member of
  some values from: https://w3id.org/euph/838
IAO_0000115: particular calendar day [...] represented by the calendar year [...] to which its calendar week [...] belongs, its calendar week of year [...] and its calendar day of week [...]
IAO_0000117: Michael Rubinigg
IAO_0000118: week date
id: EUPH:7412

Axiom
annotated source: week date
annotated property: IAO_0000115
annotated target: particular calendar day [...] represented by the calendar year [...] to which its calendar week [...] belongs, its calendar week of year [...] and its calendar day of week [...]
source: https://www.iso.org/standard/70907.html

wax scale
type: Class
subclass of: acellular anatomical structure
subclass of: Restriction
  on property: produced by
  some values from: wax gland
IAO_0000115: A wax scale is the final result of the wax biosynthetic process. It is produced by the wax glands on the ventral side of the abdomen of a worker bee. The excretions of the wax glands condense on the outer surface of the wax plates, where the wax hardens to form a pentagonoid shaped wax scale with rounded corners, a thickness of about 0.2-0.5 mm, a length of about 1.4 mm, a witdth of about 2.1 mm and a weight of about 1.1 mg.
IAO_0000117: Michael Rubinigg
IAO_0000118: Wachsschuppe @de
IAO_0000118: Wachsschüppchen @de
IAO_0000118: escama de cera @es
IAO_0000118: scaglia di cera @it
IAO_0000118: solz de ceară @ro
IAO_0000118: vaxfjäll @sv
IAO_0000118: voksskjell @no
IAO_0000118: voksskæl @da
IAO_0000118: wasschubje @nl
IAO_0000118: wax scale
IAO_0000118: écaille @fr
id: EUPH:7413

Axiom
annotated source: wax scale
annotated property: IAO_0000115
annotated target: A wax scale is the final result of the wax biosynthetic process. It is produced by the wax glands on the ventral side of the abdomen of a worker bee. The excretions of the wax glands condense on the outer surface of the wax plates, where the wax hardens to form a pentagonoid shaped wax scale with rounded corners, a thickness of about 0.2-0.5 mm, a length of about 1.4 mm, a witdth of about 2.1 mm and a weight of about 1.1 mg.
has db xref: 10.21608/jppp.2024.294704.1239
has db xref: ISBN:978-3-642-54328-9

GenBank
type: Class
subclass of: code set of biological entities
IAO_0000115: GenBank ® is the NIH genetic sequence database, an annotated collection of all publicly available DNA sequences (Nucleic Acids Research, 2013 Jan;41(D1):D36-42). GenBank is part of the International Nucleotide Sequence Database Collaboration, which comprises the DNA DataBank of Japan (DDBJ), the European Nucleotide Archive (ENA), and GenBank at NCBI. These three organizations exchange data on a daily basis.
IAO_0000117: Michael Rubinigg
IAO_0000118: GenBank
id: EUPH:7414

Axiom
annotated source: GenBank
annotated property: IAO_0000115
annotated target: GenBank ® is the NIH genetic sequence database, an annotated collection of all publicly available DNA sequences (Nucleic Acids Research, 2013 Jan;41(D1):D36-42). GenBank is part of the International Nucleotide Sequence Database Collaboration, which comprises the DNA DataBank of Japan (DDBJ), the European Nucleotide Archive (ENA), and GenBank at NCBI. These three organizations exchange data on a daily basis.
source: https://www.ncbi.nlm.nih.gov/genbank/

GenBank accession
type: Class
subclass of: identifier of biological entities
subclass of: Restriction
  on property: quality of
  some values from: GenBank
IAO_0000115: The unique identifier for a sequence record. An accession number applies to the complete record and is usually a combination of a letter(s) and numbers, such as a single letter followed by five digits (e.g., U12345) or two letters followed by six digits (e.g., AF123456). Some accessions might be longer, depending on the type of sequence record.
IAO_0000117: Michael Rubinigg
IAO_0000118: GenBank accession
id: EUPH:7415

Axiom
annotated source: GenBank accession
annotated property: IAO_0000115
annotated target: The unique identifier for a sequence record. An accession number applies to the complete record and is usually a combination of a letter(s) and numbers, such as a single letter followed by five digits (e.g., U12345) or two letters followed by six digits (e.g., AF123456). Some accessions might be longer, depending on the type of sequence record.
source: https://www.ncbi.nlm.nih.gov/genbank/samplerecord/#AccessionB

local time scale
type: Class
subclass of: time scale
IAO_0000115: locally-applicable time scale [...] such as standard time [...] or a non-UTC [...] based time scale
IAO_0000117: Michael Rubinigg
IAO_0000118: local time scale
id: EUPH:7416

Axiom
annotated source: local time scale
annotated property: IAO_0000115
annotated target: locally-applicable time scale [...] such as standard time [...] or a non-UTC [...] based time scale
source: https://www.iso.org/standard/70907.html

local time of day
type: Class
subclass of: time of day
IAO_0000115: time of day [...] in a local time scale [...]
IAO_0000117: Michael Rubinigg
IAO_0000118: local time of day
id: EUPH:7417

Axiom
annotated source: local time of day
annotated property: IAO_0000115
annotated target: time of day [...] in a local time scale [...]
source: https://www.iso.org/standard/70907.html

DWV-A
type: Class
subclass of: Deformed Wing Virus (DWV)
IAO_0000115: Variant A of Deformed Wing Virus (DWV) of honey bees (Apis mellifera L.).
IAO_0000117: Michael Rubinigg
IAO_0000118: DWV-A
IAO_0000118: Deformed Wing Virus A
IAO_0000118: Flügeldeformationsvirus Variante A @de
id: EUPH:7418

Axiom
annotated source: DWV-A
annotated property: IAO_0000115
annotated target: Variant A of Deformed Wing Virus (DWV) of honey bees (Apis mellifera L.).
has db xref: 10.1128/jvi.80.10.4998-5009.2006

DWV-B
type: Class
subclass of: Deformed Wing Virus (DWV)
IAO_0000115: Variant A of Deformed Wing Virus (DWV) of honey bees (Apis mellifera L.).
IAO_0000117: Michael Rubinigg
IAO_0000118: DWV-B
IAO_0000118: Deformed Wing Virus B
IAO_0000118: Flügeldeformationsvirus Variante B @de
id: EUPH:7419

Axiom
annotated source: DWV-B
annotated property: IAO_0000115
annotated target: Variant A of Deformed Wing Virus (DWV) of honey bees (Apis mellifera L.).
has db xref: 10.1099/vir.0.80470-0

non-SI unit
type: Class
subclass of: measurement unit
subclass of: Restriction
  on property: has quality
  some values from: https://w3id.org/euph/967
IAO_0000115: A base or derived unit of weight or measure that does not belong to and is not accepted for use by the decimal International System of Units (Systeme International d'Unites, SI).
IAO_0000117: Michael Rubinigg
IAO_0000118: non-SI unit
id: EUPH:742

DWV-C
type: Class
subclass of: Deformed Wing Virus (DWV)
IAO_0000115: Variant C of Deformed Wing Virus (DWV) of honey bees (Apis mellifera L.).
IAO_0000117: Michael Rubinigg
IAO_0000118: DWV-C
IAO_0000118: Deformed Wing Virus B
IAO_0000118: Flügeldeformationsvirus Variante C @de
id: EUPH:7420

Axiom
annotated source: DWV-C
annotated property: IAO_0000115
annotated target: Variant C of Deformed Wing Virus (DWV) of honey bees (Apis mellifera L.).
has db xref: 10.1038/ismej.2015.178

chemical substance
type: Class
subclass of: chemical entity
IAO_0000115: Matter of constant composition best characterized by the entities (molecules, formula units, atoms) it is composed of. Physical properties such as density, refractive index, electric conductivity, melting point etc. characterize the chemical substance.
IAO_0000117: Michael Rubinigg
IAO_0000118: Stoff @de
IAO_0000118: chemical substance
IAO_0000118: sostanza chimica @it
IAO_0000118: stof @nl
IAO_0000118: substance chimique @fr
id: EUPH:7421

Axiom
annotated source: chemical substance
annotated property: IAO_0000115
annotated target: Matter of constant composition best characterized by the entities (molecules, formula units, atoms) it is composed of. Physical properties such as density, refractive index, electric conductivity, melting point etc. characterize the chemical substance.
has db xref: 10.1351/goldbook.C01039

carbon dioxide
type: Class
subclass of: carbon oxide
IAO_0000115: The chemical substance carbon dioxide described by the following attributes or identifiers: Molecular formula: CO2 InChI: 1S/CO2/c2-1-3 SMILES: C(=O)=O CAS Registry Number: 14485-07-5 EC Number: 204-696-9
IAO_0000117: Michael Rubinigg
IAO_0000118: Kohlendioxid @de
IAO_0000118: Kohlensäure @de
IAO_0000118: acide carbonique @fr
IAO_0000118: anhídrido carbónico @es
IAO_0000118: anidride carbonica @it
IAO_0000118: anidrido carbónico @pt
IAO_0000118: bioxid de carbon @ro
IAO_0000118: carbon dioxide
IAO_0000118: diossido di carbonio @it
IAO_0000118: dioxyde de carbone @fr
IAO_0000118: dióxido de carbono @pt
IAO_0000118: karbondioksyd @no
IAO_0000118: koldioxid @sv
IAO_0000118: kolsyra @sv
IAO_0000118: kooldioxide @nl
IAO_0000118: koolzuur @nl
IAO_0000118: kullsyre @no
IAO_0000118: kulsyre @da
IAO_0000118: kultveilte @da
id: EUPH:7422
denoted by: 14485-07-5
denoted by: 1S/CO2/c2-1-3
denoted by: 204-696-9
denoted by: C(=O)=O
denoted by: CO2

Axiom
annotated source: carbon dioxide
annotated property: IAO_0000115
annotated target: The chemical substance carbon dioxide described by the following attributes or identifiers: Molecular formula: CO2 InChI: 1S/CO2/c2-1-3 SMILES: C(=O)=O CAS Registry Number: 14485-07-5 EC Number: 204-696-9
source: https://pubchem.ncbi.nlm.nih.gov/compound/Carbon-Dioxide

Axiom
annotated source: carbon dioxide
annotated property: denoted by
annotated target: 14485-07-5
has db xref: CAS registry number

Axiom
annotated source: carbon dioxide
annotated property: denoted by
annotated target: 1S/CO2/c2-1-3
has db xref: International Chemical Identifier (InChI)

Axiom
annotated source: carbon dioxide
annotated property: denoted by
annotated target: 204-696-9
has db xref: https://w3id.org/euph/8101

Axiom
annotated source: carbon dioxide
annotated property: denoted by
annotated target: C(=O)=O
has db xref: simplified molecular input line entry system (SMILES)

Axiom
annotated source: carbon dioxide
annotated property: denoted by
annotated target: CO2
has db xref: molecular formula

dew point
type: Class
subclass of: relative humidity
IAO_0000115: A measure of atmospheric moisture. It is the temperature to which air must be cooled in order to reach saturation (assuming air pressure and moisture content are constant). A higher dew point indicates more moisture present in the air. It is sometimes referred to as Dew Point Temperature, and sometimes written as one word (Dewpoint).
IAO_0000117: Michael Rubinigg
IAO_0000118: Taupunkt @de
IAO_0000118: dew point
IAO_0000118: dewpoint
id: EUPH:7423

Axiom
annotated source: dew point
annotated property: IAO_0000115
annotated target: A measure of atmospheric moisture. It is the temperature to which air must be cooled in order to reach saturation (assuming air pressure and moisture content are constant). A higher dew point indicates more moisture present in the air. It is sometimes referred to as Dew Point Temperature, and sometimes written as one word (Dewpoint).
source: https://forecast.weather.gov/glossary.php

subspecies
type: Class
subclass of: https://w3id.org/euph/7684
subclass of: Restriction
  on property: member of
  some values from: species
IAO_0000115: A biological-taxonomic rank under the species.
IAO_0000117: Michael Rubinigg
IAO_0000118: Unterart @de
IAO_0000118: sottospecie @it
IAO_0000118: sous-espèce @fr
IAO_0000118: subspecies
id: EUPH:7424

International Chemical Identifier (InChI)
type: Class
subclass of: chemical identifier
IAO_0000115: The IUPAC International Chemical Identifier (InChI) is a non-proprietary identifier for chemical substances that enables easier linking of diverse data compilations. It was initially developed under IUPAC Project 2000-025-1-800 during the period 2000-2004 and continues to be extended to new areas of chemistry and further developed. See more information on the IUPAC InChI Project webpage and further details on InChI Working Groups.
IAO_0000117: Michael Rubinigg
IAO_0000118: InChI
IAO_0000118: International Chemical Identifier
id: EUPH:7425

Axiom
annotated source: International Chemical Identifier (InChI)
annotated property: IAO_0000115
annotated target: The IUPAC International Chemical Identifier (InChI) is a non-proprietary identifier for chemical substances that enables easier linking of diverse data compilations. It was initially developed under IUPAC Project 2000-025-1-800 during the period 2000-2004 and continues to be extended to new areas of chemistry and further developed. See more information on the IUPAC InChI Project webpage and further details on InChI Working Groups.
source: https://www.inchi-trust.org/iupac/

simplified molecular input line entry system (SMILES)
type: Class
subclass of: chemical identifier
IAO_0000115: The Simplified Molecular Input Line Entry System (SMILES) is a specification in the form of a line notation for describing the structure of chemical species using short ASCII strings. SMILES strings can be imported by most molecule editors for conversion back into two-dimensional drawings or three-dimensional models of the molecules
IAO_0000117: Michael Rubinigg
IAO_0000118: SMILES
IAO_0000118: Simplified Molecular Input Line Entry System
id: EUPH:7426

Axiom
annotated source: simplified molecular input line entry system (SMILES)
annotated property: IAO_0000115
annotated target: The Simplified Molecular Input Line Entry System (SMILES) is a specification in the form of a line notation for describing the structure of chemical species using short ASCII strings. SMILES strings can be imported by most molecule editors for conversion back into two-dimensional drawings or three-dimensional models of the molecules
source: https://en.wikipedia.org/w/index.php

molecular formula
type: Class
subclass of: chemical identifier
IAO_0000115: For compounds consisting of discrete molecules, a formula according with the relative molecular mass (or the structure).
IAO_0000117: Michael Rubinigg
IAO_0000118: Summenformel @de
IAO_0000118: molecular formula
id: EUPH:7427

Axiom
annotated source: molecular formula
annotated property: IAO_0000115
annotated target: For compounds consisting of discrete molecules, a formula according with the relative molecular mass (or the structure).
has db xref: 10.1351/goldbook.M03987

district (AUT)
type: Class
subclass of: Statistic Austria
IAO_0000115: A district (German: Bezirk) is a second-level division of the executive arm of the Austrian government. District offices are the primary point of contact between residents and the state for most acts of government that exceed municipal purview: marriage licenses, driver licenses, passports, assembly permits, hunting permits, or dealings with public health officers for example all involve interaction with the district administrative authority (Bezirksverwaltungsbehörde).
IAO_0000117: Michael Rubinigg
IAO_0000118: Politischer Bezirk @de
IAO_0000118: district
id: EUPH:7428

Axiom
annotated source: district (AUT)
annotated property: IAO_0000115
annotated target: A district (German: Bezirk) is a second-level division of the executive arm of the Austrian government. District offices are the primary point of contact between residents and the state for most acts of government that exceed municipal purview: marriage licenses, driver licenses, passports, assembly permits, hunting permits, or dealings with public health officers for example all involve interaction with the district administrative authority (Bezirksverwaltungsbehörde).
source: https://en.wikipedia.org/w/index.php

trait of honey bees
type: Class
subclass of: disposition in beekeeping
subclass of: Restriction
  on property: disposition of
  some values from: honey bee colony
IAO_0000115: A trait of honey bees is a feature of a honey bee colony in which a beekeeper has an interest.
IAO_0000117: Michael Rubinigg
IAO_0000118: Merkmal @de
IAO_0000118: trait
id: EUPH:7430

Axiom
annotated source: trait of honey bees
annotated property: IAO_0000115
annotated target: A trait of honey bees is a feature of a honey bee colony in which a beekeeper has an interest.
has db xref: ISBN:0-632-03126-3
source: https://basic-formal-ontology.org/

defensive behavior of honey bees
type: Class
subclass of: https://w3id.org/euph/760
IAO_0000115: Defensive behavior in honey bees refers to the suite of behavioral responses that worker bees exhibit to protect their colony’s nest, brood, and stored resources from perceived threats such as predators, intruders, or disturbances.
IAO_0000117: Michael Rubinigg
IAO_0000118: Verteidigungsverhalten von Honigbienen @de
IAO_0000118: defensive behavior of honey bees
id: EUPH:7433

Axiom
annotated source: defensive behavior of honey bees
annotated property: IAO_0000115
annotated target: Defensive behavior in honey bees refers to the suite of behavioral responses that worker bees exhibit to protect their colony’s nest, brood, and stored resources from perceived threats such as predators, intruders, or disturbances.
has db xref: 10.1146/annurev.ento.49.061802.123155

suppressed mite reproduction (SMR) trait
type: Class
subclass of: disease resistance trait of honey bees
subclass of: Restriction
  on property: realised in
  some values from: Varroa population growth
IAO_0000115: Suppressed mite reproduction (SMR) is a heritable trait of the honey bee (Apis mellifera) that can control the parasitic mite, Varroa destructor.
IAO_0000117: Michael Rubinigg
IAO_0000118: SMR @de
IAO_0000118: suppressed mite reproduction
IAO_0000118: unterdrückte Milbenvermehrung @de
id: EUPH:7436

Axiom
annotated source: suppressed mite reproduction (SMR) trait
annotated property: IAO_0000115
annotated target: Suppressed mite reproduction (SMR) is a heritable trait of the honey bee (Apis mellifera) that can control the parasitic mite, Varroa destructor.
has db xref: 10.1080/00218839.2005.11101141

microplate
type: Class
subclass of: chemistry lab equipment
IAO_0000115: A microplate, also known as a microtiter plate, microwell plate or multiwell,[...] is a flat plate with multiple "wells" used as small test tubes. The microplate has become a standard tool in analytical research and clinical diagnostic testing laboratories.
IAO_0000117: Michael Rubinigg
IAO_0000118: Mikrotiterplatte @de
IAO_0000118: microplate
IAO_0000118: multititerplaat @nl
IAO_0000118: piastra per microtitolazione @it
IAO_0000118: plaque microtitre @fr
id: EUPH:7437

Axiom
annotated source: microplate
annotated property: IAO_0000115
annotated target: A microplate, also known as a microtiter plate, microwell plate or multiwell,[...] is a flat plate with multiple "wells" used as small test tubes. The microplate has become a standard tool in analytical research and clinical diagnostic testing laboratories.
source: https://en.wikipedia.org/w/index.php

microplate well
type: Class
subclass of: fiat object part in chemistry
subclass of: Restriction
  on property: part of
  some values from: microplate
IAO_0000115: A microplate well is part of a microplate where it is used as small test tube.
IAO_0000117: Michael Rubinigg
IAO_0000118: Mulde @de
IAO_0000118: Näpfchen @de
IAO_0000118: pozzetto @it
IAO_0000118: puit @fr
IAO_0000118: well
IAO_0000118: welletje @nl
id: EUPH:7438

Apis mellifera iberiensis
type: Class
subclass of: subspecies of Apis mellifera
IAO_0000115: The subspecies Apis mellifera iberiensis Engel, occurring in the Iberian Peninsula in Europe.
IAO_0000117: Michael Rubinigg
IAO_0000118: Apis mellifera iberiensis
IAO_0000118: Iberian Honey Bee
IAO_0000118: Iberische Biene @de
IAO_0000118: abeille espagnole @fr
IAO_0000118: abeille ibérique @fr
IAO_0000118: abeja española @es
IAO_0000118: abeja ibérica @es
id: EUPH:7439

capped cell
type: Class
subclass of: cell
subclass of: Restriction
  on property: produced by
  some values from: wax-making bee
IAO_0000115: A cell that has been closed with a wax capping by worker bees.
IAO_0000117: Michael Rubinigg
IAO_0000118: capped cell
IAO_0000118: verdeckelte Zelle @de
id: EUPH:744

M49 code
type: Class
subclass of: identifier of geographical enities
subclass of: Restriction
  on property: quality of
  some values from: geopolitical region
IAO_0000115: Three-digit numerical code of of the countries or areas or geographic regions in the M49 standard used for statistical processing purposes by the Statistics Division of the United Nations Secretariat.
IAO_0000117: Michael Rubinigg
IAO_0000118: M49 code
id: EUPH:7440

Axiom
annotated source: M49 code
annotated property: IAO_0000115
annotated target: Three-digit numerical code of of the countries or areas or geographic regions in the M49 standard used for statistical processing purposes by the Statistics Division of the United Nations Secretariat.
source: https://unstats.un.org/unsd/methodology/m49/

M49 area
type: Class
subclass of: identifier of geographical enities
subclass of: Restriction
  on property: quality of
  some values from: geopolitical region
IAO_0000115: Name of the countries or areas or geographic regions in the M49 standard used for statistical processing purposes by the Statistics Division of the United Nations Secretariat.
IAO_0000117: Michael Rubinigg
IAO_0000118: M49 area
id: EUPH:7441

Axiom
annotated source: M49 area
annotated property: IAO_0000115
annotated target: Name of the countries or areas or geographic regions in the M49 standard used for statistical processing purposes by the Statistics Division of the United Nations Secretariat.
source: https://unstats.un.org/unsd/methodology/m49/

trade
type: Class
subclass of: process in economics
IAO_0000115: Trade involves the transfer of goods and services from one person or entity to another, often in exchange for money.
IAO_0000117: Michael Rubinigg
IAO_0000118: Handel @de
IAO_0000118: commerce @fr
IAO_0000118: commercio @it
IAO_0000118: handel @nl
IAO_0000118: trade
id: EUPH:7442

Axiom
annotated source: trade
annotated property: IAO_0000115
annotated target: Trade involves the transfer of goods and services from one person or entity to another, often in exchange for money.
source: https://en.wikipedia.org/w/index.php

economic value
type: Class
subclass of: economical quantity
IAO_0000115: In economics, economic value is a measure of the benefit provided by a good or service to an economic agent [...]. Economic value is generally measured through units of currency, and the interpretation is therefore "what is the maximum amount of money a person is willing and able to pay for a good or service?”
IAO_0000117: Michael Rubinigg
IAO_0000118: Wert @de
IAO_0000118: economic value
IAO_0000118: valeur @fr
IAO_0000118: valore @it
IAO_0000118: waarde @nl
IAO_0000118: ökonomischer Wert @de
id: EUPH:7443

Axiom
annotated source: economic value
annotated property: IAO_0000115
annotated target: In economics, economic value is a measure of the benefit provided by a good or service to an economic agent [...]. Economic value is generally measured through units of currency, and the interpretation is therefore "what is the maximum amount of money a person is willing and able to pay for a good or service?”
source: https://en.wikipedia.org/w/index.php

import
type: Class
subclass of: trade
IAO_0000115: Import is part of the International Trade which involves buying and receiving of goods or services produced in another country.
IAO_0000117: Michael Rubinigg
IAO_0000118: Import @de
IAO_0000118: import
IAO_0000118: importation @fr
IAO_0000118: importazione @it
IAO_0000118: invoer @nl
id: EUPH:7444

Axiom
annotated source: import
annotated property: IAO_0000115
annotated target: Import is part of the International Trade which involves buying and receiving of goods or services produced in another country.
source: https://en.wikipedia.org/w/index.php

export
type: Class
subclass of: trade
IAO_0000115: An export in international trade is a good produced in one country that is sold into another country or a service provided in one country for a national or resident of another country.
IAO_0000117: Michael Rubinigg
IAO_0000118: Export @de
IAO_0000118: esportazione @it
IAO_0000118: export
IAO_0000118: exportation @fr
IAO_0000118: uitvoer @nl
id: EUPH:7445

Axiom
annotated source: export
annotated property: IAO_0000115
annotated target: An export in international trade is a good produced in one country that is sold into another country or a service provided in one country for a national or resident of another country.
source: https://en.wikipedia.org/w/index.php

harmonised classification of substances major groups
type: Class
subclass of: harmonised classification of substances
IAO_0000115: The highest level at which plant protection products are summarised in annex III of Regulation (EU) 2017/269 for statistical purposes in the EU.
IAO_0000117: Michael Rubinigg
IAO_0000118: Hauptgruppe @de
IAO_0000118: főcsoport @hu
IAO_0000118: galvenās grupas @lv
IAO_0000118: glavne grupe @hr
IAO_0000118: glavne skupine @sl
IAO_0000118: grands groupes @fr
IAO_0000118: grupo principal @es
IAO_0000118: grupos principais @pt
IAO_0000118: gruppi ewlenin @mt
IAO_0000118: gruppi principali @it
IAO_0000118: grupuri principale @ro
IAO_0000118: główne grupy @pl
IAO_0000118: hlavné skupiny @sk
IAO_0000118: hlavní skupiny @cs
IAO_0000118: hoofdcategorie @nl
IAO_0000118: hovedgrupper @da
IAO_0000118: huvudgrupper @sv
IAO_0000118: kύριες ομάδες @el
IAO_0000118: major group
IAO_0000118: oсновни групи @bg
IAO_0000118: pagrindinės grupės @lt
IAO_0000118: pääryhmät @fi
IAO_0000118: põhigrupid @et
id: EUPH:7446

Axiom
annotated source: harmonised classification of substances major groups
annotated property: IAO_0000115
annotated target: The highest level at which plant protection products are summarised in annex III of Regulation (EU) 2017/269 for statistical purposes in the EU.
source: https://eur-lex.europa.eu/eli/reg/2017/269/oj

harmonised classification of substances categories of products
type: Class
subclass of: harmonised classification of substances
IAO_0000115: The second highest level at which plant protection products are summarised in annex III of Regulation (EU) 2017/269 concerning statistics on pesticides in the EU.
IAO_0000117: Michael Rubinigg
IAO_0000118: Produktkategorien @de
IAO_0000118: categorias de produtos @pt
IAO_0000118: categorie di prodotti @it
IAO_0000118: categories of products
IAO_0000118: categorii de produse @ro
IAO_0000118: categoría de productos @es
IAO_0000118: catégories de produits @fr
IAO_0000118: kategorie produktów @pl
IAO_0000118: kategorie přípravků @cs
IAO_0000118: kategorije izdelkov @sl
IAO_0000118: kategorije proizvoda @hr
IAO_0000118: kategoriji ta' prodotti @mt
IAO_0000118: kategórie prípravkov @sk
IAO_0000118: kατηγορίες προϊόντων @el
IAO_0000118: middelencategorie @nl
IAO_0000118: produktkategorier @da
IAO_0000118: produktu kategorijas @lv
IAO_0000118: produktų kategorijos @lt
IAO_0000118: termékkategória @hu
IAO_0000118: tootekategooriad @et
IAO_0000118: tuoteluokat @fi
IAO_0000118: категории продукти @bg
id: EUPH:7447

Axiom
annotated source: harmonised classification of substances categories of products
annotated property: IAO_0000115
annotated target: The second highest level at which plant protection products are summarised in annex III of Regulation (EU) 2017/269 concerning statistics on pesticides in the EU.
source: https://eur-lex.europa.eu/eli/reg/2017/269/oj

harmonised classification of substances code
type: Class
subclass of: harmonised classification of substances
IAO_0000115: The code of the group of plant protection products for which figures have to be provided according to annex III of Regulation (EU) 2017/269 concerning statistics on pesticides in the EU.
IAO_0000117: Michael Rubinigg
IAO_0000118: Code @de
IAO_0000118: cod @ro
IAO_0000118: code
IAO_0000118: codice @it
IAO_0000118: código @es
IAO_0000118: kod @pl
IAO_0000118: kodas @lt
IAO_0000118: kode @da
IAO_0000118: kodiċi @mt
IAO_0000118: kods @lv
IAO_0000118: kood @et
IAO_0000118: koodi @fi
IAO_0000118: kód @cs
IAO_0000118: kωδικός @el
IAO_0000118: oznaka @hr
IAO_0000118: код @bg
id: EUPH:7448

Axiom
annotated source: harmonised classification of substances code
annotated property: IAO_0000115
annotated target: The code of the group of plant protection products for which figures have to be provided according to annex III of Regulation (EU) 2017/269 concerning statistics on pesticides in the EU.
source: https://eur-lex.europa.eu/eli/reg/2017/269/oj

harmonised classification of substances chemical class
type: Class
subclass of: harmonised classification of substances
IAO_0000115: The chemical class of plant protection products for which figures have to be provided according to annex III of Regulation (EU) 2017/269 concerning statistics on pesticides in the EU.
IAO_0000117: Michael Rubinigg
IAO_0000118: Chemikalienklasse @de
IAO_0000118: chemická skupina @cs
IAO_0000118: chemická trieda @sk
IAO_0000118: cheminė klasė @lt
IAO_0000118: chemische klasse @nl
IAO_0000118: clasificación química @es
IAO_0000118: classe chimica @it
IAO_0000118: classe química @pt
IAO_0000118: classes chimiques @fr
IAO_0000118: clasă chimică @ro
IAO_0000118: common nomenclature
IAO_0000118: keemiliste ainete klassid @et
IAO_0000118: kemiallinen luokka @fi
IAO_0000118: kemijski razred @hr
IAO_0000118: kemisk gruppe @da
IAO_0000118: kemisk klass @sv
IAO_0000118: klasa chemiczna @pl
IAO_0000118: klassi kimika @mt
IAO_0000118: kémiai osztály @hu
IAO_0000118: substances common names
IAO_0000118: xημική ομάδα @el
IAO_0000118: xимичен клас @bg
IAO_0000118: ķīmisko vielu klase @lv
id: EUPH:7449

Axiom
annotated source: harmonised classification of substances chemical class
annotated property: IAO_0000115
annotated target: The chemical class of plant protection products for which figures have to be provided according to annex III of Regulation (EU) 2017/269 concerning statistics on pesticides in the EU.
source: https://eur-lex.europa.eu/eli/reg/2017/269/oj

harmonised classification of substances substances common name
type: Class
subclass of: harmonised classification of substances
IAO_0000115: The common name of the group of plant protection products for which figures have to be provided according to annex III of Regulation (EU) 2017/269 concerning statistics on pesticides in the EU.
IAO_0000117: Michael Rubinigg
IAO_0000118: Stoffe — Freiname @de
IAO_0000118: aineiden yleisnimet @fi
IAO_0000118: ainete üldnimetus @et
IAO_0000118: anyag közhasználatú neve @hu
IAO_0000118: denominazione comune delle sostanze @it
IAO_0000118: denumiri comune ale substanțelor @ro
IAO_0000118: dénominations communes des substances @fr
IAO_0000118: ismijiet komuni ta' sustanzi @mt
IAO_0000118: látky – bežné názvy @sk
IAO_0000118: medžiagos bendriniai pavadinimai @lt
IAO_0000118: nazwy zwyczajowe substancji @pl
IAO_0000118: nomes comuns das substâncias @pt
IAO_0000118: obecné názvy látek @cs
IAO_0000118: splošna imena snovi @sl
IAO_0000118: stof gangbare naam @nl
IAO_0000118: stoffer (fællesnavne) @da
IAO_0000118: substances common names
IAO_0000118: sustancias (nombres comunes) @es
IAO_0000118: uobičajeni nazivi tvari @hr
IAO_0000118: vielas – vispārpieņemtie nosaukumi @lv
IAO_0000118: ämnen trivialnamn @sv
IAO_0000118: κοινές ονομασίες των ουσιών @el
IAO_0000118: вещества — общоприети наименования @bg
id: EUPH:7450

Axiom
annotated source: harmonised classification of substances substances common name
annotated property: IAO_0000115
annotated target: The common name of the group of plant protection products for which figures have to be provided according to annex III of Regulation (EU) 2017/269 concerning statistics on pesticides in the EU.
source: https://eur-lex.europa.eu/eli/reg/2017/269/oj

order
type: Class
subclass of: https://w3id.org/euph/7684
subclass of: Restriction
  on property: member of
  some values from: class
subclass of: Restriction
  on property: member of
  some values from: https://w3id.org/euph/7639
IAO_0000115: The full scientific name of the order in which the dwc:Taxon is classified.
IAO_0000117: Michael Rubinigg
IAO_0000118: Ordnung @de
IAO_0000118: orde @nl
IAO_0000118: order
IAO_0000118: ordine @it
IAO_0000118: ordre @fr
id: EUPH:7452

Axiom
annotated source: order
annotated property: IAO_0000115
annotated target: The full scientific name of the order in which the dwc:Taxon is classified.
has db xref: 10.1371/journal.pone.0029715

subgenus
type: Class
subclass of: https://w3id.org/euph/7684
subclass of: Restriction
  on property: member of
  some values from: genus
subclass of: Restriction
  on property: member of
  some values from: https://w3id.org/euph/7639
IAO_0000115: The full scientific name of the subgenus in which the dwc:Taxon is classified. Values should include the genus to avoid homonym confusion.
IAO_0000117: Michael Rubinigg
IAO_0000118: Untergattung @de
IAO_0000118: ondergeslacht @nl
IAO_0000118: sottogenere @it
IAO_0000118: sous-genre @fr
IAO_0000118: subg. @de
IAO_0000118: subgenus
id: EUPH:7453

Axiom
annotated source: subgenus
annotated property: IAO_0000115
annotated target: The full scientific name of the subgenus in which the dwc:Taxon is classified. Values should include the genus to avoid homonym confusion.
has db xref: 10.1371/journal.pone.0029715

kingdom
type: Class
subclass of: https://w3id.org/euph/7684
subclass of: Restriction
  on property: member of
  some values from: https://w3id.org/euph/7639
IAO_0000115: The full scientific name of the kingdom in which the dwc:Taxon is classified.
IAO_0000117: Michael Rubinigg
IAO_0000118: Reich @de
IAO_0000118: kingdom
IAO_0000118: regno @it
IAO_0000118: rijk @nl
IAO_0000118: règne @fr
id: EUPH:7454

Axiom
annotated source: kingdom
annotated property: IAO_0000115
annotated target: The full scientific name of the kingdom in which the dwc:Taxon is classified.
has db xref: 10.1371/journal.pone.0029715

phylum
type: Class
subclass of: https://w3id.org/euph/7684
subclass of: Restriction
  on property: member of
  some values from: kingdom
subclass of: Restriction
  on property: member of
  some values from: https://w3id.org/euph/7639
IAO_0000115: The full scientific name of the phylum or division in which the dwc:Taxon is classified.
IAO_0000117: Michael Rubinigg
IAO_0000118: Stamm @de
IAO_0000118: phylum
IAO_0000118: stam @nl
id: EUPH:7455

Axiom
annotated source: phylum
annotated property: IAO_0000115
annotated target: The full scientific name of the phylum or division in which the dwc:Taxon is classified.
has db xref: 10.1371/journal.pone.0029715

class
type: Class
subclass of: https://w3id.org/euph/7684
subclass of: Restriction
  on property: member of
  some values from: phylum
subclass of: Restriction
  on property: member of
  some values from: https://w3id.org/euph/7639
IAO_0000115: The full scientific name of the class in which the dwc:Taxon is classified.
IAO_0000117: Michael Rubinigg
IAO_0000118: Klasse @de
IAO_0000118: class
IAO_0000118: classe @fr
IAO_0000118: klasse @nl
id: EUPH:7456

Axiom
annotated source: class
annotated property: IAO_0000115
annotated target: The full scientific name of the class in which the dwc:Taxon is classified.
has db xref: 10.1371/journal.pone.0029715

superfamily
type: Class
subclass of: https://w3id.org/euph/7684
subclass of: Restriction
  on property: member of
  some values from: order
subclass of: Restriction
  on property: member of
  some values from: https://w3id.org/euph/7639
IAO_0000115: The full scientific name of the superfamily in which the dwc:Taxon is classified.
IAO_0000117: Michael Rubinigg
IAO_0000118: super-famille @fr
IAO_0000118: superfamiglia @it
IAO_0000118: superfamilie @nl
IAO_0000118: superfamily
IAO_0000118: Überfamilie @de
id: EUPH:7457

Axiom
annotated source: superfamily
annotated property: IAO_0000115
annotated target: The full scientific name of the superfamily in which the dwc:Taxon is classified.
has db xref: 10.1371/journal.pone.0029715

subfamily
type: Class
subclass of: https://w3id.org/euph/7684
subclass of: Restriction
  on property: member of
  some values from: family
subclass of: Restriction
  on property: member of
  some values from: https://w3id.org/euph/7639
IAO_0000115: The full scientific name of the subfamily in which the dwc:Taxon is classified.
IAO_0000117: Michael Rubinigg
IAO_0000118: Unterfamilie @de
IAO_0000118: onderfamilie @nl
IAO_0000118: sottofamiglia @it
IAO_0000118: sous-famille @fr
IAO_0000118: subfamilie @nl
IAO_0000118: subfamily
id: EUPH:7458

Axiom
annotated source: subfamily
annotated property: IAO_0000115
annotated target: The full scientific name of the subfamily in which the dwc:Taxon is classified.
has db xref: 10.1371/journal.pone.0029715

tribe
type: Class
subclass of: https://w3id.org/euph/7684
subclass of: Restriction
  on property: member of
  some values from: subfamily
subclass of: Restriction
  on property: member of
  some values from: https://w3id.org/euph/7639
IAO_0000115: The full scientific name of the tribe in which the dwc:Taxon is classified.
IAO_0000117: Michael Rubinigg
IAO_0000118: Tribus @de
IAO_0000118: tak @nl
IAO_0000118: tribe
IAO_0000118: tribu @fr
IAO_0000118: tribus @nl
IAO_0000118: tribù @it
id: EUPH:7459

Axiom
annotated source: tribe
annotated property: IAO_0000115
annotated target: The full scientific name of the tribe in which the dwc:Taxon is classified.
has db xref: 10.1371/journal.pone.0029715

subtribe
type: Class
subclass of: https://w3id.org/euph/7684
subclass of: Restriction
  on property: member of
  some values from: tribe
subclass of: Restriction
  on property: member of
  some values from: https://w3id.org/euph/7639
IAO_0000115: The full scientific name of the subtribe in which the dwc:Taxon is classified.
IAO_0000117: Michael Rubinigg
IAO_0000118: Unterstamm @de
IAO_0000118: ondertak @nl
IAO_0000118: sottotribù @it
IAO_0000118: subtribe
IAO_0000118: subtribus @nl
id: EUPH:7460

Axiom
annotated source: subtribe
annotated property: IAO_0000115
annotated target: The full scientific name of the subtribe in which the dwc:Taxon is classified.
has db xref: 10.1371/journal.pone.0029715

taxon ID
type: Class
subclass of: identifier of biological entities
subclass of: Restriction
  on property: member of
  some values from: https://w3id.org/euph/7639
subclass of: Restriction
  on property: quality of
  some values from: taxon
IAO_0000115: Any identifier for the set of taxon information.
IAO_0000117: Michael Rubinigg
IAO_0000118: taxon ID
IAO_0000118: taxon identifier
id: EUPH:7461

Axiom
annotated source: taxon ID
annotated property: IAO_0000115
annotated target: Any identifier for the set of taxon information.
has db xref: 10.1371/journal.pone.0029715